{"text_format":"1","workbook":"xlsx","n_sheets":13,"sheets":["Instructions","Project Information","Report","Rural Multilane Site Total","Multi-Year Summary","Multi-Year Analysis Report","Divided Segment Template","Undivided Segment Template","Intersection Template","Multi-Year Template","Segment Tables","Intersection Tables","Construction"],"not_rendered":{"charts":2,"images":2,"macros":1,"external_links":0,"defined_names":37,"comments":0,"pivot_tables":0},"unopened":[],"bounds":{"document_bytes":16777216,"sheet_cells":100000,"rows_first":2000,"rows_last":500,"rows_between":2000,"halvings":0,"cell_chars":16384,"cell_head_chars":4096},"cells_cut":0,"cells_raw":0,"read":"whole","date_system":"1900"}

{"sheet":"Instructions","index":0,"n_rows":40,"n_cols":4,"rows_kept":40,"cut":false,"hidden":false,"merged":[[38,2,38,14],[39,2,39,14],[30,2,30,14],[31,2,31,14],[32,2,32,14],[35,2,35,14],[36,2,36,14],[26,2,26,14],[27,2,27,14],[28,2,28,14],[29,2,29,14],[37,2,37,14],[1,2,1,14],[4,2,4,14],[23,2,23,14],[24,2,24,14],[25,2,25,14],[19,2,19,14]]}
[]
[null,null,"HSM Part C Training Tool Instructions"]
[]
[null,null,"Overview"]
[null,null,"This series of spreadsheets has been developed to assist in the application of the predictive methods contained in the Highway Safety Manual (HSM), 1st Edition for analyzing: urban and suburban arterials, rural multilane roads, and rural two lane roads.  "]
[]
{"$rows_left_out":35}
{"sheet":"Project Information","index":1,"n_rows":29,"n_cols":38,"rows_kept":29,"cut":false,"hidden":false,"merged":[[14,8,15,8],[16,0,16,8],[18,0,18,8],[0,0,0,8],[14,1,15,1],[14,2,15,2],[14,5,15,5],[14,6,15,6],[14,7,15,7],[12,4,15,4],[12,5,12,7],[13,0,15,0],[13,1,13,2],[13,3,15,3],[13,6,13,7],[6,1,6,2],[10,1,10,2],[11,1,11,2],[12,0,12,3],[0,11,0,22],[2,1,2,2],[3,1,3,2],[4,1,4,2],[5,1,5,2]]}
["PROJECT SAFETY PERFORMANCE ANALYSIS INPUT SHEET",null,null,null,null,null,null,null,null,null,null,"User Work Space"]
["General Information"]
["Project Name","Practical Case Study",null,"Contact Email",null,"email"]
["Project Description","Three Signalized Intersections",null,"Contact Phone",null,1234567891]
["Reference Number","STARS Report A-1",null,"Date Performed",null,"2011-05-12"]
["Analyst","John Smith",null,"Analysis Year",null,2011]
{"$rows_left_out":24}
{"sheet":"Report","index":2,"n_rows":35,"n_cols":14,"rows_kept":35,"cut":false,"hidden":false,"merged":[[0,13,0,23],[11,1,11,3],[11,4,11,6],[11,7,11,9],[0,0,0,9],[1,0,1,9],[2,1,2,9],[3,1,3,9],[4,1,4,9],[5,1,5,9],[6,1,6,9],[7,1,7,9],[8,1,8,9],[9,1,9,9],[10,0,10,9],[12,0,14,0],[12,1,12,3],[12,4,12,6],[12,7,12,9],[13,3,14,3],[13,6,14,6],[13,9,14,9],[21,0,22,9],[23,0,24,3],[23,4,23,5],[23,6,23,7],[23,8,23,9],[24,4,24,5],[24,6,24,7],[24,8,24,9],[25,0,25,3],[25,4,25,5],[25,6,25,7],[25,8,25,9],[26,0,26,3],[26,4,26,5],[26,6,26,7],[26,8,26,9],[34,0,34,9],[35,0,35,9],[27,0,27,3],[27,4,27,5],[27,6,27,7],[27,8,27,9],[32,0,32,9],[33,0,33,9]]}
["PROJECT SAFETY PERFORMANCE SUMMARY REPORT",null,null,null,null,null,null,null,null,null,null,null,null,"User Work Space"]
["General Information"]
["Project Name",{"$f":"'Project Information'!B3","v":"Practical Case Study"}]
["Project Description",{"$f":"'Project Information'!B4","v":"Three Signalized Intersections"}]
["Reference Number",{"$f":"'Project Information'!B5","v":"STARS Report A-1"}]
["Analyst",{"$f":"'Project Information'!B6","v":"John Smith"}]
{"$rows_left_out":30}
{"sheet":"Rural Multilane Site Total","index":3,"n_rows":29,"n_cols":15,"rows_kept":29,"cut":false,"hidden":true,"merged":[[2,14,2,20],[5,10,7,10],[5,9,10,9],[21,2,21,4],[2,1,3,11],[4,1,4,2],[8,11,10,11],[8,10,10,10],[5,11,7,11],[8,4,10,4],[8,5,10,5],[5,6,7,8],[8,8,10,8],[8,7,10,7],[8,6,10,6],[5,1,10,2],[15,1,15,2],[5,3,7,5],[8,3,10,3],[27,5,27,7],[26,5,26,7],[25,5,25,7],[24,5,24,7],[22,2,22,4],[19,2,20,10],[27,2,28,4],[25,2,26,4],[23,2,24,4],[23,5,23,7],[22,5,22,7],[21,5,21,7],[28,8,28,10],[27,8,27,10],[21,8,21,10],[28,5,28,7],[26,8,26,10],[25,8,25,10],[24,8,24,10],[23,8,23,10],[22,8,22,10]]}
[]
[]
[null,"Worksheet 3A -- Predicted and Observed Crashes by Severity and Site Type Using the Site-Specific EB Method",null,null,null,null,null,null,null,null,null,null,null,null,"User Work Space"]
[]
[null,"(1)",null,"(2)","(3)","(4)","(5)","(5)","(5)","(6)","(7)","(8)"]
[null,"Site type",null,"Predicted average crash frequency (crashes/year)",null,null,"Observed crashes (crashes/year)",null,null,"Overdispersion Parameter, k","Weighted adjustment, w","Expected average crash frequency, Nexpected"]
{"$rows_left_out":24}
{"sheet":"Multi-Year Summary","index":4,"n_rows":12,"n_cols":10,"rows_kept":12,"cut":false,"hidden":true,"merged":[[10,0,11,0],[10,1,10,3],[10,4,10,6],[10,7,10,9],[3,0,3,3],[4,0,4,1],[4,2,4,3],[5,0,5,1],[5,2,5,3],[6,0,6,1],[6,2,6,3]]}
["MULTIPLE-YEAR ANALYSIS SUMMARY FOR RURAL MULTILANE ROADS"]
[]
[]
["General Information"]
["Base Year"]
["Analysis Period (Years)"]
{"$rows_left_out":7}
{"sheet":"Multi-Year Analysis Report","index":5,"n_rows":35,"n_cols":13,"rows_kept":35,"cut":false,"hidden":true,"merged":[[33,0,33,8],[34,0,34,8],[27,0,27,3],[27,4,27,5],[27,6,27,7],[27,8,27,9],[31,0,31,8],[32,0,32,8],[25,0,25,3],[25,4,25,5],[25,6,25,7],[25,8,25,9],[26,0,26,3],[26,4,26,5],[26,6,26,7],[26,8,26,9],[23,4,23,5],[23,6,23,7],[23,8,23,9],[24,4,24,5],[24,6,24,7],[24,8,24,9],[12,1,12,9],[13,0,13,9],[15,0,15,9],[16,0,17,0],[16,1,16,3],[16,4,16,6],[16,7,16,9],[0,12,0,22],[11,1,11,9],[0,0,0,9],[1,0,1,9],[2,1,2,9],[3,1,3,9],[4,1,4,9],[5,1,5,9],[6,1,6,9],[7,1,7,9],[8,1,8,9],[9,1,9,9],[10,1,10,9]]}
["MULTIPLE YEAR PROJECT SAFETY PERFORMANCE SUMMARY REPORT FOR RURAL MULTILANE ROADS",null,null,null,null,null,null,null,null,null,null,null,"User Work Space"]
["General Information"]
["Project Name","Practical Case Study"]
["Project Description","Three Signalized Intersections"]
["Reference Number","STARS Report A-1"]
["Analyst","John Smith"]
{"$rows_left_out":30}
{"sheet":"Divided Segment Template","index":6,"n_rows":89,"n_cols":37,"rows_kept":89,"cut":false,"hidden":true,"merged":[[88,2,88,11],[0,16,0,21],[8,11,8,13],[7,11,7,13],[9,7,9,10],[8,7,8,10],[7,7,7,10],[3,0,3,1],[4,0,4,1],[18,7,18,10],[17,7,17,10],[16,7,16,10],[15,7,15,10],[14,7,14,10],[13,7,13,10],[12,7,12,10],[9,0,9,6],[18,0,18,6],[16,0,16,6],[17,0,17,6],[13,0,13,6],[15,0,15,6],[14,0,14,6],[11,7,11,10],[10,11,10,13],[9,11,9,13],[11,24,11,25],[16,24,18,28],[5,24,6,28],[7,24,8,25],[7,26,7,28],[14,24,14,25],[10,24,10,25],[15,24,15,25],[12,24,12,25],[9,24,9,25],[13,24,13,25],[17,11,17,13],[16,11,16,13],[15,11,15,13],[14,11,14,13],[13,11,13,13],[11,11,11,13],[10,14,10,15],[12,11,12,13],[18,11,18,13],[71,11,71,13],[72,0,72,2],[72,3,72,7],[74,0,74,2],[58,12,58,13],[62,0,62,1],[62,3,62,4],[62,6,62,7],[62,9,62,10],[62,12,62,13],[63,0,63,1],[63,3,63,4],[63,6,63,7],[63,9,63,10],[61,12,61,13],[59,0,59,1],[59,3,59,4],[59,6,59,7],[59,9,59,10],[59,12,59,13],[65,0,65,13],[60,0,60,1],[60,3,60,4],[60,6,60,7],[76,0,76,13],[68,0,68,13],[69,0,69,2],[69,3,69,7],[74,11,74,13],[72,11,72,13],[73,0,73,2],[73,3,73,7],[73,8,73,10],[74,8,74,10],[69,8,69,10],[69,11,69,13],[70,0,71,2],[70,3,70,7],[70,8,71,10],[70,11,70,13],[71,3,71,7],[72,8,72,10],[74,3,74,7],[73,11,73,13],[75,0,75,2],[75,3,75,7],[75,8,75,10],[75,11,75,13],[60,9,60,10],[60,12,60,13],[61,0,61,1],[61,3,61,4],[61,6,61,7],[61,9,61,10],[63,12,63,13],[64,0,64,1],[64,3,64,4],[64,6,64,7],[64,9,64,10],[64,12,64,13],[58,0,58,1],[58,3,58,4],[58,6,58,7],[58,9,58,10],[52,9,54,10],[57,0,57,1],[57,3,57,4],[57,6,57,7],[55,3,56,4],[55,5,56,5],[57,12,57,13],[52,0,56,1],[52,2,54,2],[52,3,54,4],[52,5,54,5],[55,11,56,11],[52,11,54,11],[52,12,54,13],[55,2,56,2],[55,6,56,7],[55,8,56,8],[55,9,56,10],[52,6,54,7],[52,8,54,8],[57,9,57,10],[55,12,56,13],[46,0,46,13],[50,0,50,13],[51,0,51,1],[51,3,51,4],[51,6,51,7],[51,9,51,10],[51,12,51,13],[45,12,45,13],[44,9,45,10],[44,11,45,11],[44,12,44,13],[44,0,45,1],[44,2,45,2],[44,3,45,3],[44,4,45,4],[44,5,45,6],[41,0,41,1],[41,5,41,6],[41,7,41,8],[41,9,41,10],[44,7,45,8],[43,0,43,1],[43,5,43,6],[43,7,43,8],[43,9,43,10],[42,0,42,1],[42,5,42,6],[42,7,42,8],[42,9,42,10],[38,0,40,1],[38,2,38,4],[38,5,39,6],[38,7,39,8],[38,9,38,10],[38,11,40,11],[39,2,39,4],[39,9,40,10],[40,5,40,6],[40,7,40,8],[36,0,36,13],[37,0,37,1],[37,2,37,4],[37,5,37,6],[37,7,37,8],[37,9,37,10],[32,7,32,8],[32,9,32,11],[32,12,32,13],[28,5,29,6],[28,7,29,8],[28,9,29,11],[28,12,29,13],[32,0,32,1],[32,2,32,4],[32,5,32,6],[31,0,31,1],[31,2,31,4],[31,5,31,6],[1,0,1,13],[2,0,2,6],[2,7,2,13],[4,7,4,9],[4,10,4,13],[3,7,3,9],[7,0,7,6],[3,10,3,13],[6,7,6,9],[6,10,6,13],[5,7,5,9],[5,10,5,13],[5,0,5,1],[6,0,6,1],[6,2,6,6],[5,2,5,6],[4,2,4,6],[3,2,3,6],[40,12,40,13],[38,12,39,13],[37,12,37,13],[10,0,10,3],[10,7,10,10],[8,0,8,6],[19,0,19,10],[12,0,12,6],[11,0,11,6],[30,12,30,13],[27,12,27,13],[31,7,31,8],[31,9,31,11],[31,12,31,13],[30,0,30,1],[30,2,30,4],[30,5,30,6],[30,7,30,8],[30,9,30,11],[27,7,27,8],[27,9,27,11],[27,0,27,1],[28,0,29,1],[28,2,29,4],[87,2,87,11],[20,14,24,14],[21,9,21,10],[20,9,20,10],[20,0,21,5],[80,2,81,11],[82,2,86,2],[82,3,82,5],[82,6,82,8],[82,9,82,11],[83,3,83,5],[83,6,83,8],[83,9,83,11],[84,5,85,5],[84,8,85,8],[84,11,85,11],[20,7,20,8],[21,7,21,8],[26,0,26,13],[43,12,43,13],[42,12,42,13],[41,12,41,13],[27,2,27,4],[27,5,27,6]]}
[null,null,null,null,null,null,null,null,null,null,null,null,null,null,null,null,"User Work Space"]
["Worksheet 1A (a) -- General Information and Input Data for Rural Multilane Roadway Segments"]
["General Information",null,null,null,null,null,null,"Location Information",null,null,null,null,null,null,null,null,null,null,null,null,null,null,null,null,"Tables Affiliated with CMFs for Specific Segment AADT values:"]
["Analyst",null,{"$f":"'Project Information'!B6","v":"John Smith"},null,null,null,null,"Roadway",null,null,{"$f":"VLOOKUP($C$7,'Project Information'!$A$17:$I$99,2,FALSE)","v":{"$error":"#N/A"}}]
["Agency or Company",null,{"$f":"'Project Information'!B7","v":"ABC Company"},null,null,null,null,"Roadway Section",null,null,{"$f":"VLOOKUP($C$7,'Project Information'!$A$17:$I$99,3,FALSE)","v":{"$error":"#N/A"}}]
["Date Performed",null,{"$f":"'Project Information'!F5","v":"2011-05-12"},null,null,null,null,"Jurisdiction",null,null,{"$f":"VLOOKUP($C$7,'Project Information'!$A$17:$I$99,4,FALSE)","v":{"$error":"#N/A"}},null,null,null,null,null,null,null,null,null,null,null,null,null,"Table 11-16: CMF for Lane Width on Divided Roadway Segments (CMFRA)"]
{"$rows_left_out":84}
{"sheet":"Undivided Segment Template","index":7,"n_rows":89,"n_cols":38,"rows_kept":89,"cut":false,"hidden":true,"merged":[[88,2,88,11],[0,16,0,21],[27,24,27,25],[28,24,29,28],[34,24,35,28],[38,24,38,25],[36,24,37,25],[36,26,36,28],[47,24,50,28],[45,24,45,25],[46,24,46,25],[43,24,43,25],[44,24,44,25],[41,24,41,25],[42,24,42,25],[12,24,13,28],[14,24,15,25],[14,26,14,28],[16,24,16,25],[17,24,17,25],[18,24,18,25],[25,24,25,25],[19,24,19,25],[26,24,26,25],[32,7,32,8],[32,0,32,1],[39,24,39,25],[38,0,40,1],[38,2,38,4],[38,5,39,6],[38,7,39,8],[31,12,31,13],[40,24,40,25],[37,12,37,13],[36,0,36,13],[37,0,37,1],[37,2,37,4],[37,5,37,6],[37,7,37,8],[32,12,32,13],[31,0,31,1],[31,2,31,4],[31,5,31,6],[31,7,31,8],[31,9,31,11],[32,5,32,6],[32,2,32,4],[40,12,40,13],[62,0,62,1],[62,3,62,4],[62,6,62,7],[62,9,62,10],[62,12,62,13],[60,0,60,1],[60,3,60,4],[60,6,60,7],[60,9,60,10],[60,12,60,13],[61,0,61,1],[61,3,61,4],[61,6,61,7],[61,9,61,10],[61,12,61,13],[76,0,76,13],[64,0,64,1],[64,3,64,4],[64,6,64,7],[64,9,64,10],[64,12,64,13],[65,0,65,13],[73,3,73,7],[73,8,73,10],[73,11,73,13],[75,0,75,2],[75,3,75,7],[69,3,69,7],[69,8,69,10],[69,11,69,13],[69,0,69,2],[68,0,68,13],[70,3,70,7],[63,0,63,1],[63,3,63,4],[63,6,63,7],[63,9,63,10],[63,12,63,13],[75,11,75,13],[70,11,70,13],[70,8,71,10],[58,0,58,1],[58,3,58,4],[58,6,58,7],[58,9,58,10],[58,12,58,13],[59,0,59,1],[59,3,59,4],[59,6,59,7],[59,9,59,10],[59,12,59,13],[75,8,75,10],[74,0,74,2],[74,3,74,7],[74,8,74,10],[74,11,74,13],[73,0,73,2],[55,12,56,13],[57,0,57,1],[57,3,57,4],[57,6,57,7],[57,9,57,10],[57,12,57,13],[52,9,54,10],[52,11,54,11],[52,12,54,13],[55,2,56,2],[55,3,56,4],[55,5,56,5],[55,6,56,7],[55,8,56,8],[55,9,56,10],[55,11,56,11],[52,0,56,1],[52,2,54,2],[52,3,54,4],[52,5,54,5],[52,6,54,7],[52,8,54,8],[51,0,51,1],[51,3,51,4],[51,6,51,7],[51,9,51,10],[51,12,51,13],[46,0,46,13],[44,3,45,3],[44,4,45,4],[45,12,45,13],[44,5,45,6],[44,7,45,8],[44,9,45,10],[50,0,50,13],[44,11,45,11],[44,12,44,13],[44,0,45,1],[44,2,45,2],[38,12,39,13],[41,12,41,13],[43,5,43,6],[41,7,41,8],[40,5,40,6],[40,7,40,8],[41,5,41,6],[42,5,42,6],[42,12,42,13],[27,12,27,13],[28,12,29,13],[28,9,29,11],[43,0,43,1],[42,7,42,8],[43,7,43,8],[41,9,41,10],[42,9,42,10],[43,9,43,10],[38,9,38,10],[38,11,40,11],[39,2,39,4],[39,9,40,10],[41,0,41,1],[42,0,42,1],[37,9,37,10],[32,9,32,11],[30,0,30,1],[43,12,43,13],[30,2,30,4],[30,9,30,11],[28,0,29,1],[28,2,29,4],[28,5,29,6],[16,0,16,6],[15,0,15,6],[18,11,18,13],[17,11,17,13],[16,11,16,13],[15,11,15,13],[18,7,18,10],[17,7,17,10],[16,7,16,10],[15,7,15,10],[28,7,29,8],[27,0,27,1],[27,2,27,4],[27,5,27,6],[27,7,27,8],[27,9,27,11],[26,0,26,13],[12,0,12,6],[13,0,13,6],[14,0,14,6],[14,11,14,13],[13,11,13,13],[12,11,12,13],[19,0,19,10],[20,0,21,5],[20,7,20,8],[20,9,20,10],[21,7,21,8],[21,9,21,10],[14,7,14,10],[13,7,13,10],[12,7,12,10],[18,0,18,6],[17,0,17,6],[1,0,1,13],[2,0,2,6],[2,7,2,13],[4,7,4,9],[4,10,4,13],[3,7,3,9],[3,10,3,13],[3,0,3,1],[3,2,3,6],[4,0,4,1],[4,2,4,6],[5,7,5,9],[5,10,5,13],[7,0,7,6],[8,0,8,6],[8,7,8,10],[7,7,7,10],[8,11,8,13],[7,11,7,13],[5,0,5,1],[5,2,5,6],[11,0,11,6],[9,0,9,6],[10,0,10,3],[9,7,9,10],[11,11,11,13],[10,11,10,13],[9,11,9,13],[6,7,6,9],[6,10,6,13],[6,0,6,1],[6,2,6,6],[11,7,11,10],[10,7,10,10],[10,14,10,15],[87,2,87,11],[20,14,24,14],[80,2,81,11],[82,2,86,2],[82,3,82,5],[82,6,82,8],[82,9,82,11],[83,3,83,5],[83,6,83,8],[83,9,83,11],[84,5,85,5],[84,8,85,8],[84,11,85,11],[30,12,30,13],[30,5,30,6],[30,7,30,8],[72,0,72,2],[72,3,72,7],[72,8,72,10],[72,11,72,13],[71,3,71,7],[71,11,71,13],[70,0,71,2]]}
[null,null,null,null,null,null,null,null,null,null,null,null,null,null,null,null,"User Work Space"]
["Worksheet 1A (b) -- General Information and Input Data for Rural Multilane Roadway Segments",null,null,null,null,null,null,null,null,null,null,null,null,null,null,null,null,null,null,null,null,null,null,null,"Calculations for the CMF for Shoulder Type and Widths"]
["General Information",null,null,null,null,null,null,"Location Information"]
["Analyst",null,{"$f":"'Project Information'!B6","v":"John Smith"},null,null,null,null,"Roadway",null,null,{"$f":"VLOOKUP($C$7,'Project Information'!$A$17:$I$99,2,FALSE)","v":{"$error":"#N/A"}},null,null,null,null,null,null,null,null,null,null,null,null,null,"Calculated Shoulder Width (CMFwrc) :",null,null,null,{"$f":"IF($H$11>2000,(VLOOKUP($H$13,$Y$39:$AC$47,5,FALSE)),IF($H$11<400,(VLOOKUP($H$13,$Y$39:$AC$47,3,FALSE)),(VLOOKUP($H$13,$Y$39:$AC$47,4))))","v":1.1000000000000001}]
["Agency or Company",null,{"$f":"'Project Information'!B7","v":"ABC Company"},null,null,null,null,"Roadway Section",null,null,{"$f":"VLOOKUP($C$7,'Project Information'!$A$17:$I$99,3,FALSE)","v":{"$error":"#N/A"}}]
["Date Performed",null,{"$f":"'Project Information'!F5","v":"2011-05-12"},null,null,null,null,"Jurisdiction",null,null,{"$f":"VLOOKUP($C$7,'Project Information'!$A$17:$I$99,4,FALSE)","v":{"$error":"#N/A"}},null,null,null,null,null,null,null,null,null,null,null,null,null,"Calculated Shoulder Type (CMF trc) :",null,null,null,{"$f":"IF($H$14=\"Paved\",(HLOOKUP($H$13,'Segment Tables'!$P$9:$Z$13,2,FALSE)),(IF($H$14=\"Gravel\",(HLOOKUP($H$13,'Segment Tables'!$P$9:$Z$13,3,FALSE)),(IF($H$14=\"Turf\",(HLOOKUP($H$13,'Segment Tables'!$P$9:$Z$13,5,FALSE)),HLOOKUP($H$13,'Segment Tables'!$P$9:$Z$13,4,FALSE))))))","v":1}]
{"$rows_left_out":84}
{"sheet":"Intersection Template","index":8,"n_rows":89,"n_cols":38,"rows_kept":89,"cut":false,"hidden":true,"merged":[[88,1,88,10],[0,15,0,20],[12,10,12,12],[13,6,13,9],[13,10,13,12],[14,6,14,9],[14,10,14,12],[15,6,15,9],[15,10,15,12],[16,0,16,5],[16,6,16,9],[16,10,16,12],[15,0,15,5],[12,0,12,5],[1,0,1,12],[2,0,2,5],[2,6,2,12],[6,6,6,8],[3,9,3,12],[8,0,8,5],[3,0,3,1],[3,2,3,5],[4,0,4,1],[4,2,4,5],[39,7,39,8],[39,5,39,6],[37,0,39,1],[37,5,38,6],[27,11,28,12],[29,5,29,6],[27,2,27,4],[28,2,29,4],[30,11,30,12],[29,11,29,12],[27,0,29,1],[30,2,30,4],[27,7,27,8],[37,2,37,4],[38,2,38,4],[30,5,30,6],[29,7,29,8],[30,7,30,8],[30,0,30,1],[27,9,27,10],[28,9,28,10],[29,9,29,10],[61,11,61,12],[61,6,61,7],[59,0,59,1],[59,11,59,12],[31,11,31,12],[37,11,38,12],[44,11,44,12],[41,11,41,12],[43,11,43,12],[35,0,35,12],[36,11,36,12],[31,0,31,1],[31,2,31,4],[32,0,32,12],[42,11,42,12],[41,5,41,6],[43,0,44,1],[43,2,44,2],[42,0,42,1],[40,7,40,8],[36,7,36,8],[31,5,31,6],[31,7,31,8],[31,9,31,10],[74,6,74,9],[50,8,52,8],[45,0,45,12],[62,0,62,1],[62,3,62,4],[60,11,60,12],[60,6,60,7],[59,3,59,4],[63,0,63,12],[73,2,73,5],[67,2,67,9],[69,2,70,5],[69,6,69,9],[70,6,70,9],[73,6,73,9],[72,2,72,5],[72,6,72,9],[68,2,68,5],[68,6,68,9],[60,0,60,1],[62,11,62,12],[62,6,62,7],[61,0,61,1],[61,3,61,4],[43,10,44,10],[38,9,39,9],[37,10,39,10],[40,5,40,6],[75,2,75,9],[43,5,44,6],[43,7,44,8],[57,6,57,7],[53,6,54,7],[53,8,54,8],[49,6,49,7],[50,5,52,5],[50,6,52,7],[53,5,54,5],[50,9,52,9],[60,3,60,4],[43,3,44,3],[43,4,44,4],[58,6,58,7],[59,6,59,7],[74,2,74,5],[71,2,71,5],[50,3,52,4],[71,6,71,9],[56,0,56,1],[56,3,56,4],[56,6,56,7],[56,11,56,12],[55,0,55,1],[55,3,55,4],[55,6,55,7],[55,11,55,12],[53,10,54,10],[53,11,54,12],[53,9,54,9],[58,0,58,1],[58,3,58,4],[57,0,57,1],[57,3,57,4],[50,0,54,1],[53,2,54,2],[53,3,54,4],[40,0,40,1],[36,0,36,1],[49,0,49,1],[49,3,49,4],[48,0,48,12],[36,5,36,6],[36,2,36,4],[57,11,57,12],[43,9,44,9],[39,11,39,12],[40,11,40,12],[58,11,58,12],[49,11,49,12],[50,10,52,10],[37,7,38,8],[50,11,52,12],[50,2,52,2],[30,9,30,10],[28,5,28,6],[28,7,28,8],[27,5,27,6],[26,9,26,10],[26,7,26,8],[26,0,26,1],[5,2,5,5],[6,0,6,1],[6,2,6,5],[5,0,5,1],[26,2,26,4],[3,6,3,8],[5,6,5,8],[4,6,4,8],[4,9,4,12],[6,9,6,12],[5,9,5,12],[9,0,9,5],[7,0,7,1],[7,2,7,5],[7,6,7,8],[7,9,7,12],[8,6,8,9],[8,10,8,12],[9,6,9,9],[9,10,9,12],[87,1,87,10],[18,13,22,13],[10,6,10,9],[18,0,19,4],[17,0,17,9],[19,6,19,7],[18,6,18,7],[19,8,19,9],[18,8,18,9],[11,0,11,2],[14,0,14,5],[13,0,13,5],[10,10,10,12],[11,6,11,9],[11,10,11,12],[12,6,12,9],[10,0,10,2],[25,0,25,12],[26,11,26,12],[42,5,42,6],[42,7,42,8],[41,7,41,8],[41,0,41,1],[26,5,26,6],[80,1,81,10],[82,1,86,1],[82,2,82,4],[82,5,82,7],[82,8,82,10],[83,2,83,4],[83,5,83,7],[83,8,83,10],[84,4,85,4],[84,7,85,7],[84,10,85,10]]}
[null,null,null,null,null,null,null,null,null,null,null,null,null,null,null,"User Work Space"]
["Worksheet 2A -- General Information and Input Data for Rural Multilane Highway Intersections"]
["General Information",null,null,null,null,null,"Location Information",null,null,null,null,null,null,null,null,null,null,null,null,null,null,null,null,null,null,null,null,0]
["Analyst",null,{"$f":"'Project Information'!$B$6","v":"John Smith"},null,null,null,"Roadway",null,null,{"$f":"VLOOKUP($C$7,'Project Information'!$A$17:$H$95,2,FALSE)","v":{"$error":"#N/A"}},null,null,null,null,null,null,null,null,null,null,null,null,null,null,null,null,null,"1"]
["Agency or Company",null,{"$f":"'Project Information'!$B$7","v":"ABC Company"},null,null,null,"Intersection",null,null,{"$f":"VLOOKUP($C$7,'Project Information'!$A$17:$H$95,3,FALSE)","v":{"$error":"#N/A"}},null,null,null,null,null,null,null,null,null,null,null,null,null,null,null,null,null,2]
["Date Performed",null,{"$f":"'Project Information'!$F$5","v":"2011-05-12"},null,null,null,"Jurisdiction",null,null,{"$f":"VLOOKUP($C$7,'Project Information'!$A$17:$H$95,4,FALSE)","v":{"$error":"#N/A"}},null,null,null,null,null,null,null,null,null,null,null,null,null,null,null,null,null,3]
{"$rows_left_out":84}
{"sheet":"Multi-Year Template","index":9,"n_rows":13,"n_cols":13,"rows_kept":13,"cut":false,"hidden":true,"merged":[[10,0,10,1],[10,2,10,4],[11,0,11,1],[11,2,11,4],[12,0,12,1],[12,2,12,4],[9,0,9,4],[4,0,4,1],[4,2,4,4],[4,5,4,6],[4,7,4,9],[5,0,5,1],[5,2,5,4],[5,5,5,6],[5,7,5,9],[6,0,6,1],[6,2,6,4],[6,5,6,6],[6,7,6,9],[7,0,7,1],[0,12,0,22],[0,0,1,9],[2,0,2,9],[3,0,3,1],[3,2,3,4],[3,5,3,6],[3,7,3,9]]}
["MULTIPLE-YEAR ANALYSIS FOR RURAL MULTILANE ROADS - INPUTS",null,null,null,null,null,null,null,null,null,null,null,"User Work Space"]
[]
["General Information"]
["Project Name",null,{"$f":"'Project Information'!B3","v":"Practical Case Study"},null,null,"Analyst",null,{"$f":"'Project Information'!B6","v":"John Smith"}]
["Project Description",null,{"$f":"'Project Information'!B4","v":"Three Signalized Intersections"},null,null,"Contact Email",null,{"$f":"'Project Information'!F3","v":"email"}]
["Reference Number",null,{"$f":"'Project Information'!B5","v":"STARS Report A-1"},null,null,"Contact Phone",null,{"$f":"'Project Information'!F4","v":1234567891}]
{"$rows_left_out":8}
{"sheet":"Segment Tables","index":10,"n_rows":57,"n_cols":31,"rows_kept":57,"cut":false,"hidden":true,"merged":[[48,1,49,11],[32,1,32,11],[31,1,31,3],[42,9,43,9],[42,10,43,11],[44,10,44,11],[39,8,41,9],[36,1,37,11],[38,1,39,3],[38,4,38,7],[44,6,44,7],[42,4,43,4],[42,5,43,5],[42,6,43,7],[40,1,40,2],[38,8,38,11],[39,4,41,5],[39,6,41,7],[39,10,41,11],[44,1,44,3],[41,1,43,3],[54,8,55,8],[54,9,55,9],[50,1,51,3],[50,4,50,7],[50,8,50,11],[51,4,53,5],[51,6,53,7],[51,8,53,9],[51,10,53,11],[52,1,52,2],[12,30,12,32],[13,30,13,32],[17,30,17,32],[14,30,14,32],[15,30,15,32],[16,30,16,32],[56,1,56,3],[56,6,56,7],[54,10,55,11],[56,10,56,11],[12,28,12,29],[18,28,18,29],[19,28,19,29],[42,8,43,8],[14,28,14,29],[53,1,55,3],[19,14,20,19],[13,28,13,29],[54,4,55,4],[54,5,55,5],[54,6,55,7],[34,28,34,29],[16,28,16,29],[17,28,17,29],[36,30,36,31],[37,28,37,29],[37,30,37,31],[32,30,32,31],[33,28,33,29],[33,30,33,31],[34,30,34,31],[35,28,35,29],[35,30,35,31],[36,28,36,29],[32,28,32,29],[18,30,18,32],[19,30,19,32],[30,28,30,29],[30,30,30,31],[28,1,28,3],[30,1,30,3],[29,1,29,3],[23,7,24,7],[31,30,31,31],[28,30,28,31],[29,28,29,29],[29,30,29,31],[23,8,24,8],[23,9,24,9],[23,10,24,10],[23,6,24,6],[23,1,23,2],[23,5,24,5],[25,1,25,3],[22,4,22,7],[22,8,22,11],[21,1,22,3],[24,28,26,31],[28,28,28,29],[15,28,15,29],[11,28,11,29],[31,28,31,29],[13,14,14,25],[5,14,6,25],[7,14,8,14],[7,15,7,25],[11,1,11,3],[10,1,10,3],[10,28,10,29],[9,28,9,29],[5,28,6,32],[15,1,15,11],[14,1,14,3],[7,28,8,29],[9,30,9,32],[10,30,10,32],[11,30,11,32],[7,30,8,32],[23,4,24,4],[23,11,24,11],[27,28,27,29],[27,30,27,31],[27,1,27,3],[26,1,26,3],[6,9,7,9],[6,10,7,10],[19,1,20,11],[24,1,24,3],[6,11,7,11],[6,7,7,7],[8,1,8,3],[7,1,7,3],[6,1,6,2],[4,1,5,3],[6,8,7,8],[2,1,3,11],[4,4,4,11],[5,8,5,11],[5,4,5,7],[6,4,7,4],[21,4,21,11],[6,5,7,5],[12,1,12,3],[9,1,9,3],[13,1,13,3],[6,6,7,6]]}
[null,"Tables Affiliated with Crash Statistics:",null,null,null,null,null,null,null,null,null,null,null,null,"Tables Affiliated with Crash Modification Factors:"]
[]
[null,"Table 11-4: Distribution of Crashes by Collision Type and Crash Severity Level for Undivided Roadway Segments"]
[]
[null,"Collision type",null,null,"Proportion of crashes by collision type and crash severity level"]
[null,null,null,null,"HSM-Provided Values",null,null,null,"Locally-Derived Values",null,null,null,null,null,"Table 11-13: CMF for Collision Types Related to Shoulder Types and Shoulder Widths (CMFTRA)",null,null,null,null,null,null,null,null,null,null,null,null,null,"Table 11-17: CMF for Right Shoulder Width on Divided Roadway Segments (CMF2rd)"]
{"$rows_left_out":52}
{"sheet":"Intersection Tables","index":11,"n_rows":45,"n_cols":12,"rows_kept":45,"cut":false,"hidden":true,"merged":[[20,1,20,3],[44,1,44,3],[44,6,44,7],[44,10,44,11],[41,10,42,11],[43,1,43,3],[43,6,43,7],[41,6,42,7],[41,8,42,8],[41,9,42,9],[41,4,42,4],[41,5,42,5],[43,10,43,11],[40,1,42,3],[38,10,40,11],[38,8,40,9],[39,1,39,2],[21,1,21,3],[2,1,3,11],[22,1,22,3],[23,1,23,3],[8,1,8,11],[4,1,5,3],[6,4,7,4],[6,5,7,5],[4,4,4,11],[5,4,5,7],[5,8,5,11],[6,10,7,10],[6,11,7,11],[13,1,13,3],[14,1,14,3],[32,1,32,11],[30,1,30,3],[31,1,31,3],[18,1,18,3],[37,1,38,3],[37,4,37,7],[37,8,37,11],[38,4,40,5],[35,1,36,11],[38,6,40,7],[24,1,24,11],[25,1,25,3],[26,1,26,3],[27,1,27,3],[28,1,28,3],[29,1,29,3],[11,1,11,3],[6,6,7,6],[6,7,7,7],[6,1,6,2],[19,1,19,3],[12,1,12,3],[16,1,16,11],[17,1,17,3],[15,1,15,3],[6,8,7,8],[6,9,7,9],[7,1,7,3],[9,1,9,3],[10,1,10,3]]}
[null,"Tables Affiliated with Crash Statistics:"]
[]
[null,"Table 11-9: Distribution of Intersection Crashes by Collision Type and Crash Severity"]
[]
[null,"Collision type",null,null,"Proportion of crashes by collision type and crash severity level"]
[null,null,null,null,"HSM-Provided Values",null,null,null,"Locally-Derived Values"]
{"$rows_left_out":40}
{"sheet":"Construction","index":12,"n_rows":47,"n_cols":16,"rows_kept":47,"cut":false,"hidden":true,"merged":[]}
[]
[]
[null,"Lane Width",null,"Shoulder Width",null,"RHR"]
[null,9,null,0,null,1]
[null,9.5,null,1,null,2]
[null,10,null,2,null,3]
{"$rows_left_out":41}