{"text_format":"1","workbook":"xlsx","n_sheets":22,"sheets":["JMF SUBMITTAL INSTRUCTIONS","JMF SUBMITTAL FORM","JMF INPUT SHEET","STATUS LETTER","OPTIMIZED GRADATION TOOLS","Tarantula Paving Details","Tarantula Structural Details","Gradation Limits","Gradation Interp. Vals & % Pass","LOOKUP TABLES","RM_NAME_CODE","AGG S.G. REPORT","AGG MATL CD LIST","AGG PRODR LIST","AGG PROD LIST","AGG MATL LIST","Cm MATL LIST","ADMIX PRODUCER LIST","ADMIX PRODUCT LIST","MACROFIBER PRODUCER","MACROFIBER PRODUCT LIST","ADMIX PS LIST"],"not_rendered":{"charts":5,"images":10,"macros":1,"external_links":0,"defined_names":36,"comments":0,"pivot_tables":0},"unopened":[],"bounds":{"document_bytes":16777216,"sheet_cells":100000,"rows_first":2000,"rows_last":500,"rows_between":2000,"halvings":0,"cell_chars":16384,"cell_head_chars":4096},"cells_cut":0,"cells_raw":0,"read":"whole","date_system":"1900"}

{"sheet":"JMF SUBMITTAL INSTRUCTIONS","index":0,"n_rows":83,"n_cols":16,"rows_kept":83,"cut":false,"hidden":false,"merged":[[0,15,0,20],[2,15,2,21],[4,15,4,21],[6,15,6,20],[82,1,82,4]]}
[null,null,null,null,null,null,null,null,null,null,null,null,null,null,null,"ODOT Specification & Website Links:"]
[]
[null,null,null,null,null,null,null,null,null,null,null,null,null,null,null,"Construction and Material Specifications"]
[]
[null,null,null,null,null,null,null,null,null,null,null,null,null,null,null,"​​​​Proposal Notes, Supplemental Specifications, and Supplements"]
[]
[null,null,null,null,null,null,null,null,null,null,null,null,null,null,null,"Construction Management Reporting System (CMRS)"]
[]
[]
[]
[]
[]
[]
[]
[]
[]
[]
[]
[]
[]
[]
[]
[]
[]
[]
[]
[]
[]
[]
[]
[]
[]
[]
[]
[]
[]
[]
[]
[]
[]
[]
[]
[]
[]
[]
[]
[]
[]
[]
[]
[]
[]
[]
[]
[]
[]
[]
[]
[]
[]
[]
[]
[]
[]
[]
[]
[]
[]
[]
[]
[]
[]
[]
[]
[]
[]
[]
[]
[]
[]
[]
[]
[null,"DOT.CEN.PCCJMF@dot.ohio.gov"]

{"sheet":"JMF SUBMITTAL FORM","index":1,"n_rows":189,"n_cols":60,"rows_kept":189,"cut":false,"hidden":false,"merged":[[168,17,168,19],[126,19,126,21],[160,41,160,42],[158,30,158,40],[158,41,158,42],[148,2,148,7],[148,9,148,11],[148,14,148,16],[148,19,148,21],[166,41,166,42],[142,42,142,44],[126,2,126,7],[128,2,128,7],[132,2,132,7],[154,5,154,7],[156,5,156,7],[168,11,168,13],[164,11,164,13],[164,5,164,7],[166,5,166,7],[134,33,134,39],[132,19,132,21],[162,39,162,41],[142,9,142,11],[142,14,142,16],[142,19,142,21],[142,33,142,39],[144,9,144,11],[144,14,144,16],[144,19,144,21],[144,33,144,39],[148,33,148,39],[162,17,162,19],[144,42,144,44],[146,9,146,11],[136,33,136,39],[146,14,146,16],[126,33,126,39],[128,33,128,39],[132,33,132,39],[128,19,128,21],[134,19,134,21],[138,33,138,39],[140,33,140,39],[146,42,146,44],[132,9,132,11],[128,9,128,11],[112,32,134,32],[122,42,122,44],[124,19,124,21],[124,33,124,39],[116,19,116,21],[120,19,120,21],[122,19,122,21],[112,14,112,16],[114,14,114,16],[112,9,112,11],[148,42,148,44],[144,2,144,7],[146,2,146,7],[152,11,152,13],[164,43,164,48],[156,41,156,43],[118,33,118,39],[120,33,120,39],[122,33,122,39],[138,9,138,11],[138,14,138,16],[138,19,138,21],[140,9,140,11],[140,14,140,16],[140,19,140,21],[150,0,150,49],[122,2,122,7],[132,14,132,16],[138,2,138,7],[160,17,160,19],[134,14,134,16],[156,27,156,29],[146,19,146,21],[146,33,146,39],[136,2,136,7],[136,9,136,11],[126,9,126,11],[116,33,116,39],[166,44,166,47],[160,30,160,40],[140,2,140,7],[156,45,156,48],[158,45,158,48],[160,45,160,48],[118,14,118,16],[158,27,158,29],[160,27,160,29],[156,22,156,26],[158,23,158,26],[160,22,160,26],[152,24,152,29],[152,17,152,19],[136,14,136,16],[136,19,136,21],[154,45,154,48],[154,17,154,19],[154,41,154,43],[142,2,142,7],[101,29,101,31],[103,29,103,31],[110,2,110,7],[103,3,103,5],[101,3,101,5],[100,22,100,25],[95,10,95,12],[94,3,94,14],[103,33,103,40],[107,24,107,29],[110,9,110,11],[103,20,103,21],[105,0,105,49],[99,42,99,45],[99,33,99,40],[99,29,99,31],[103,42,103,45],[101,33,101,40],[97,33,97,40],[99,26,99,27],[97,29,97,31],[95,33,95,40],[97,42,97,45],[101,10,101,12],[124,14,124,16],[112,19,112,21],[114,19,114,21],[75,3,75,11],[73,45,73,47],[68,39,68,43],[68,44,68,48],[71,45,71,47],[101,26,101,27],[98,22,98,25],[99,20,99,21],[101,20,101,21],[84,18,85,20],[84,39,84,43],[84,44,84,48],[85,3,85,11],[85,22,85,37],[85,40,85,44],[97,26,97,27],[112,33,112,39],[69,3,69,11],[75,45,75,47],[73,3,73,11],[73,40,73,44],[87,0,87,2],[87,3,87,11],[87,13,87,16],[87,18,87,20],[87,22,87,37],[116,2,116,7],[118,2,118,7],[134,2,134,7],[134,9,134,11],[112,2,112,7],[124,2,124,7],[128,14,128,16],[114,9,114,11],[130,2,130,7],[130,9,130,11],[130,14,130,16],[116,14,116,16],[120,2,120,7],[124,9,124,11],[114,2,114,7],[130,19,130,21],[130,33,130,39],[114,33,114,39],[122,9,122,11],[120,14,120,16],[118,42,118,44],[116,42,116,44],[107,13,108,17],[107,31,108,40],[107,8,108,12],[107,18,108,22],[118,19,118,21],[110,32,110,39],[120,42,120,44],[114,42,114,44],[112,42,112,44],[110,42,110,44],[110,19,110,21],[83,1,83,17],[85,45,85,47],[87,45,87,47],[65,9,65,13],[65,14,65,15],[65,17,65,29],[65,39,65,44],[97,20,97,21],[84,12,85,17],[65,2,65,5],[75,40,75,44],[71,13,71,16],[75,22,75,37],[73,22,73,37],[71,22,71,37],[69,22,69,37],[68,18,69,20],[71,18,71,20],[73,18,73,20],[75,18,75,20],[71,40,71,44],[64,30,66,32],[71,0,71,2],[94,29,94,45],[29,43,29,47],[22,29,22,31],[65,45,65,47],[62,1,62,17],[95,42,95,45],[99,3,99,5],[118,9,118,11],[116,9,116,11],[110,14,110,16],[24,42,24,43],[24,44,24,46],[24,0,24,8],[24,9,24,16],[26,16,26,26],[22,26,22,28],[22,12,22,25],[34,39,34,46],[33,0,33,49],[26,7,26,10],[26,12,26,15],[26,28,26,31],[47,1,47,13],[58,43,58,44],[94,16,94,28],[11,39,11,48],[11,1,11,6],[13,1,13,6],[15,1,15,6],[20,42,20,44],[20,29,20,31],[20,40,20,41],[20,45,20,46],[11,7,11,28],[15,7,15,28],[13,7,13,28],[17,0,17,49],[11,32,11,38],[20,21,20,25],[20,7,20,12],[18,0,18,49],[20,26,20,28],[20,47,20,48],[20,32,20,33],[13,30,13,42],[15,30,15,42],[15,43,15,48],[13,43,13,48],[19,1,19,48],[36,39,36,43],[41,48,41,49],[35,0,35,49],[45,45,45,47],[30,42,31,48],[39,45,39,47],[43,42,43,43],[43,0,43,2],[45,39,45,40],[43,39,43,40],[39,22,39,37],[41,22,41,37],[39,42,39,43],[45,48,45,49],[36,44,36,45],[45,0,45,2],[41,42,41,43],[41,0,41,2],[34,47,34,49],[37,44,37,48],[43,48,43,49],[41,3,41,12],[39,3,39,12],[183,31,183,37],[183,38,183,40],[164,30,164,33],[154,11,154,13],[162,11,162,13],[164,39,164,41],[37,42,37,43],[0,0,0,49],[9,0,9,49],[2,7,2,31],[4,7,4,31],[6,7,6,31],[6,43,6,48],[4,43,4,48],[2,43,2,48],[2,33,2,42],[4,33,4,42],[6,33,6,42],[2,1,2,6],[3,1,3,6],[4,1,4,6],[6,1,6,6],[8,0,8,49],[22,7,22,10],[177,31,177,42],[179,31,179,42],[151,0,171,1],[168,5,168,7],[170,17,170,19],[166,11,166,13],[162,5,162,7],[152,41,152,43],[158,17,158,19],[158,5,158,7],[158,11,158,13],[160,5,160,7],[160,11,160,13],[154,30,154,40],[152,30,152,40],[154,23,154,29],[152,5,152,7],[162,30,162,33],[156,30,156,40],[156,11,156,13],[156,17,156,19],[168,41,168,42],[164,17,164,19],[166,17,166,19],[77,13,77,16],[75,13,75,16],[94,0,104,1],[103,10,103,12],[170,11,170,13],[170,5,170,7],[172,0,172,49],[175,31,175,42],[173,31,173,42],[77,0,77,2],[79,0,79,2],[95,5,95,9],[77,3,77,11],[79,3,79,11],[93,0,93,49],[79,18,79,20],[101,42,101,45],[77,22,77,37],[77,45,77,47],[79,40,79,44],[79,45,79,47],[77,40,77,44],[79,22,79,37],[77,18,77,20],[62,45,62,47],[63,41,63,44],[63,45,63,47],[63,27,63,29],[168,29,168,40],[60,0,60,2],[60,3,60,11],[58,3,58,11],[60,39,60,40],[58,0,58,2],[97,3,97,5],[103,6,103,8],[101,6,101,8],[99,6,99,8],[97,6,97,8],[106,0,138,1],[120,9,120,11],[109,40,134,41],[126,14,126,16],[122,14,122,16],[75,0,75,2],[89,1,89,13],[68,12,69,17],[79,13,79,16],[60,13,60,16],[58,13,58,16],[56,13,56,16],[54,13,54,16],[73,13,73,16],[73,0,73,2],[71,3,71,11],[67,1,67,13],[62,39,62,44],[56,43,56,44],[69,40,69,44],[65,6,65,7],[54,39,54,40],[63,21,63,26],[63,2,63,13],[63,52,63,53],[39,48,39,49],[36,46,36,47],[39,14,39,16],[41,14,41,16],[43,14,43,16],[45,14,45,16],[45,42,45,43],[47,39,47,44],[43,22,43,37],[45,22,45,37],[37,22,37,37],[58,39,58,40],[48,0,48,49],[47,48,47,49],[52,3,52,11],[49,1,49,15],[52,39,52,40],[54,0,54,2],[56,0,56,2],[56,3,56,11],[54,3,54,11],[54,45,54,47],[56,39,56,40],[58,45,58,47],[56,45,56,47],[54,43,54,44],[39,39,39,40],[41,39,41,40],[52,44,52,48],[28,0,28,49],[51,12,52,17],[50,1,50,49],[39,0,39,2],[34,0,34,15],[37,39,37,40],[37,0,37,2],[43,45,43,47],[41,45,41,47],[37,3,37,12],[36,1,36,12],[36,13,37,17],[36,18,37,20],[38,0,38,49],[45,3,45,12],[43,3,43,12],[47,14,47,16],[47,45,47,47],[22,1,22,6],[20,1,20,6],[22,32,22,39],[23,0,23,49],[24,22,24,29],[24,30,24,32],[24,33,24,40],[26,32,26,48],[26,1,26,6],[21,1,21,48],[188,0,188,49],[195,0,195,49],[60,43,60,44],[60,45,60,47],[39,18,39,20],[41,18,41,20],[43,18,43,20],[45,18,45,20],[60,22,60,37],[58,22,58,37],[56,22,56,37],[54,22,54,37],[52,22,52,37],[51,18,52,20],[60,18,60,20],[58,18,58,20],[56,18,56,20],[54,18,54,20],[173,0,184,1],[173,2,184,27],[173,28,184,29],[175,44,177,48],[181,44,183,48],[166,29,166,40]]}
["CONCRETE PRODUCER INFORMATION"]
[]
[null,"Company Name",null,null,null,null,null,null,null,null,null,null,null,null,null,null,null,null,null,null,null,null,null,null,null,null,null,null,null,null,null,null,null,"Source ID",null,null,null,null,null,null,null,null,null,{"$f":"IF(ISBLANK(H3),\" \",VLOOKUP(H3,RM_NAME_CODE!A:B,2,0))","v":" "}]
[]
[null,"Rep Name",null,null,null,null,null,null,null,null,null,null,null,null,null,null,null,null,null,null,null,null,null,null,null,null,null,null,null,null,null,null,null,"Plant Phone"]
[]
[null,"Email address",null,null,null,null,null,null,null,null,null,null,null,null,null,null,null,null,null,null,null,null,null,null,null,null,null,null,null,null,null,null,null,"Cell Phone"]
[]
[]
["TESTING LABORATORY INFORMATION"]
[]
[null,"Lab Name",null,null,null,null,null,null,null,null,null,null,null,null,null,null,null,null,null,null,null,null,null,null,null,null,null,null,null,null,null,null,"Location  "]
[]
[null,"Lab Rep",null,null,null,null,null,null,null,null,null,null,null,null,null,null,null,null,null,null,null,null,null,null,null,null,null,null,null,null,"Phone"]
[]
[null,"Email Address",null,null,null,null,null,null,null,null,null,null,null,null,null,null,null,null,null,null,null,null,null,null,null,null,null,null,null,null,"AASTHO/AMRL Certified"]
[]
[]
["CONCRETE CLASS AND PERFORMANCE REQUIREMENTS"]
[null,{"$f":"IF(H23=\"215QCFS\",'LOOKUP TABLES'!O14,IF(H23=\"215RRCM\",'LOOKUP TABLES'!O15,\"\"))","v":""}]
[null,"Class",null,null,null,null,null,null,null,null,null,null,null,null,null,null,null,null,null,null,null,"Design Strength",null,null,null,null,{"$f":"IF(ISBLANK(H21),\" \",VLOOKUP(H21,'LOOKUP TABLES'!B4:I20,3,0))","v":" "},null,null,null,null,null,"psi",null,null,null,null,null,null,null,"Age",null,{"$f":"IF(ISBLANK($H$21),\" \",VLOOKUP($H$21,'LOOKUP TABLES'!$B$4:$I$20,4,0))","v":" "},null,null,null,null,"DAYS"]
[]
[null,"Material Code",null,null,null,null,null,{"$f":"IF(ISBLANK(H21),\" \",VLOOKUP(H21,'LOOKUP TABLES'!B4:I20,2,0))","v":" "},null,null,null,null,"Permeability ",null,null,null,null,null,null,null,null,null,null,null,null,null,{"$f":"IF(ISBLANK($H$21),\" \",VLOOKUP($H$21,'LOOKUP TABLES'!$B$4:$I$20,5,0))","v":" "},null,null,null,null,null,"coulombs"]
[]
["Gradation Requirement: ",null,null,null,null,null,null,null,null,{"$f":"IF(ISBLANK($H$21),\" \",VLOOKUP($H$21,'LOOKUP TABLES'!$B$4:$I$20,6,0))","v":" "},null,null,null,null,null,null,null,null,null,null,null,null,"Overdesign",null,null,null,null,null,null,null,{"$f":"IF(ISBLANK(H21),\" \",VLOOKUP(H21,'LOOKUP TABLES'!B4:I20,8,0))","v":" "},null,null,{"$f":"IF(ISBLANK(AD21),\" \",IF(AD21>5000,(1.1*AD21)+700,AD21+1200))","v":" "},null,null,null,null,null,null,null,null,{"$f":"IF(OR(H21='LOOKUP TABLES'!B10,H21='LOOKUP TABLES'!B9),\"PWL\",\"\")","v":""},null,{"$f":"IF(H21='LOOKUP TABLES'!B10,'LOOKUP TABLES'!J10,IF(H21='LOOKUP TABLES'!B9,'LOOKUP TABLES'!J9,\"\"))","v":""}]
[]
[null,"Project Number",null,null,null,null,null,null,null,null,null,null,"Plan Page",null,null,null,null,null,null,null,null,null,null,null,null,null,null,null,"Description"]
[]
[]
[null,null,null,null,null,null,null,null,null,null,null,null,null,null,null,null,null,null,null,null,null,null,null,null,null,null,null,null,null,null,null,null,null,null,null,null,null,null,null,null,null,1,null,"RELATED JMF"]
[]
[]
[]
[]
["CONCRETE MIX DESIGN (PER CUBIC YARD)",null,null,null,null,null,null,null,null,null,null,null,null,null,null,null,null,null,null,null,null,null,null,null,null,null,null,null,null,null,null,null,null,null,null,null,null,null,null,"ABSOLUTE VOLUME=",null,null,null,null,null,null,null,{"$f":"'JMF INPUT SHEET'!K6","v":0}]
[]
[null,"AGGREGATES ",null,null,null,null,null,null,null,null,null,null,null,"SOURCE ID",null,null,null,null,"MATERIAL \nCODE",null,null,null,null,null,null,null,null,null,null,null,null,null,null,null,null,null,null,null,null,"Gravity List"]
[null,null,null,"SOURCE - LOCATION",null,null,null,null,null,null,null,null,null,null,null,null,null,null,null,null,null,null,"SIZE & AGG SOURCE TYPE",null,null,null,null,null,null,null,null,null,null,null,null,null,null,null,null,"SP GR",null,null,"ABS",null,"DESIGN WT (LBS)",null,null,null,null,null,null,null,null,null,null,null,null,{"$f":"IF(LEFT(S40,3)=\"205\",1,0)","v":0},null,{"$f":"IF(C64=\"\",1,0)","v":1}]
[]
["AGG 1",null,null,null,null,null,null,null,null,null,null,null,null,null,{"$f":"IF(ISBLANK('JMF SUBMITTAL FORM'!D40),\" \",VLOOKUP('JMF SUBMITTAL FORM'!D40,'AGG PROD LIST'!A:B,2,0))","v":" "},null,null,null,{"$f":"IF(ISBLANK('JMF SUBMITTAL FORM'!W40),\" \",VLOOKUP('JMF SUBMITTAL FORM'!W40,'AGG MATL CD LIST'!A:C,2,0))","v":" "},null,null,null,null,null,null,null,null,null,null,null,null,null,null,null,null,null,null,null,null,null,null,null,null,null,null,null,null,null,{"$f":"IF(ISBLANK(AT40),\" \",AT40/AT48)","v":" "},null,null,null,null,null,null,null,null,{"$f":"IF(LEFT(S42,3)=\"205\",1,0)","v":0}]
[]
["AGG 2",null,null,null,null,null,null,null,null,null,null,null,null,null,{"$f":"IF(ISBLANK('JMF SUBMITTAL FORM'!D42),\" \",VLOOKUP('JMF SUBMITTAL FORM'!D42,'AGG PROD LIST'!A:B,2,0))","v":" "},null,null,null,{"$f":"IF(ISBLANK('JMF SUBMITTAL FORM'!W42),\" \",VLOOKUP('JMF SUBMITTAL FORM'!W42,'AGG MATL CD LIST'!A:C,2,0))","v":" "},null,null,null,null,null,null,null,null,null,null,null,null,null,null,null,null,null,null,null,null,null,null,null,null,null,null,null,null,null,{"$f":"IF(ISBLANK(AT42),\" \",AT42/AT48)","v":" "},null,null,null,null,null,null,null,null,{"$f":"IF(LEFT(S44,3)=\"205\",1,0)","v":0}]
[]
["AGG 3",null,null,null,null,null,null,null,null,null,null,null,null,null,{"$f":"IF(ISBLANK('JMF SUBMITTAL FORM'!D44),\" \",VLOOKUP('JMF SUBMITTAL FORM'!D44,'AGG PROD LIST'!A:B,2,0))","v":" "},null,null,null,{"$f":"IF(ISBLANK('JMF SUBMITTAL FORM'!W44),\" \",VLOOKUP('JMF SUBMITTAL FORM'!W44,'AGG MATL CD LIST'!A:C,2,0))","v":" "},null,null,null,null,null,null,null,null,null,null,null,null,null,null,null,null,null,null,null,null,null,null,null,null,null,null,null,null,null,{"$f":"IF(ISBLANK(AT44),\" \",AT44/AT48)","v":" "},null,null,null,null,null,null,null,null,{"$f":"IF(LEFT(S46,3)=\"205\",1,0)","v":0}]
[]
["AGG 4",null,null,null,null,null,null,null,null,null,null,null,null,null,{"$f":"IF(ISBLANK('JMF SUBMITTAL FORM'!D46),\" \",VLOOKUP('JMF SUBMITTAL FORM'!D46,'AGG PROD LIST'!A:B,2,0))","v":" "},null,null,null,{"$f":"IF(ISBLANK('JMF SUBMITTAL FORM'!W46),\" \",VLOOKUP('JMF SUBMITTAL FORM'!W46,'AGG MATL CD LIST'!A:C,2,0))","v":" "},null,null,null,null,null,null,null,null,null,null,null,null,null,null,null,null,null,null,null,null,null,null,null,null,null,null,null,null,null,{"$f":"IF(ISBLANK(AT46),\" \",AT46/AT48)","v":" "}]
[]
[null,"AGGREGATE CORRECTION FACTOR  (ACF)",null,null,null,null,null,null,null,null,null,null,null,null,null,null,null,null,null,null,null,null,null,null,null,null,null,null,null,null,null,null,null,null,null,null,null,null,null,"TOTAL AGG WT =",null,null,null,null,null,{"$f":"SUM(AT40,AT42,AT44,AT46)","v":0}]
[]
[null,{"$f":"IF(OR(D55:L61=\"MICRO-FINES\"),\"CEMENTITIOUS MATERIALS*\",\"CEMENTITIOUS MATERIALS\")","v":"CEMENTITIOUS MATERIALS"}]
[null,{"$f":"IF(OR(D55:L61=\"MICRO-FINES\"),\"*NOTE: THE PROGRAM WILL CALCULATE THE MICRO-FINES SEPERATELY, BUT WILL BE A % OF THE TOTAL CMs (e.g. CEMENT & SLAG). THIS % WILL BE HIGHLIGHTED IN YELLOW (IF IT EXCEEDS MAX IN 499, IT WILL BE BOLDED IN RED).\",\"\")","v":""}]
[null,null,null,null,null,null,null,null,null,null,null,null,"SOURCE ID",null,null,null,null,null,"MATERIAL CODE"]
[null,null,null,"TYPE/GRADE/CLASS",null,null,null,null,null,null,null,null,null,null,null,null,null,null,null,null,null,null,"SOURCE",null,null,null,null,null,null,null,null,null,null,null,null,null,null,null,null,"SP GR",null,null,null,null,"DESIGN WT (LBS)"]
[]
["Cm 1",null,null,null,null,null,null,null,null,null,null,null,null,{"$f":"IF(ISBLANK('JMF SUBMITTAL FORM'!W55),\" \",VLOOKUP('JMF SUBMITTAL FORM'!W55,'Cm MATL LIST'!B:C,2,0))","v":" "},null,null,null,null,{"$f":"IF(ISBLANK('JMF SUBMITTAL FORM'!D55),\" \",VLOOKUP('JMF SUBMITTAL FORM'!D55,'LOOKUP TABLES'!B22:E35,4,0))","v":" "},null,null,null,null,null,null,null,null,null,null,null,null,null,null,null,null,null,null,null,null,null,null,null,null,{"$f":"IF(ISBLANK(AT55),\" \",AT55/AT$64)","v":" "},null,null,null,null,null,null,{"$f":"IF(D55=\"MICRO-FINES\",0,AT55)","v":0}]
[]
["Cm 2",null,null,null,null,null,null,null,null,null,null,null,null,{"$f":"IF(ISBLANK('JMF SUBMITTAL FORM'!W57),\" \",VLOOKUP('JMF SUBMITTAL FORM'!W57,'Cm MATL LIST'!B:C,2,0))","v":" "},null,null,null,null,{"$f":"IF(ISBLANK('JMF SUBMITTAL FORM'!D57),\" \",VLOOKUP('JMF SUBMITTAL FORM'!D57,'LOOKUP TABLES'!B22:E35,4,0))","v":" "},null,null,null,null,null,null,null,null,null,null,null,null,null,null,null,null,null,null,null,null,null,null,null,null,{"$f":"IF(ISBLANK(AT57),\" \",AT57/AT$64)","v":" "},null,null,null,null,null,null,{"$f":"IF(D57=\"MICRO-FINES\",0,AT57)","v":0}]
[]
["Cm 3",null,null,null,null,null,null,null,null,null,null,null,null,{"$f":"IF(ISBLANK('JMF SUBMITTAL FORM'!W59),\" \",VLOOKUP('JMF SUBMITTAL FORM'!W59,'Cm MATL LIST'!B:C,2,0))","v":" "},null,null,null,null,{"$f":"IF(ISBLANK('JMF SUBMITTAL FORM'!D59),\" \",VLOOKUP('JMF SUBMITTAL FORM'!D59,'LOOKUP TABLES'!B22:E35,4,0))","v":" "},null,null,null,null,null,null,null,null,null,null,null,null,null,null,null,null,null,null,null,null,null,null,null,null,{"$f":"IF(ISBLANK(AT59),\" \",AT59/AT$64)","v":" "},null,null,null,null,null,null,{"$f":"IF(D59=\"MICRO-FINES\",0,AT59)","v":0}]
[]
["Cm 4",null,null,null,null,null,null,null,null,null,null,null,null,{"$f":"IF(ISBLANK('JMF SUBMITTAL FORM'!W61),\" \",VLOOKUP('JMF SUBMITTAL FORM'!W61,'Cm MATL LIST'!B:C,2,0))","v":" "},null,null,null,null,{"$f":"IF(ISBLANK('JMF SUBMITTAL FORM'!D61),\" \",VLOOKUP('JMF SUBMITTAL FORM'!D61,'LOOKUP TABLES'!B22:E35,4,0))","v":" "},null,null,null,null,null,null,null,null,null,null,null,null,null,null,null,null,null,null,null,null,null,null,null,null,{"$f":"IF(ISBLANK(AT61),\" \",AT61/AT$64)","v":" "},null,null,null,null,null,null,{"$f":"IF(D61=\"MICRO-FINES\",0,AT61)","v":0}]
[]
[null,"AIR / SLUMP / WATER",null,null,null,null,null,null,null,null,null,null,null,null,null,null,null,null,null,null,null,null,null,null,null,null,null,null,null,null,null,null,null,null,null,null,null,null,null,{"$f":"IF(OR(D55:L61=\"MICRO-FINES\"),\"TOTAL POWDER\",\"\")","v":""},null,null,null,null,null,{"$f":"IF(OR(D55:L61=\"MICRO-FINES\"),SUM(AT55,AT57,AT59,AT61),\"\")","v":""},null,null,null,null,{"$f":"SUM(AY55:AY61)","v":0}]
[null,null,{"$f":"IF(AND(OR(H23=\"215QC5\",H23=\"215QCSCC\"),MAX(BF38,BF40,BF42,BF44)=0,OR(G66<8%,G66>8%)),\"*Note: Design Air must be 8.0 %*\",IF(AND(H23<>\"215QCRS\",MAX(BF38,BF40,BF42,BF44)=1,OR(G66>7%,G66<7%)),\"*Design Air Must be 7.0 %*\",IF(AND(H23=\"215QCRS\",OR(G66<6%,G66>6%)),\"*Note: Design Air Must be 6.0 %*\",\"\")))","v":""},null,null,null,null,null,null,null,null,null,null,null,null,null,null,null,null,null,null,{"$f":"IF(OR(D55:L61=\"MICRO-FINES\"),\"W / POWDER RATIO  \",\" \")","v":" "},null,null,null,null,null,{"$f":"IF(OR(D55:L61=\"MICRO-FINES\"),AT66/AT63,\" \")","v":" "},null,null,null,null,null,null,null,null,null,null,null,null,null,"TOTAL Cm",null,null,null,{"$f":"AY63","v":0}]
[null,null,null,null,null,null,null,null,null,null,null,null,null,null,null,null,null,null,null,null,null,null,null,null,null,null,null,null,null,null,{"$f":"AT66/AT64","v":{"$error":"#DIV/0!"}}]
[null,null,"DESIGN AIR",null,null,null,null,null,null,"DESIGN SLUMP",null,null,null,null,null,null,"in",{"$f":"IF(ISBLANK(AT66),\" \",\"W / Cm RATIO\")","v":" "},null,null,null,null,null,null,null,null,null,null,null,null,null,null,null,null,null,null,null,null,null,"WATER (lbs)"]
[]
[null,"ADMIXTURES"]
[null,null,null,null,null,null,null,null,null,null,null,null,"SOURCE ID",null,null,null,null,null,"MATERIAL CODE",null,null,null,null,null,null,null,null,null,null,null,null,null,null,null,null,null,null,null,null,"QPL ",null,null,null,null,"DOSAGE RATE"]
[null,null,null,"COMPANY",null,null,null,null,null,null,null,null,null,null,null,null,null,null,null,null,null,null,"BRANDNAME",null,null,null,null,null,null,null,null,null,null,null,null,null,null,null,null,null,"TYPE",null,null,null,null,"OZ / CWT"]
[]
["ADMIX 1",null,null,null,null,null,null,null,null,null,null,null,null,{"$f":"IF(ISBLANK('JMF SUBMITTAL FORM'!D72),\" \",VLOOKUP('JMF SUBMITTAL FORM'!D72,ADMIX_PS_CD_LOOKUP,2,0))","v":" "},null,null,null,null,{"$f":"IF(ISBLANK('JMF SUBMITTAL FORM'!AO72),\" \",VLOOKUP('JMF SUBMITTAL FORM'!AO72,ADMIX_TYPE_CODES,3,0))","v":" "}]
[]
["ADMIX 2",null,null,null,null,null,null,null,null,null,null,null,null,{"$f":"IF(ISBLANK('JMF SUBMITTAL FORM'!D74),\" \",VLOOKUP('JMF SUBMITTAL FORM'!D74,ADMIX_PS_CD_LOOKUP,2,0))","v":" "},null,null,null,null,{"$f":"IF(ISBLANK('JMF SUBMITTAL FORM'!AO74),\" \",VLOOKUP('JMF SUBMITTAL FORM'!AO74,ADMIX_TYPE_CODES,3,0))","v":" "}]
[]
["ADMIX 3",null,null,null,null,null,null,null,null,null,null,null,null,{"$f":"IF(ISBLANK('JMF SUBMITTAL FORM'!D76),\" \",VLOOKUP('JMF SUBMITTAL FORM'!D76,ADMIX_PS_CD_LOOKUP,2,0))","v":" "},null,null,null,null,{"$f":"IF(ISBLANK('JMF SUBMITTAL FORM'!AO76),\" \",VLOOKUP('JMF SUBMITTAL FORM'!AO76,ADMIX_TYPE_CODES,3,0))","v":" "}]
[]
["ADMIX 4",null,null,null,null,null,null,null,null,null,null,null,null,{"$f":"IF(ISBLANK('JMF SUBMITTAL FORM'!D78),\" \",VLOOKUP('JMF SUBMITTAL FORM'!D78,ADMIX_PS_CD_LOOKUP,2,0))","v":" "},null,null,null,null,{"$f":"IF(ISBLANK('JMF SUBMITTAL FORM'!AO78),\" \",VLOOKUP('JMF SUBMITTAL FORM'!AO78,ADMIX_TYPE_CODES,3,0))","v":" "}]
[]
["ADMIX 5",null,null,null,null,null,null,null,null,null,null,null,null,{"$f":"IF(ISBLANK('JMF SUBMITTAL FORM'!D80),\" \",VLOOKUP('JMF SUBMITTAL FORM'!D80,ADMIX_PS_CD_LOOKUP,2,0))","v":" "},null,null,null,null,{"$f":"IF(ISBLANK('JMF SUBMITTAL FORM'!AO80),\" \",VLOOKUP('JMF SUBMITTAL FORM'!AO80,ADMIX_TYPE_CODES,3,0))","v":" "}]
[]
[]
[]
[null,"MACRO-FIBERS (QC RS & QC 3 ONLY)*"]
[null,null,null,null,null,null,null,null,null,null,null,null,"SOURCE ID",null,null,null,null,null,"MATERIAL CODE",null,null,null,null,null,null,null,null,null,null,null,null,null,null,null,null,null,null,null,null,"QPL ",null,null,null,null,"DOSAGE RATE"]
[null,null,null,"COMPANY",null,null,null,null,null,null,null,null,null,null,null,null,null,null,null,null,null,null,"BRANDNAME",null,null,null,null,null,null,null,null,null,null,null,null,null,null,null,null,null,null,null,null,null,null,"LBS/CY"]
[]
["FIBER 1",null,null,null,null,null,null,null,null,null,null,null,null,{"$f":"IF(ISBLANK('JMF SUBMITTAL FORM'!D88),\" \",VLOOKUP('JMF SUBMITTAL FORM'!D88,MACROFIBER_LOOKUP,2,0))","v":" "},null,null,null,null,{"$f":"IF(ISBLANK('JMF SUBMITTAL FORM'!W88),\" \",'MACROFIBER PRODUCT LIST'!C1)","v":" "}]
[]
[null,"TEST RESULTS"]
[]
[]
[null,null,4]
[]
["SINGLE MIX",null,null,"STANDARD MIXES",null,null,null,null,null,null,null,null,null,null,null,null,{"$f":"IF(ISBLANK(H21),\"\",H21)","v":""},null,null,null,null,null,null,null,null,null,null,null,null,"HIGH EARLY STRENGTH MIXES"]
[null,null,null,null,null,"STRENGTH",null,null,null,null,"PERM",null,null,null,null,null,null,"TEST RESULTS",null,null,null,null,null,null,null,null,null,null,null,null,null,null,null,"M.O.R.",null,null,null,null,null,null,null,null,"MATURITY"]
[]
[null,null,null,"3 DAY",null,null,null,null,null,null,null,null,null,null,null,null,null,"AIR",null,null,null,null,null,"VSI",null,null,null,null,null,{"$f":"IF(ISBLANK($Q$95),\" \",IF($Q$95=\"QC MS\",\"20 HR\",\"3 HR\"))","v":"3 HR"}]
[]
[null,null,null,"7 DAY",null,null,null,null,null,null,null,null,null,null,null,null,null,"SLUMP",null,null,null,null,null,"J-RING",null,null,null,null,null,{"$f":"IF(ISBLANK($Q$95),\" \",IF($Q$95=\"QC MS\",\"24 HR\",\"4 HR\"))","v":"4 HR"}]
[]
[null,null,null,"28 DAY",null,null,null,null,null,null,null,null,null,null,null,null,null,"UNIT WT",null,null,null,null,null,"STATIC",null,null,null,null,null,{"$f":"IF(ISBLANK($Q$95),\" \",IF($Q$95=\"QC MS\",\"28 HR\",\"6 HR\"))","v":"6 HR"}]
[]
[null,null,null,"56 DAY",null,null,null,null,null,null,null,null,null,null,null,null,null,"ACF",null,null,null,null,null,"SEGREGATION",null,null,null,null,null,{"$f":"IF(ISBLANK($Q$95),\" \",IF($Q$95=\"QC MS\",\" \",\"8 HR\"))","v":"8 HR"}]
[]
[]
["3-POINT CURVE"]
[null,null,null,null,null,null,null,null,"MIX 1\nLOW W/C",null,null,null,null,"MIX 2\nMID W/C",null,null,null,null,"MIX 3\nHIGH W/C",null,null,null,null,null,{"$f":"Q95","v":""},null,null,null,null,null,null,"CHOSEN \nW/Cm"]
[]
[null,null,null,null,null,null,null,null,null,null,null,null,null,null,null,null,null,null,null,null,null,null,null,null,null,null,null,null,null,null,null,null,null,null,null,null,null,null,null,null,"DEVIATION FROM PROPOSED MIX"]
[null,null,"W/Cm RATIO",null,null,null,null,null,null,null,null,null,null,null,null,null,null,null,null,null,null,null,null,null,null,null,null,null,null,null,null,null,null,null,null,null,null,null,null,null,null,null,{"$f":"IF(ISBLANK(AG111),\"SELECT\",AE65-AG111)","v":"SELECT"}]
[]
[null,null,"Cm CONTENT",null,null,null,null,null,null,null,null,null,null,null,null,null,null,null,null,null,null,null,null,null,null,null,null,null,null,null,null,null,"ESTIMATED VALUES",{"$f":"IF(ISBLANK($AG$111),\"\",IF(AND($AG$111>$J$111,$AG$111<$O$111),J113+($AG$111-$J$111)*(O113-J113)/($O$111-$J$111),IF(AND($AG$111>$O$111,$AG$111<$T$111),O113+($AG$111-$O$111)*(T113-O113)/($T$111-$O$111),IF($AG$111=$J$111,J113,IF($AG$111=$O$111,O113,IF($AG$111=$T$111,T113))))))","v":""},null,null,null,null,null,null,null,null,{"$f":"IF(ISBLANK(AG111),\" \",(AT64-AH113)/AH113)","v":" "}]
[]
[null,null,"WATER CONTENT",null,null,null,null,null,null,null,null,null,null,null,null,null,null,null,null,null,null,null,null,null,null,null,null,null,null,null,null,null,null,{"$f":"IF(ISBLANK($AG$111),\"\",IF(AND($AG$111>$J$111,$AG$111<$O$111),J115+($AG$111-$J$111)*(O115-J115)/($O$111-$J$111),IF(AND($AG$111>$O$111,$AG$111<$T$111),O115+($AG$111-$O$111)*(T115-O115)/($T$111-$O$111),IF($AG$111=$J$111,J115,IF($AG$111=$O$111,O115,IF($AG$111=$T$111,T115))))))","v":""},null,null,null,null,null,null,null,null,{"$f":"IF(ISBLANK(AG111),\" \",(AT66-AH115)/AH115)","v":" "}]
[]
[null,null,"AGG 1",null,null,null,null,null,null,null,null,null,null,null,null,null,null,null,null,null,null,null,null,null,null,null,null,null,null,null,null,null,null,{"$f":"IF(ISBLANK($AG$111),\"\",IF(AND($AG$111>$J$111,$AG$111<$O$111),J117+($AG$111-$J$111)*(O117-J117)/($O$111-$J$111),IF(AND($AG$111>$O$111,$AG$111<$T$111),O117+($AG$111-$O$111)*(T117-O117)/($T$111-$O$111),IF($AG$111=$J$111,J117,IF($AG$111=$O$111,O117,IF($AG$111=$T$111,T117))))))","v":""},null,null,null,null,null,null,null,null,{"$f":"IF(ISBLANK($AG$111),\" \",(AT40-AH117)/AH117)","v":" "}]
[]
[null,null,"AGG 2",null,null,null,null,null,null,null,null,null,null,null,null,null,null,null,null,null,null,null,null,null,null,null,null,null,null,null,null,null,null,{"$f":"IF(ISBLANK($AG$111),\"\",IF(AND($AG$111>$J$111,$AG$111<$O$111),J119+($AG$111-$J$111)*(O119-J119)/($O$111-$J$111),IF(AND($AG$111>$O$111,$AG$111<$T$111),O119+($AG$111-$O$111)*(T119-O119)/($T$111-$O$111),IF($AG$111=$J$111,J119,IF($AG$111=$O$111,O119,IF($AG$111=$T$111,T119))))))","v":""},null,null,null,null,null,null,null,null,{"$f":"IF(ISBLANK($AG$111),\" \",(AT42-AH119)/AH119)","v":" "}]
[]
[null,null,"AGG 3",null,null,null,null,null,null,null,null,null,null,null,null,null,null,null,null,null,null,null,null,null,null,null,null,null,null,null,null,null,null,{"$f":"IF(ISBLANK($AG$111),\"\",IF(AND($AG$111>$J$111,$AG$111<$O$111),J121+($AG$111-$J$111)*(O121-J121)/($O$111-$J$111),IF(AND($AG$111>$O$111,$AG$111<$T$111),O121+($AG$111-$O$111)*(T121-O121)/($T$111-$O$111),IF($AG$111=$J$111,J121,IF($AG$111=$O$111,O121,IF($AG$111=$T$111,T121))))))","v":""},null,null,null,null,null,null,null,null,{"$f":"IF(ISBLANK($AG$111),\" \",(AT44-AH121)/AH121)","v":" "}]
[]
[null,null,"AGG 4",null,null,null,null,null,null,null,null,null,null,null,null,null,null,null,null,null,null,null,null,null,null,null,null,null,null,null,null,null,null,{"$f":"IF(ISBLANK($AG$111),\"\",IF(AND($AG$111>$J$111,$AG$111<$O$111),J123+($AG$111-$J$111)*(O123-J123)/($O$111-$J$111),IF(AND($AG$111>$O$111,$AG$111<$T$111),O123+($AG$111-$O$111)*(T123-O123)/($T$111-$O$111),IF($AG$111=$J$111,J123,IF($AG$111=$O$111,O123,IF($AG$111=$T$111,T123))))))","v":""},null,null,null,null,null,null,null,null,{"$f":"IF(ISBLANK($AG$111),\" \",(AT46-AH123)/AH123)","v":" "}]
[]
[null,null,"3 DAY PSI",null,null,null,null,null,null,null,null,null,null,null,null,null,null,null,null,null,null,null,null,null,null,null,null,null,null,null,null,null,null,{"$f":"IF(ISBLANK($AG$111),\"\",IF(AND($AG$111>$J$111,$AG$111<$O$111),J125+($AG$111-$J$111)*(O125-J125)/($O$111-$J$111),IF(AND($AG$111>$O$111,$AG$111<$T$111),O125+($AG$111-$O$111)*(T125-O125)/($T$111-$O$111),IF($AG$111=$J$111,J125,IF($AG$111=$O$111,O125,IF($AG$111=$T$111,T125))))))","v":""}]
[]
[null,null,"7 DAY PSI",null,null,null,null,null,null,null,null,null,null,null,null,null,null,null,null,null,null,null,null,null,null,null,null,null,null,null,null,null,null,{"$f":"IF(ISBLANK($AG$111),\"\",IF(AND($AG$111>$J$111,$AG$111<$O$111),J127+($AG$111-$J$111)*(O127-J127)/($O$111-$J$111),IF(AND($AG$111>$O$111,$AG$111<$T$111),O127+($AG$111-$O$111)*(T127-O127)/($T$111-$O$111),IF($AG$111=$J$111,J127,IF($AG$111=$O$111,O127,IF($AG$111=$T$111,T127))))))","v":""}]
[]
[null,null,"28 DAY PSI",null,null,null,null,null,null,null,null,null,null,null,null,null,null,null,null,null,null,null,null,null,null,null,null,null,null,null,null,null,null,{"$f":"IF(ISBLANK($AG$111),\"\",IF(AND($AG$111>$J$111,$AG$111<$O$111),J129+($AG$111-$J$111)*(O129-J129)/($O$111-$J$111),IF(AND($AG$111>$O$111,$AG$111<$T$111),O129+($AG$111-$O$111)*(T129-O129)/($T$111-$O$111),IF($AG$111=$J$111,J129,IF($AG$111=$O$111,O129,IF($AG$111=$T$111,T129))))))","v":""}]
[]
[null,null,{"$f":"IF(ISBLANK(AT21),\"\",AT21&\" DAY PSI\")","v":""},null,null,null,null,null,null,null,null,null,null,null,null,null,null,null,null,null,null,null,null,null,null,null,null,null,null,null,null,null,null,{"$f":"IF(ISBLANK($AG$111),\"\",IF(AND($AG$111>$J$111,$AG$111<$O$111),J131+($AG$111-$J$111)*(O131-J131)/($O$111-$J$111),IF(AND($AG$111>$O$111,$AG$111<$T$111),O131+($AG$111-$O$111)*(T131-O131)/($T$111-$O$111),IF($AG$111=$J$111,J131,IF($AG$111=$O$111,O131,IF($AG$111=$T$111,T131))))))","v":""}]
[]
[null,null,"TIME TO 400 M.O.R. ",null,null,null,null,null,null,null,null,null,null,null,null,null,null,null,null,null,null,null,null,null,null,null,null,null,null,null,null,null,null,{"$f":"IF(ISBLANK($AG$111),\"\",IF(AND($AG$111>$J$111,$AG$111<$O$111),J133+($AG$111-$J$111)*(O133-J133)/($O$111-$J$111),IF(AND($AG$111>$O$111,$AG$111<$T$111),O133+($AG$111-$O$111)*(T133-O133)/($T$111-$O$111),IF($AG$111=$J$111,J133,IF($AG$111=$O$111,O133,IF($AG$111=$T$111,T133))))))","v":""}]
[]
[null,null,"PERMEABILITY",null,null,null,null,null,null,null,null,null,null,null,null,null,null,null,null,null,null,null,null,null,null,null,null,null,null,null,null,null,null,{"$f":"IF(ISBLANK($AG$111),\"\",IF(AND($AG$111>$J$111,$AG$111<$O$111),J135+($AG$111-$J$111)*(O135-J135)/($O$111-$J$111),IF(AND($AG$111>$O$111,$AG$111<$T$111),O135+($AG$111-$O$111)*(T135-O135)/($T$111-$O$111),IF($AG$111=$J$111,J135,IF($AG$111=$O$111,O135,IF($AG$111=$T$111,T135))))))","v":""}]
[]
[null,null,"VSI",null,null,null,null,null,null,null,null,null,null,null,null,null,null,null,null,null,null,null,null,null,null,null,null,null,null,null,null,null,null,{"$f":"IF(ISBLANK($AG$111),\"\",IF(AND($AG$111>$J$111,$AG$111<$O$111),J137+($AG$111-$J$111)*(O137-J137)/($O$111-$J$111),IF(AND($AG$111>$O$111,$AG$111<$T$111),O137+($AG$111-$O$111)*(T137-O137)/($T$111-$O$111),IF($AG$111=$J$111,J137,IF($AG$111=$O$111,O137,IF($AG$111=$T$111,T137))))))","v":""}]
[]
[null,null,"J-RING",null,null,null,null,null,null,null,null,null,null,null,null,null,null,null,null,null,null,null,null,null,null,null,null,null,null,null,null,null,null,{"$f":"IF(ISBLANK($AG$111),\"\",IF(AND($AG$111>$J$111,$AG$111<$O$111),J139+($AG$111-$J$111)*(O139-J139)/($O$111-$J$111),IF(AND($AG$111>$O$111,$AG$111<$T$111),O139+($AG$111-$O$111)*(T139-O139)/($T$111-$O$111),IF($AG$111=$J$111,J139,IF($AG$111=$O$111,O139,IF($AG$111=$T$111,T139))))))","v":""}]
[]
[null,null,"STATIC SEG.",null,null,null,null,null,null,null,null,null,null,null,null,null,null,null,null,null,null,null,null,null,null,null,null,null,null,null,null,null,null,{"$f":"IF(ISBLANK($AG$111),\"\",IF(AND($AG$111>$J$111,$AG$111<$O$111),J141+($AG$111-$J$111)*(O141-J141)/($O$111-$J$111),IF(AND($AG$111>$O$111,$AG$111<$T$111),O141+($AG$111-$O$111)*(T141-O141)/($T$111-$O$111),IF($AG$111=$J$111,J141,IF($AG$111=$O$111,O141,IF($AG$111=$T$111,T141))))))","v":""}]
[]
[null,null,"AIR",null,null,null,null,null,null,null,null,null,null,null,null,null,null,null,null,null,null,null,null,null,null,null,null,null,null,null,null,null,null,{"$f":"IF(ISBLANK($AG$111),\"\",IF(AND($AG$111>$J$111,$AG$111<$O$111),J143+($AG$111-$J$111)*(O143-J143)/($O$111-$J$111),IF(AND($AG$111>$O$111,$AG$111<$T$111),O143+($AG$111-$O$111)*(T143-O143)/($T$111-$O$111),IF($AG$111=$J$111,J143,IF($AG$111=$O$111,O143,IF($AG$111=$T$111,T143))))))","v":""}]
[]
[null,null,"SLUMP",null,null,null,null,null,null,null,null,null,null,null,null,null,null,null,null,null,null,null,null,null,null,null,null,null,null,null,null,null,null,{"$f":"IF(ISBLANK($AG$111),\"\",IF(AND($AG$111>$J$111,$AG$111<$O$111),J145+($AG$111-$J$111)*(O145-J145)/($O$111-$J$111),IF(AND($AG$111>$O$111,$AG$111<$T$111),O145+($AG$111-$O$111)*(T145-O145)/($T$111-$O$111),IF($AG$111=$J$111,J145,IF($AG$111=$O$111,O145,IF($AG$111=$T$111,T145))))))","v":""}]
[]
[null,null,"UNIT WT",null,null,null,null,null,null,null,null,null,null,null,null,null,null,null,null,null,null,null,null,null,null,null,null,null,null,null,null,null,null,{"$f":"IF(ISBLANK($AG$111),\"\",IF(AND($AG$111>$J$111,$AG$111<$O$111),J147+($AG$111-$J$111)*(O147-J147)/($O$111-$J$111),IF(AND($AG$111>$O$111,$AG$111<$T$111),O147+($AG$111-$O$111)*(T147-O147)/($T$111-$O$111),IF($AG$111=$J$111,J147,IF($AG$111=$O$111,O147,IF($AG$111=$T$111,T147))))))","v":""}]
[]
[null,null,"ACF",null,null,null,null,null,null,null,null,null,null,null,null,null,null,null,null,null,null,null,null,null,null,null,null,null,null,null,null,null,null,{"$f":"IF(ISBLANK($AG$111),\"\",IF(AND($AG$111>$J$111,$AG$111<$O$111),J149+($AG$111-$J$111)*(O149-J149)/($O$111-$J$111),IF(AND($AG$111>$O$111,$AG$111<$T$111),O149+($AG$111-$O$111)*(T149-O149)/($T$111-$O$111),IF($AG$111=$J$111,J149,IF($AG$111=$O$111,O149,IF($AG$111=$T$111,T149))))))","v":""}]
[]
[]
["FIELD DATA"]
[null,null,null,1,null,null,null,null,null,11,null,null,null,null,null,21,null,null,null,null,null,null,null,null,{"$f":"Q95","v":""},null,null,null,null,null,"DESIGN f'c"]
[]
[null,null,null,2,null,null,null,null,null,12,null,null,null,null,null,22,null,null,null,null,null,null,null,"ADDTL SCC TESTS",null,null,null,null,null,null,"AVG. STRENGTH",null,null,null,null,null,null,null,null,null,null,{"$f":"AVERAGE(F153,F155,F157,F159,F161,F163,F165,F167,F169,F171,L153,L155,L157,L159,L161,L163,L165,L167,L169,L171,R153,R159,R161,R163,R165,R167,R169,R171,R155,R157)","v":{"$error":"#DIV/0!"}},null,null,null,"3 DAY"]
[]
[null,null,null,3,null,null,null,null,null,13,null,null,null,null,null,23,null,null,null,null,null,null,"VSI",null,null,null,null,null,null,null,"STD DEV",null,null,null,null,null,null,null,null,null,null,{"$f":"STDEVA(R171,R169,R167,R165,R163,R161,R159,R157,R155,R153,L171,L169,L167,L165,L163,L161,L159,L157,L155,L153,F153,F155,F157,F159,F161,F163,F165,F167,F169,F171)","v":{"$error":"#DIV/0!"}}]
[]
[null,null,null,4,null,null,null,null,null,14,null,null,null,null,null,24,null,null,null,null,null,null,null,"J-RING",null,null,null,null,null,null,"n VALUE",null,null,null,null,null,null,null,null,null,null,{"$f":"COUNT(F153,F155,F157,F159,F161,F163,F165,F167,F169,F171,L153,L155,L157,L159,L161,L163,L165,L167,L169,L171,R153,R155,R157,R161,R163,R165,R167,R169,R171,R159)","v":0},null,null,null,"7 DAY"]
[]
[null,null,null,5,null,null,null,null,null,15,null,null,null,null,null,25,null,null,null,null,null,null,"STATIC SEG.",null,null,null,null,null,null,null,"k VALUE",null,null,null,null,null,null,null,null,null,null,{"$f":"IF(ISBLANK(AP159),\" \",VLOOKUP(AP159,K_VALUES,2,0))","v":{"$error":"#N/A"}}]
[]
[null,null,null,6,null,null,null,null,null,16,null,null,null,null,null,26,null,null,null,null,null,null,null,null,null,null,null,null,null,null,"ACI FRMLA 1",null,null,null,null,null,null,null,null,{"$f":"IF(AP153<5001,'LOOKUP TABLES'!L3,'LOOKUP TABLES'!L6)","v":{"$error":"#N/A"}}]
[]
[null,null,null,7,null,null,null,null,null,17,null,null,null,null,null,27,null,null,null,null,null,null,null,null,null,null,null,null,null,null,"ACI FRMLA 2",null,null,null,null,null,null,null,null,{"$f":"IF(AP153<5001,'LOOKUP TABLES'!L4,'LOOKUP TABLES'!L7)","v":{"$error":"#N/A"}},null,null,null,"WITHOUT DATA"]
[]
[null,null,null,8,null,null,null,null,null,18,null,null,null,null,null,28,null,null,null,null,null,null,null,null,null,null,null,null,null,"ACI MIN. OVERDESIGN",null,null,null,null,null,null,null,null,null,null,null,{"$f":"IF(AP153<5001,'LOOKUP TABLES'!M4,'LOOKUP TABLES'!M7)","v":{"$error":"#N/A"}},null,null,{"$f":"IF(AP153<5001,'LOOKUP TABLES'!L9,'LOOKUP TABLES'!L10)","v":1200}]
[]
[null,null,null,9,null,null,null,null,null,19,null,null,null,null,null,29,null,null,null,null,null,null,null,null,null,null,null,null,null,"PWL FOR THIS DATA",null,null,null,null,null,null,null,null,null,null,null,{"$f":"1-_xlfn.NORM.DIST(AP153,AP155,AP157,1)","v":{"$error":"#DIV/0!"}}]
[]
[null,null,null,10,null,null,null,null,null,20,null,null,null,null,null,30]
[]
[]
["REMARKS",null,null,null,null,null,null,null,null,null,null,null,null,null,null,null,null,null,null,null,null,null,null,null,null,null,null,null,"SUBMIT",null,null,"Today's Date"]
[]
[null,null,null,null,null,null,null,null,null,null,null,null,null,null,null,null,null,null,null,null,null,null,null,null,null,null,null,null,null,null,null,{"$f":"TODAY()","v":"2025-05-08"}]
[]
[null,null,null,null,null,null,null,null,null,null,null,null,null,null,null,null,null,null,null,null,null,null,null,null,null,null,null,null,null,null,null,"Date Submitted:"]
[]
[]
[]
[]
[]
[null,null,null,null,null,null,null,null,null,null,null,null,null,null,null,null,null,null,null,null,null,null,null,null,null,null,null,null,null,null,null,"Date JMF Form Updated:",null,null,null,null,null,null,"2025-05-08"]
[]
[]
[]
[]
["OFFICE OF MATERIALS MANAGEMENT USE ONLY"]

{"sheet":"JMF INPUT SHEET","index":2,"n_rows":48,"n_cols":12,"rows_kept":48,"cut":false,"hidden":true,"merged":[[9,8,10,9],[9,10,10,10],[11,8,12,9],[11,10,12,10],[26,10,26,12],[42,0,47,7],[21,2,21,3],[21,0,21,1],[20,0,20,1],[32,0,32,1],[36,0,36,1],[35,0,35,1],[34,0,34,1],[26,0,26,1],[27,0,27,1],[23,0,23,1],[22,0,22,1],[17,0,17,4],[37,0,37,1],[28,0,28,1],[28,2,28,4],[29,0,29,1],[19,0,19,1],[18,3,19,4],[13,6,13,7],[14,6,14,7],[15,6,15,7],[17,5,17,13],[41,0,41,7],[41,8,41,13],[33,0,33,1],[25,0,25,4],[22,2,22,4],[23,2,23,3],[24,0,24,1],[29,10,29,12],[28,10,28,12],[27,10,27,12],[31,8,31,9],[18,1,18,2],[0,5,0,6],[0,8,0,10],[1,11,12,13],[0,11,0,13],[12,6,12,7],[11,6,11,7],[5,5,5,6],[8,5,8,6],[7,5,7,6],[6,5,6,6],[10,6,10,7],[1,8,2,9],[1,10,2,10],[3,8,4,9],[3,10,4,10],[5,8,6,9],[38,8,38,9],[39,8,39,9],[6,14,6,20],[8,14,8,20],[1,5,1,7],[2,5,2,7],[3,5,3,7],[4,5,4,7],[5,10,6,10],[7,8,8,9],[7,10,8,10],[35,8,35,9],[36,8,36,9],[32,8,32,9],[33,8,33,9],[34,8,34,9]]}
[null,"SSD WT","SP GR","ABS VOL","% BY MASS","MATERIAL",null,null,"CONRETE PROPERTIES",null,null,"SUBMITTER REMARKS"]
["AGG 1",{"$f":"'JMF SUBMITTAL FORM'!AT40","v":0},{"$f":"'JMF SUBMITTAL FORM'!AN40","v":0},{"$f":"IF(B2=0,0,B2/(62.4*C2))","v":0},{"$f":"B2/SUM(B$2,B$3,B$4,B$5)","v":{"$error":"#DIV/0!"}},{"$f":"IF(ISBLANK('JMF SUBMITTAL FORM'!W40),\" \",'JMF SUBMITTAL FORM'!W40)","v":" "},null,null,"TOTAL AGG WT",null,{"$f":"SUM(B2:B5)","v":0},{"$f":"'JMF SUBMITTAL FORM'!C174","v":0}]
["AGG 2",{"$f":"'JMF SUBMITTAL FORM'!AT42","v":0},{"$f":"'JMF SUBMITTAL FORM'!AN42","v":0},0,{"$f":"B3/SUM(B$2,B$3,B$4,B$5)","v":{"$error":"#DIV/0!"}},{"$f":"IF(ISBLANK('JMF SUBMITTAL FORM'!W42),\" \",'JMF SUBMITTAL FORM'!W42)","v":" "}]
["AGG 3",{"$f":"'JMF SUBMITTAL FORM'!AT44","v":0},{"$f":"'JMF SUBMITTAL FORM'!AN44","v":0},0,{"$f":"B4/SUM(B$2,B$3,B$4,B$5)","v":{"$error":"#DIV/0!"}},{"$f":"IF(ISBLANK('JMF SUBMITTAL FORM'!W44),\" \",'JMF SUBMITTAL FORM'!W44)","v":" "},null,null,"TOTAL Cm WT",null,{"$f":"SUM(B6:B9)","v":0}]
["AGG 4",{"$f":"'JMF SUBMITTAL FORM'!AT46","v":0},{"$f":"'JMF SUBMITTAL FORM'!AN46","v":0},0,{"$f":"B5/SUM(B$2,B$3,B$4,B$5)","v":{"$error":"#DIV/0!"}},{"$f":"IF(ISBLANK('JMF SUBMITTAL FORM'!W46),\" \",'JMF SUBMITTAL FORM'!W46)","v":" "}]
["Cm 1",{"$f":"'JMF SUBMITTAL FORM'!AT55","v":0},{"$f":"'JMF SUBMITTAL FORM'!AN55","v":0},0,{"$f":"B6/SUM(B$6,B$7,B$8,B$9)","v":{"$error":"#DIV/0!"}},{"$f":"IF(ISBLANK('JMF SUBMITTAL FORM'!D55),\" \",'JMF SUBMITTAL FORM'!D55)","v":" "},null,{"$f":"IF(ISBLANK('JMF SUBMITTAL FORM'!D55),\" \",VLOOKUP('JMF SUBMITTAL FORM'!D55,CM_NAME_CODES,3,0))","v":" "},"ABS VOLUME",null,{"$f":"D16","v":0}]
["Cm 2",{"$f":"'JMF SUBMITTAL FORM'!AT57","v":0},{"$f":"'JMF SUBMITTAL FORM'!AN57","v":0},0,{"$f":"B7/SUM(B$6,B$7,B$8,B$9)","v":{"$error":"#DIV/0!"}},{"$f":"IF(ISBLANK('JMF SUBMITTAL FORM'!D57),\" \",'JMF SUBMITTAL FORM'!D57)","v":" "},null,{"$f":"IF(ISBLANK('JMF SUBMITTAL FORM'!D57),\" \",VLOOKUP('JMF SUBMITTAL FORM'!D57,CM_NAME_CODES,3,0))","v":" "}]
["Cm 3",{"$f":"'JMF SUBMITTAL FORM'!AT59","v":0},{"$f":"'JMF SUBMITTAL FORM'!AN59","v":0},0,{"$f":"B8/SUM(B$6,B$7,B$8,B$9)","v":{"$error":"#DIV/0!"}},{"$f":"IF(ISBLANK('JMF SUBMITTAL FORM'!D59),\" \",'JMF SUBMITTAL FORM'!D59)","v":" "},null,{"$f":"IF(ISBLANK('JMF SUBMITTAL FORM'!D59),\" \",VLOOKUP('JMF SUBMITTAL FORM'!D59,CM_NAME_CODES,3,0))","v":" "},"WEIGHT/YD3",null,{"$f":"SUM(K4,K2,B10)","v":0}]
["Cm 4",{"$f":"'JMF SUBMITTAL FORM'!AT61","v":0},{"$f":"'JMF SUBMITTAL FORM'!AN61","v":0},0,{"$f":"B9/SUM(B$6,B$7,B$8,B$9)","v":{"$error":"#DIV/0!"}},{"$f":"IF(ISBLANK('JMF SUBMITTAL FORM'!D61),\" \",'JMF SUBMITTAL FORM'!D61)","v":" "},null,{"$f":"IF(ISBLANK('JMF SUBMITTAL FORM'!D61),\" \",VLOOKUP('JMF SUBMITTAL FORM'!D61,CM_NAME_CODES,3,0))","v":" "}]
["H2O",{"$f":"'JMF SUBMITTAL FORM'!AT66","v":0},1,{"$f":"B10/(62.4*C10)","v":0},"AGG VOL.",null,null,null,"THEO UNIT WT",null,{"$f":"K8/K6","v":{"$error":"#DIV/0!"}}]
["AIR",{"$f":"'JMF SUBMITTAL FORM'!G66","v":0},null,{"$f":"27*B11","v":0},{"$f":"SUM(D2:D5)","v":0},"LISTED","CERTIFIED AS"]
["ADMIX 1 (OZ)",{"$f":"IF(ISBLANK('JMF SUBMITTAL FORM'!AT72),\" \",'JMF SUBMITTAL FORM'!AT72*('JMF SUBMITTAL FORM'!AT64/100))","v":" "},null,null,"PASTE VOL.",{"$f":"IF(ISBLANK('JMF SUBMITTAL FORM'!AO72),\" \",'JMF SUBMITTAL FORM'!AO72)","v":" "},{"$f":"IF(ISBLANK('JMF SUBMITTAL FORM'!W72),\" \",VLOOKUP('JMF SUBMITTAL FORM'!W72,ADMIX_VLOOK,3,0))","v":" "},null,"MAX W/Cm RATIO",null,{"$f":"'JMF SUBMITTAL FORM'!AE65","v":{"$error":"#DIV/0!"}}]
["ADMIX 2 (OZ)",{"$f":"IF(ISBLANK('JMF SUBMITTAL FORM'!AT74),\" \",'JMF SUBMITTAL FORM'!AT74*('JMF SUBMITTAL FORM'!AT$64/100))","v":" "},null,"TOTAL VOL",{"$f":"SUM(D6:D11)+D15","v":0},{"$f":"IF(ISBLANK('JMF SUBMITTAL FORM'!AO74),\" \",'JMF SUBMITTAL FORM'!AO74)","v":" "},{"$f":"IF(ISBLANK('JMF SUBMITTAL FORM'!W74),\" \",VLOOKUP('JMF SUBMITTAL FORM'!W74,ADMIX_VLOOK,3,0))","v":" "}]
["ADMIX 3 (OZ)",{"$f":"IF(ISBLANK('JMF SUBMITTAL FORM'!AT76),\" \",'JMF SUBMITTAL FORM'!AT76*('JMF SUBMITTAL FORM'!AT$64/100))","v":" "},null,{"$f":"SUM(D2:D11)","v":0},null,{"$f":"IF(ISBLANK('JMF SUBMITTAL FORM'!AO76),\" \",'JMF SUBMITTAL FORM'!AO76)","v":" "},{"$f":"IF(ISBLANK('JMF SUBMITTAL FORM'!W76),\" \",VLOOKUP('JMF SUBMITTAL FORM'!W76,ADMIX_VLOOK,3,0))","v":" "}]
["ADMIX 4 (OZ)",{"$f":"IF(ISBLANK('JMF SUBMITTAL FORM'!AT78),\" \",'JMF SUBMITTAL FORM'!AT78*('JMF SUBMITTAL FORM'!AT$64/100))","v":" "},null,{"$f":"SUM(B13,B14,B15,B16)/(128*7.49)","v":0},null,{"$f":"IF(ISBLANK('JMF SUBMITTAL FORM'!AO78),\" \",'JMF SUBMITTAL FORM'!AO78)","v":" "},{"$f":"IF(ISBLANK('JMF SUBMITTAL FORM'!W78),\" \",VLOOKUP('JMF SUBMITTAL FORM'!W78,ADMIX_VLOOK,3,0))","v":" "}]
["ADMIX 5 (OZ)",{"$f":"IF(ISBLANK('JMF SUBMITTAL FORM'!AT80),\" \",'JMF SUBMITTAL FORM'!AT80*('JMF SUBMITTAL FORM'!AT$64/100))","v":" "},null,{"$f":"SUM(D14:D15)","v":0},null,{"$f":"IF(ISBLANK('JMF SUBMITTAL FORM'!AO80),\" \",'JMF SUBMITTAL FORM'!AO80)","v":" "},{"$f":"IF(ISBLANK('JMF SUBMITTAL FORM'!W80),\" \",VLOOKUP('JMF SUBMITTAL FORM'!W80,ADMIX_VLOOK,3,0))","v":" "}]
[]
["JMF DESCRIPTION",null,null,null,null,"JMF MATERIALS"]
["JMF #",null,null,{"$f":"IF(NOT(ISBLANK('JMF SUBMITTAL FORM'!AQ31)),\"Related JMF: \"&'JMF SUBMITTAL FORM'!AQ31&\"\",\"\")","v":""},null,"AGGREGATES"]
["MAT'L CODE",null,{"$f":"'JMF SUBMITTAL FORM'!H23","v":" "},null,null,"MATERIAL","MATL CD","AWP P/S CODE","SP GR","ABS","SSD WT"]
["P/S CODE",null,{"$f":"'JMF SUBMITTAL FORM'!AR3","v":" "},null,null,"AGG 1",{"$f":"IF(ISBLANK('JMF SUBMITTAL FORM'!W40),\" \",VLOOKUP('JMF SUBMITTAL FORM'!W40,'AGG MATL CD LIST'!A:C,2,0))","v":" "},{"$f":"IF(ISBLANK('JMF SUBMITTAL FORM'!D40),\" \",VLOOKUP('JMF SUBMITTAL FORM'!D40,'AGG PROD LIST'!A:B,2,0))","v":" "},{"$f":"IF(ISBLANK('JMF SUBMITTAL FORM'!AN40),\" \",'JMF SUBMITTAL FORM'!AN40)","v":" "},{"$f":"IF(ISBLANK('JMF SUBMITTAL FORM'!AQ40),\" \",'JMF SUBMITTAL FORM'!AQ40)","v":" "},{"$f":"IF(ISBLANK('JMF SUBMITTAL FORM'!AT40),\" \",'JMF SUBMITTAL FORM'!AT40)","v":" "},{"$f":"IF(ISBLANK('JMF SUBMITTAL FORM'!D40),\" \",'JMF SUBMITTAL FORM'!D40)","v":" "}]
["PRODUCER NAME",null,{"$f":"'JMF SUBMITTAL FORM'!H3","v":0},null,null,"AGG 2",{"$f":"IF(ISBLANK('JMF SUBMITTAL FORM'!W42),\" \",VLOOKUP('JMF SUBMITTAL FORM'!W42,'AGG MATL CD LIST'!A:C,2,0))","v":" "},{"$f":"IF(ISBLANK('JMF SUBMITTAL FORM'!D42),\" \",VLOOKUP('JMF SUBMITTAL FORM'!D42,'AGG PROD LIST'!A:B,2,0))","v":" "},{"$f":"IF(ISBLANK('JMF SUBMITTAL FORM'!AN42),\" \",'JMF SUBMITTAL FORM'!AN42)","v":" "},{"$f":"IF(ISBLANK('JMF SUBMITTAL FORM'!AQ42),\" \",'JMF SUBMITTAL FORM'!AQ42)","v":" "},{"$f":"IF(ISBLANK('JMF SUBMITTAL FORM'!AT42),\" \",'JMF SUBMITTAL FORM'!AT42)","v":" "},{"$f":"IF(ISBLANK('JMF SUBMITTAL FORM'!D42),\" \",'JMF SUBMITTAL FORM'!D42)","v":" "}]
["DESIGN INFO",null,{"$f":"'JMF SUBMITTAL FORM'!AG27","v":0},null,null,"AGG 3",{"$f":"IF(ISBLANK('JMF SUBMITTAL FORM'!W44),\" \",VLOOKUP('JMF SUBMITTAL FORM'!W44,'AGG MATL CD LIST'!A:C,2,0))","v":" "},{"$f":"IF(ISBLANK('JMF SUBMITTAL FORM'!D44),\" \",VLOOKUP('JMF SUBMITTAL FORM'!D44,'AGG PROD LIST'!A:B,2,0))","v":" "},{"$f":"IF(ISBLANK('JMF SUBMITTAL FORM'!AN44),\" \",'JMF SUBMITTAL FORM'!AN44)","v":" "},{"$f":"IF(ISBLANK('JMF SUBMITTAL FORM'!AQ44),\" \",'JMF SUBMITTAL FORM'!AQ44)","v":" "},{"$f":"IF(ISBLANK('JMF SUBMITTAL FORM'!AT44),\" \",'JMF SUBMITTAL FORM'!AT44)","v":" "},{"$f":"IF(ISBLANK('JMF SUBMITTAL FORM'!D44),\" \",'JMF SUBMITTAL FORM'!D44)","v":" "}]
["CLASS",null,{"$f":"'JMF SUBMITTAL FORM'!H21","v":0},null,null,"AGG 4",{"$f":"IF(ISBLANK('JMF SUBMITTAL FORM'!W46),\" \",VLOOKUP('JMF SUBMITTAL FORM'!W46,'AGG MATL CD LIST'!A:C,2,0))","v":" "},{"$f":"IF(ISBLANK('JMF SUBMITTAL FORM'!D46),\" \",VLOOKUP('JMF SUBMITTAL FORM'!D46,'AGG PROD LIST'!A:B,2,0))","v":" "},{"$f":"IF(ISBLANK('JMF SUBMITTAL FORM'!AN46),\" \",'JMF SUBMITTAL FORM'!AN46)","v":" "},{"$f":"IF(ISBLANK('JMF SUBMITTAL FORM'!AQ46),\" \",'JMF SUBMITTAL FORM'!AQ46)","v":" "},{"$f":"IF(ISBLANK('JMF SUBMITTAL FORM'!AT46),\" \",'JMF SUBMITTAL FORM'!AT46)","v":" "},{"$f":"IF(ISBLANK('JMF SUBMITTAL FORM'!D46),\" \",'JMF SUBMITTAL FORM'!D46)","v":" "}]
["DATE SUBMITTED",null,{"$f":"+SUBMIT_DATE","v":"00:00:00"},null,null,"CEMENTITIOUS MATERIALS"]
["JMF PROPERTIES",null,null,null,null,"MATERIAL","MATL CD","AWP P/S CODE","SP GR","SSD WT"]
["DESIGN STRENGTH",null,{"$f":"IF('JMF SUBMITTAL FORM'!AA21=\"SPECIFY\",'JMF SUBMITTAL FORM'!AD21,'JMF SUBMITTAL FORM'!AA21)","v":" "},null,null,"Cm 1",{"$f":"IF(ISBLANK('JMF SUBMITTAL FORM'!D55),\" \",VLOOKUP('JMF SUBMITTAL FORM'!D55,'LOOKUP TABLES'!B22:E35,4,0))","v":" "},{"$f":"IF(ISBLANK('JMF SUBMITTAL FORM'!W55),\" \",VLOOKUP('JMF SUBMITTAL FORM'!W55,'Cm MATL LIST'!B:C,2,0))","v":" "},{"$f":"IF(ISBLANK('JMF SUBMITTAL FORM'!AN55),\" \",'JMF SUBMITTAL FORM'!AN55)","v":" "},{"$f":"IF(ISBLANK('JMF SUBMITTAL FORM'!AT55),\" \",'JMF SUBMITTAL FORM'!AT55)","v":" "},{"$f":"IF(ISBLANK('JMF SUBMITTAL FORM'!W55),\" \",'JMF SUBMITTAL FORM'!W55)","v":" "}]
["OVERDESIGN STRENGTH",null,{"$f":"IF(ISNUMBER('JMF SUBMITTAL FORM'!AE25),'JMF SUBMITTAL FORM'!AE25,'JMF SUBMITTAL FORM'!AH25)","v":" "},null,null,"Cm 2",{"$f":"IF(ISBLANK('JMF SUBMITTAL FORM'!D57),\" \",VLOOKUP('JMF SUBMITTAL FORM'!D57,'LOOKUP TABLES'!B22:E35,4,0))","v":" "},{"$f":"IF(ISBLANK('JMF SUBMITTAL FORM'!W57),\" \",VLOOKUP('JMF SUBMITTAL FORM'!W57,'Cm MATL LIST'!B:C,2,0))","v":" "},{"$f":"IF(ISBLANK('JMF SUBMITTAL FORM'!AN57),\" \",'JMF SUBMITTAL FORM'!AN57)","v":" "},{"$f":"IF(ISBLANK('JMF SUBMITTAL FORM'!AT57),\" \",'JMF SUBMITTAL FORM'!AT57)","v":" "},{"$f":"IF(ISBLANK('JMF SUBMITTAL FORM'!W57),\" \",'JMF SUBMITTAL FORM'!W57)","v":" "}]
["GRADATION REQUIREMENT",null,{"$f":"'JMF SUBMITTAL FORM'!J25","v":" "},null,null,"Cm 3",{"$f":"IF(ISBLANK('JMF SUBMITTAL FORM'!D59),\" \",VLOOKUP('JMF SUBMITTAL FORM'!D59,'LOOKUP TABLES'!B22:E35,4,0))","v":" "},{"$f":"IF(ISBLANK('JMF SUBMITTAL FORM'!W59),\" \",VLOOKUP('JMF SUBMITTAL FORM'!W59,'Cm MATL LIST'!B:C,2,0))","v":" "},{"$f":"IF(ISBLANK('JMF SUBMITTAL FORM'!AN59),\" \",'JMF SUBMITTAL FORM'!AN59)","v":" "},{"$f":"IF(ISBLANK('JMF SUBMITTAL FORM'!AT59),\" \",'JMF SUBMITTAL FORM'!AT59)","v":" "},{"$f":"IF(ISBLANK('JMF SUBMITTAL FORM'!W59),\" \",'JMF SUBMITTAL FORM'!W59)","v":" "}]
["PERMEABILITY",null,{"$f":"IF('JMF SUBMITTAL FORM'!AA23=\"PER PLAN\",'JMF SUBMITTAL FORM'!AD23,'JMF SUBMITTAL FORM'!AA23)","v":" "},null,null,"Cm 4",{"$f":"IF(ISBLANK('JMF SUBMITTAL FORM'!D61),\" \",VLOOKUP('JMF SUBMITTAL FORM'!D61,'LOOKUP TABLES'!B22:E35,4,0))","v":" "},{"$f":"IF(ISBLANK('JMF SUBMITTAL FORM'!W61),\" \",VLOOKUP('JMF SUBMITTAL FORM'!W61,'Cm MATL LIST'!B:C,2,0))","v":" "},{"$f":"IF(ISBLANK('JMF SUBMITTAL FORM'!AN61),\" \",'JMF SUBMITTAL FORM'!AN61)","v":" "},{"$f":"IF(ISBLANK('JMF SUBMITTAL FORM'!AT61),\" \",'JMF SUBMITTAL FORM'!AT61)","v":" "},{"$f":"IF(ISBLANK('JMF SUBMITTAL FORM'!W61),\" \",'JMF SUBMITTAL FORM'!W61)","v":" "}]
[null,null,null,null,null,"ADMIXTURES"]
[null,null,null,null,null,"MATERIAL","MATL CD","AWP P/S CODE","BRAND NAME",null,"OZ / CWT"]
["DESIGN AIR",null,{"$f":"'JMF SUBMITTAL FORM'!G66*100","v":0},null,null,"ADMIX 1",{"$f":"IF(ISBLANK('JMF SUBMITTAL FORM'!AO72),\" \",VLOOKUP('JMF SUBMITTAL FORM'!AO72,ADMIX_TYPE_CODES,3,0))","v":" "},{"$f":"IF(ISBLANK('JMF SUBMITTAL FORM'!D72),\" \",VLOOKUP('JMF SUBMITTAL FORM'!D72,ADMIX_PS_CD_LOOKUP,2,0))","v":" "},{"$f":"IF(ISBLANK('JMF SUBMITTAL FORM'!W72),\" \",'JMF SUBMITTAL FORM'!W72)","v":" "},null,{"$f":"IF(ISBLANK('JMF SUBMITTAL FORM'!AT72),\" \",'JMF SUBMITTAL FORM'!AT72)","v":" "},{"$f":"IF(ISBLANK('JMF SUBMITTAL FORM'!D72),\" \",'JMF SUBMITTAL FORM'!D72)","v":" "}]
["DESIGN SLUMP",null,{"$f":"'JMF SUBMITTAL FORM'!O66","v":0},"INCH",null,"ADMIX 2",{"$f":"IF(ISBLANK('JMF SUBMITTAL FORM'!AO74),\" \",VLOOKUP('JMF SUBMITTAL FORM'!AO74,ADMIX_TYPE_CODES,3,0))","v":" "},{"$f":"IF(ISBLANK('JMF SUBMITTAL FORM'!D74),\" \",VLOOKUP('JMF SUBMITTAL FORM'!D74,ADMIX_PS_CD_LOOKUP,2,0))","v":" "},{"$f":"IF(ISBLANK('JMF SUBMITTAL FORM'!W74),\" \",'JMF SUBMITTAL FORM'!W74)","v":" "},null,{"$f":"IF(ISBLANK('JMF SUBMITTAL FORM'!AT74),\" \",'JMF SUBMITTAL FORM'!AT74)","v":" "},{"$f":"IF(ISBLANK('JMF SUBMITTAL FORM'!D74),\" \",'JMF SUBMITTAL FORM'!D74)","v":" "}]
["THEO UNIT WT",null,{"$f":"K10","v":{"$error":"#DIV/0!"}},"LB/CF",null,"ADMIX 3",{"$f":"IF(ISBLANK('JMF SUBMITTAL FORM'!AO76),\" \",VLOOKUP('JMF SUBMITTAL FORM'!AO76,ADMIX_TYPE_CODES,3,0))","v":" "},{"$f":"IF(ISBLANK('JMF SUBMITTAL FORM'!D76),\" \",VLOOKUP('JMF SUBMITTAL FORM'!D76,ADMIX_PS_CD_LOOKUP,2,0))","v":" "},{"$f":"IF(ISBLANK('JMF SUBMITTAL FORM'!W76),\" \",'JMF SUBMITTAL FORM'!W76)","v":" "},null,{"$f":"IF(ISBLANK('JMF SUBMITTAL FORM'!AT76),\" \",'JMF SUBMITTAL FORM'!AT76)","v":" "},{"$f":"IF(ISBLANK('JMF SUBMITTAL FORM'!D76),\" \",'JMF SUBMITTAL FORM'!D76)","v":" "}]
["MAX W/Cm RATIO",null,{"$f":"'JMF SUBMITTAL FORM'!AE65","v":{"$error":"#DIV/0!"}},null,null,"ADMIX 4",{"$f":"IF(ISBLANK('JMF SUBMITTAL FORM'!AO78),\" \",VLOOKUP('JMF SUBMITTAL FORM'!AO78,ADMIX_TYPE_CODES,3,0))","v":" "},{"$f":"IF(ISBLANK('JMF SUBMITTAL FORM'!D78),\" \",VLOOKUP('JMF SUBMITTAL FORM'!D78,ADMIX_PS_CD_LOOKUP,2,0))","v":" "},{"$f":"IF(ISBLANK('JMF SUBMITTAL FORM'!W78),\" \",'JMF SUBMITTAL FORM'!W78)","v":" "},null,{"$f":"IF(ISBLANK('JMF SUBMITTAL FORM'!AT78),\" \",'JMF SUBMITTAL FORM'!AT78)","v":" "},{"$f":"IF(ISBLANK('JMF SUBMITTAL FORM'!D78),\" \",'JMF SUBMITTAL FORM'!D78)","v":" "}]
["TOTAL WT/YD3",null,{"$f":"K8","v":0},"LB/CY",null,"ADMIX 5",{"$f":"IF(ISBLANK('JMF SUBMITTAL FORM'!AO80),\" \",VLOOKUP('JMF SUBMITTAL FORM'!AO80,ADMIX_TYPE_CODES,3,0))","v":" "},{"$f":"IF(ISBLANK('JMF SUBMITTAL FORM'!D80),\" \",VLOOKUP('JMF SUBMITTAL FORM'!D80,ADMIX_PS_CD_LOOKUP,2,0))","v":" "},{"$f":"IF(ISBLANK('JMF SUBMITTAL FORM'!W80),\" \",'JMF SUBMITTAL FORM'!W80)","v":" "},null,{"$f":"IF(ISBLANK('JMF SUBMITTAL FORM'!AT80),\" \",'JMF SUBMITTAL FORM'!AT80)","v":" "},{"$f":"IF(ISBLANK('JMF SUBMITTAL FORM'!D80),\" \",'JMF SUBMITTAL FORM'!D80)","v":" "}]
["AGG CORRECTION FACTOR",null,{"$f":"'JMF SUBMITTAL FORM'!O48","v":0},null,null,"MACRO-FIBERS"]
[null,null,null,null,null,"MATERIAL","MATL CD","AWP P/S CODE","BRAND NAME",null,"LBS/CY"]
[null,null,null,null,null,"FIBER 1",{"$f":"IF(ISBLANK('JMF SUBMITTAL FORM'!W88),\" \",'MACROFIBER PRODUCT LIST'!C1)","v":" "},{"$f":"IF(ISBLANK('JMF SUBMITTAL FORM'!D88),\" \",VLOOKUP('JMF SUBMITTAL FORM'!D88,MACROFIBER_LOOKUP,2,0))","v":" "},{"$f":"IF(ISBLANK('JMF SUBMITTAL FORM'!W88),\" \",'JMF SUBMITTAL FORM'!W88)","v":" "},null,{"$f":"IF(ISBLANK('JMF SUBMITTAL FORM'!AT88),\" \",'JMF SUBMITTAL FORM'!AT88)","v":" "}]
[]
["REMARKS",null,null,null,null,null,null,null,"OFFICE OF MATERIALS MANAGEMENT USE ONLY"]
[null,null,null,null,null,null,null,null,"RCV'D DT",{"$f":"SUBMIT_DATE","v":"00:00:00"},"BY",1]
[null,null,null,null,null,null,null,null,"RVW'D DT"]
[null,null,null,null,null,null,null,null,"ENTER DT"]
[null,null,null,null,null,null,null,null,"STATUS DT"]
[null,null,null,null,null,null,null,null,"REVIEW","ENTER","TOTAL"]
[null,null,null,null,null,null,null,null,{"$f":"IF(ISBLANK(J44),\" \",J44-J43)","v":" "},{"$f":"IF(ISBLANK(J45),\" \",J45-J44)","v":" "},{"$f":"IF(ISBLANK(J46),\" \",J46-J43)","v":" "}]

{"sheet":"STATUS LETTER","index":3,"n_rows":49,"n_cols":11,"rows_kept":49,"cut":false,"hidden":true,"merged":[[3,0,3,1],[6,0,6,2],[7,1,7,4],[7,5,7,6],[11,5,11,6],[10,5,10,6],[9,5,9,6],[8,5,8,6],[11,1,11,4],[14,1,14,4],[9,1,9,4],[8,1,8,4],[10,1,10,4],[12,0,12,2],[13,1,13,4],[24,1,24,4],[27,5,27,6],[26,5,26,6],[25,5,25,6],[24,5,24,6],[37,4,37,5],[37,6,37,10],[36,1,36,2],[2,7,2,8],[2,5,2,6],[21,0,21,2],[18,5,18,6],[13,5,13,6],[17,5,17,6],[16,5,16,6],[15,5,15,6],[14,5,14,6],[17,1,17,4],[16,1,16,4],[15,1,15,4],[22,1,22,4],[38,1,38,2],[2,1,2,2],[48,0,57,10],[23,7,27,10],[40,1,40,10],[41,1,46,10],[33,0,33,10],[5,0,5,10],[3,8,4,10],[3,7,4,7],[37,1,37,2],[18,2,18,3],[9,10,11,10],[15,10,17,10],[34,7,34,8],[35,7,35,8],[0,2,0,8],[36,4,36,5],[4,0,4,1],[3,2,3,6],[4,2,4,4],[35,1,35,2],[34,1,34,2],[34,4,34,5],[35,4,35,5],[22,5,22,6],[23,1,23,4],[23,5,23,6],[20,5,20,6],[27,1,27,4],[26,1,26,4],[25,1,25,4],[31,1,31,4],[31,5,31,6],[30,1,30,4],[30,5,30,6],[29,0,29,2]]}
[null,null,"PORTLAND CEMENT CONCRETE JOB MIX FORMULA "]
[]
["Date:",{"$f":"'JMF INPUT SHEET'!J44","v":"00:00:00"},null,null,null,"SUBMITTAL STATUS:",null,{"$f":"IF('JMF INPUT SHEET'!L43=1,\"APPROVED\",IF('JMF INPUT SHEET'!L43=2,\"PENDING\",\"NOT APPROVED\"))","v":"APPROVED"}]
["PRODUCER/SUPPLIER:",null,{"$f":"'JMF SUBMITTAL FORM'!H3","v":0},null,null,null,null,"JMF #",{"$f":"'JMF INPUT SHEET'!B19","v":0}]
["CLASS OF CONCRETE:",null,{"$f":"'JMF SUBMITTAL FORM'!H21","v":0}]
["MIX DESIGN"]
["AGGREGATES:",null,null,null,null,null,null,null,null,"SSD"]
[null,"Source",null,null,null,"Size / Type",null,"Sp. Gr.","Abs.","Design Wt"]
[null,{"$f":"IF(ISBLANK('JMF SUBMITTAL FORM'!D40),\" \",'JMF SUBMITTAL FORM'!D40)","v":" "},null,null,null,{"$f":"IF(ISBLANK('JMF SUBMITTAL FORM'!W40),\" \",'JMF SUBMITTAL FORM'!W40)","v":" "},null,{"$f":"IF(ISBLANK('JMF SUBMITTAL FORM'!AN40),\" \",'JMF SUBMITTAL FORM'!AN40)","v":" "},{"$f":"IF(ISBLANK('JMF SUBMITTAL FORM'!AQ40),\" \",'JMF SUBMITTAL FORM'!AQ40)","v":" "},{"$f":"IF(ISBLANK('JMF SUBMITTAL FORM'!AT40),\" \",'JMF SUBMITTAL FORM'!AT40)","v":" "},"TOTAL"]
[null,{"$f":"IF(ISBLANK('JMF SUBMITTAL FORM'!D42),\" \",'JMF SUBMITTAL FORM'!D42)","v":" "},null,null,null,{"$f":"IF(ISBLANK('JMF SUBMITTAL FORM'!W42),\" \",'JMF SUBMITTAL FORM'!W42)","v":" "},null,{"$f":"IF(ISBLANK('JMF SUBMITTAL FORM'!AN42),\" \",'JMF SUBMITTAL FORM'!AN42)","v":" "},{"$f":"IF(ISBLANK('JMF SUBMITTAL FORM'!AQ42),\" \",'JMF SUBMITTAL FORM'!AQ42)","v":" "},{"$f":"IF(ISBLANK('JMF SUBMITTAL FORM'!AT42),\" \",'JMF SUBMITTAL FORM'!AT42)","v":" "},{"$f":"'JMF INPUT SHEET'!K2","v":0}]
[null,{"$f":"IF(ISBLANK('JMF SUBMITTAL FORM'!D44),\" \",'JMF SUBMITTAL FORM'!D44)","v":" "},null,null,null,{"$f":"IF(ISBLANK('JMF SUBMITTAL FORM'!W44),\" \",'JMF SUBMITTAL FORM'!W44)","v":" "},null,{"$f":"IF(ISBLANK('JMF SUBMITTAL FORM'!AN44),\" \",'JMF SUBMITTAL FORM'!AN44)","v":" "},{"$f":"IF(ISBLANK('JMF SUBMITTAL FORM'!AQ44),\" \",'JMF SUBMITTAL FORM'!AQ44)","v":" "},{"$f":"IF(ISBLANK('JMF SUBMITTAL FORM'!AT44),\" \",'JMF SUBMITTAL FORM'!AT44)","v":" "}]
[null,{"$f":"IF(ISBLANK('JMF SUBMITTAL FORM'!D46),\" \",'JMF SUBMITTAL FORM'!D46)","v":" "},null,null,null,{"$f":"IF(ISBLANK('JMF SUBMITTAL FORM'!W46),\" \",'JMF SUBMITTAL FORM'!W46)","v":" "},null,{"$f":"IF(ISBLANK('JMF SUBMITTAL FORM'!AN46),\" \",'JMF SUBMITTAL FORM'!AN46)","v":" "},{"$f":"IF(ISBLANK('JMF SUBMITTAL FORM'!AQ46),\" \",'JMF SUBMITTAL FORM'!AQ46)","v":" "},{"$f":"IF(ISBLANK('JMF SUBMITTAL FORM'!AT46),\" \",'JMF SUBMITTAL FORM'!AT46)","v":" "}]
["CEMENTITIOUS MATERIALS:"]
[null,"Source",null,null,null,"Material",null,"Sp. Gr."]
[null,{"$f":"IF(ISBLANK('JMF SUBMITTAL FORM'!W55),\" \",'JMF SUBMITTAL FORM'!W55)","v":" "},null,null,null,{"$f":"IF(ISBLANK('JMF SUBMITTAL FORM'!D55),\" \",'JMF SUBMITTAL FORM'!D55)","v":" "},null,{"$f":"IF(ISBLANK('JMF SUBMITTAL FORM'!AN55),\" \",'JMF SUBMITTAL FORM'!AN55)","v":" "},null,{"$f":"IF(ISBLANK('JMF SUBMITTAL FORM'!AT55),\" \",'JMF SUBMITTAL FORM'!AT55)","v":" "},"TOTAL"]
[null,{"$f":"IF(ISBLANK('JMF SUBMITTAL FORM'!W57),\" \",'JMF SUBMITTAL FORM'!W57)","v":" "},null,null,null,{"$f":"IF(ISBLANK('JMF SUBMITTAL FORM'!D57),\" \",'JMF SUBMITTAL FORM'!D57)","v":" "},null,{"$f":"IF(ISBLANK('JMF SUBMITTAL FORM'!AN57),\" \",'JMF SUBMITTAL FORM'!AN57)","v":" "},null,{"$f":"IF(ISBLANK('JMF SUBMITTAL FORM'!AT57),\" \",'JMF SUBMITTAL FORM'!AT57)","v":" "},{"$f":"'JMF INPUT SHEET'!K4","v":0}]
[null,{"$f":"IF(ISBLANK('JMF SUBMITTAL FORM'!W59),\" \",'JMF SUBMITTAL FORM'!W59)","v":" "},null,null,null,{"$f":"IF(ISBLANK('JMF SUBMITTAL FORM'!D59),\" \",'JMF SUBMITTAL FORM'!D59)","v":" "},null,{"$f":"IF(ISBLANK('JMF SUBMITTAL FORM'!AN59),\" \",'JMF SUBMITTAL FORM'!AN59)","v":" "},null,{"$f":"IF(ISBLANK('JMF SUBMITTAL FORM'!AT59),\" \",'JMF SUBMITTAL FORM'!AT59)","v":" "}]
[null,{"$f":"IF(ISBLANK('JMF SUBMITTAL FORM'!W61),\" \",'JMF SUBMITTAL FORM'!W61)","v":" "},null,null,null,{"$f":"IF(ISBLANK('JMF SUBMITTAL FORM'!D61),\" \",'JMF SUBMITTAL FORM'!D61)","v":" "},null,{"$f":"IF(ISBLANK('JMF SUBMITTAL FORM'!AN61),\" \",'JMF SUBMITTAL FORM'!AN61)","v":" "},null,{"$f":"IF(ISBLANK('JMF SUBMITTAL FORM'!AT61),\" \",'JMF SUBMITTAL FORM'!AT61)","v":" "}]
[null,null,"DESIGN AIR:",null,{"$f":"'JMF SUBMITTAL FORM'!G66","v":0},"MAXIMUM W/Cm:",null,{"$f":"'JMF SUBMITTAL FORM'!AE65","v":{"$error":"#DIV/0!"}},"Water",{"$f":"'JMF SUBMITTAL FORM'!AT66","v":0},{"$f":"J19/8.34","v":0}]
[null,null,null,null,null,null,null,null,null,null,"GAL"]
[null,null,null,null,null,{"$f":"IF(OR('JMF SUBMITTAL FORM'!D55:L61=\"MICRO-FINES\"),\"W/POWDER:\",\" \")","v":" "},null,{"$f":"IF(OR('JMF SUBMITTAL FORM'!D55:L61=\"MICRO-FINES\"),'JMF SUBMITTAL FORM'!AB64,\" \")","v":" "}]
["ADMIXTURES:"]
[null,"Source",null,null,null,"Admix Type"]
[null,{"$f":"IF(ISBLANK('JMF SUBMITTAL FORM'!D72),\" \",'JMF SUBMITTAL FORM'!D72)","v":" "},null,null,null,{"$f":"IF(ISBLANK('JMF SUBMITTAL FORM'!AO72),\" \",'JMF SUBMITTAL FORM'!AO72)","v":" "},null,"Dose the admixtures according to the Manufacturer's recommendations; contract requirements; and project needs."]
[null,{"$f":"IF(ISBLANK('JMF SUBMITTAL FORM'!D74),\" \",'JMF SUBMITTAL FORM'!D74)","v":" "},null,null,null,{"$f":"IF(ISBLANK('JMF SUBMITTAL FORM'!AO74),\" \",'JMF SUBMITTAL FORM'!AO74)","v":" "}]
[null,{"$f":"IF(ISBLANK('JMF SUBMITTAL FORM'!D76),\" \",'JMF SUBMITTAL FORM'!D76)","v":" "},null,null,null,{"$f":"IF(ISBLANK('JMF SUBMITTAL FORM'!AO76),\" \",'JMF SUBMITTAL FORM'!AO76)","v":" "}]
[null,{"$f":"IF(ISBLANK('JMF SUBMITTAL FORM'!D78),\" \",'JMF SUBMITTAL FORM'!D78)","v":" "},null,null,null,{"$f":"IF(ISBLANK('JMF SUBMITTAL FORM'!AO78),\" \",'JMF SUBMITTAL FORM'!AO78)","v":" "}]
[null,{"$f":"IF(ISBLANK('JMF SUBMITTAL FORM'!D80),\" \",'JMF SUBMITTAL FORM'!D80)","v":" "},null,null,null,{"$f":"IF(ISBLANK('JMF SUBMITTAL FORM'!AO80),\" \",'JMF SUBMITTAL FORM'!AO80)","v":" "}]
[]
["MACROFIBER:"]
[null,"Source",null,null,null,"Brand Name",null,null,null,"Dosage (LBS/CY)"]
[null,{"$f":"IF(ISBLANK('JMF SUBMITTAL FORM'!D88),\" \",'JMF SUBMITTAL FORM'!D88)","v":" "},null,null,null,{"$f":"IF(ISBLANK('JMF SUBMITTAL FORM'!W88),\" \",'JMF SUBMITTAL FORM'!W88)","v":" "},null,null,null,{"$f":"IF(ISBLANK('JMF SUBMITTAL FORM'!AT88),\" \",'JMF SUBMITTAL FORM'!AT88)","v":" "}]
[]
["CONCRETE PROPERTIES"]
[null,"DESIGN STRENGTH (psi)",null,{"$f":"'JMF INPUT SHEET'!C27","v":" "},"AGG. CORR. FACTOR",null,{"$f":"'JMF SUBMITTAL FORM'!O48","v":0},"THEO UNIT WT (LB/CF)",null,{"$f":"'JMF INPUT SHEET'!K10","v":{"$error":"#DIV/0!"}}]
[null,{"$f":"IF('JMF SUBMITTAL FORM'!H21=\"QC MS\",\"20 HOUR FLEX STRENGTH (psi)\",IF('JMF SUBMITTAL FORM'!H21=\"QC FS\",\"3 HOUR FLEX STRENGTH (psi)\",IF('JMF SUBMITTAL FORM'!H21=\"QC RS\",\"3 HOUR FLEX STRENGTH (psi)\",IF('JMF SUBMITTAL FORM'!H21=\"RRCM\",\"3 HOUR FLEX STRENGTH (psi)\",\"3 DAY STRENGTH (psi)\"))))","v":"3 DAY STRENGTH (psi)"},null,{"$f":"IF('JMF SUBMITTAL FORM'!C93=4,\" \",IF(AND('JMF SUBMITTAL FORM'!C93=1,NOT(OR('JMF SUBMITTAL FORM'!H21=\"QC FS\",'JMF SUBMITTAL FORM'!H21=\"QC MS\",'JMF SUBMITTAL FORM'!H21=\"RRCM\",'JMF SUBMITTAL FORM'!H21=\"QC RS\"))),'JMF SUBMITTAL FORM'!G98,IF(AND('JMF SUBMITTAL FORM'!C93=1,OR('JMF SUBMITTAL FORM'!H21=\"QC FS\",'JMF SUBMITTAL FORM'!H21=\"QC MS\",'JMF SUBMITTAL FORM'!H21=\"RRCM\",'JMF SUBMITTAL FORM'!H21=\"QC RS\")),'JMF SUBMITTAL FORM'!AH98,IF('JMF SUBMITTAL FORM'!C93=2,'JMF SUBMITTAL FORM'!AH125,IF('JMF SUBMITTAL FORM'!C93=3,'JMF SUBMITTAL FORM'!AT157,\" \")))))","v":" "},"TOTAL WEIGHT (LBS)",null,{"$f":"'JMF INPUT SHEET'!K8","v":0},"ABSOLUTE VOLUME (CF)",null,{"$f":"'JMF INPUT SHEET'!K6","v":0}]
[null,{"$f":"IF('JMF SUBMITTAL FORM'!H21=\"QC MS\",\"24 HOUR FLEX STRENGTH (psi)\",IF('JMF SUBMITTAL FORM'!H21=\"QC FS\",\"4 HOUR FLEX STRENGTH (psi)\",IF('JMF SUBMITTAL FORM'!H21=\"QC RS\",\"4 HOUR FLEX STRENGTH (psi)\",IF('JMF SUBMITTAL FORM'!H21=\"RRCM\",\"4 HOUR FLEX STRENGTH (psi)\",\"7 DAY STRENGTH (psi)\"))))","v":"7 DAY STRENGTH (psi)"},null,{"$f":"IF('JMF SUBMITTAL FORM'!C93=4,\" \",IF(AND('JMF SUBMITTAL FORM'!C93=1,NOT(OR('JMF SUBMITTAL FORM'!H21=\"QC FS\",'JMF SUBMITTAL FORM'!H21=\"QC MS\",'JMF SUBMITTAL FORM'!H21=\"RRCM\",'JMF SUBMITTAL FORM'!H21=\"QC RS\"))),'JMF SUBMITTAL FORM'!G100,IF(AND('JMF SUBMITTAL FORM'!C93=1,OR('JMF SUBMITTAL FORM'!H21=\"QC FS\",'JMF SUBMITTAL FORM'!H21=\"QC MS\",'JMF SUBMITTAL FORM'!H21=\"RRCM\",'JMF SUBMITTAL FORM'!H21=\"QC RS\")),'JMF SUBMITTAL FORM'!AH100,IF('JMF SUBMITTAL FORM'!C93=2,'JMF SUBMITTAL FORM'!AH127,IF('JMF SUBMITTAL FORM'!C93=3,'JMF SUBMITTAL FORM'!AT161,\" \")))))","v":" "},"DESIGN SLUMP (INCHES)",null,{"$f":"'JMF SUBMITTAL FORM'!O66","v":0}]
[null,{"$f":"IF('JMF SUBMITTAL FORM'!H21=\"QC MS\",\"28 HOUR FLEX STRENGTH (psi)\",IF('JMF SUBMITTAL FORM'!H21=\"QC FS\",\"6 HOUR FLEX STRENGTH (psi)\",IF('JMF SUBMITTAL FORM'!H21=\"QC RS\",\"6 HOUR FLEX STRENGTH (psi)\",IF('JMF SUBMITTAL FORM'!H21=\"RRCM\",\"6 HOUR FLEX STRENGTH (psi)\",\"28 DAY STRENGTH (psi)\"))))","v":"28 DAY STRENGTH (psi)"},null,{"$f":"IF('JMF SUBMITTAL FORM'!C93=4,\" \",IF(AND('JMF SUBMITTAL FORM'!C93=1,NOT(OR('JMF SUBMITTAL FORM'!H21=\"QC FS\",'JMF SUBMITTAL FORM'!H21=\"QC MS\",'JMF SUBMITTAL FORM'!H21=\"RRCM\",'JMF SUBMITTAL FORM'!H21=\"QC RS\"))),'JMF SUBMITTAL FORM'!G102,IF(AND('JMF SUBMITTAL FORM'!C93=1,OR('JMF SUBMITTAL FORM'!H21=\"QC FS\",'JMF SUBMITTAL FORM'!H21=\"QC MS\",'JMF SUBMITTAL FORM'!H21=\"RRCM\",'JMF SUBMITTAL FORM'!H21=\"QC RS\")),'JMF SUBMITTAL FORM'!AH102,IF('JMF SUBMITTAL FORM'!C93=2,'JMF SUBMITTAL FORM'!AH129,IF('JMF SUBMITTAL FORM'!C93=3,'JMF SUBMITTAL FORM'!AP155,\" \")))))","v":" "},"SPECIAL DESIGN INFO:",null,{"$f":"IF(ISBLANK('JMF SUBMITTAL FORM'!AG27),\"NONE \",'JMF SUBMITTAL FORM'!AG27)","v":"NONE "}]
[null,{"$f":"IF('JMF SUBMITTAL FORM'!H21=\"QC MS\",\"\",IF('JMF SUBMITTAL FORM'!H21=\"QC FS\",\"8 HOUR FLEX STRENGTH (psi)\",IF('JMF SUBMITTAL FORM'!H21=\"QC RS\",\"8 HOUR FLEX STRENGTH (psi)\",IF('JMF SUBMITTAL FORM'!H21=\"RRCM\",\"8 HOUR FLEX STRENGTH (psi)\",IF('JMF SUBMITTAL FORM'!AT21>28,'JMF SUBMITTAL FORM'!AT21&\" DAY STRENGTH (psi)\",\"\")))))","v":""},null,{"$f":"IF('JMF SUBMITTAL FORM'!C93=4,\" \",IF(AND('JMF SUBMITTAL FORM'!C93=1,NOT(OR('JMF SUBMITTAL FORM'!H21=\"QC FS\",'JMF SUBMITTAL FORM'!H21=\"QC MS\",'JMF SUBMITTAL FORM'!H21=\"RRCM\",'JMF SUBMITTAL FORM'!H21=\"QC RS\"))),'JMF SUBMITTAL FORM'!G104,IF(AND('JMF SUBMITTAL FORM'!C93=1,OR('JMF SUBMITTAL FORM'!H21=\"QC FS\",'JMF SUBMITTAL FORM'!H21=\"QC MS\",'JMF SUBMITTAL FORM'!H21=\"RRCM\",'JMF SUBMITTAL FORM'!H21=\"QC RS\")),'JMF SUBMITTAL FORM'!AH104,IF('JMF SUBMITTAL FORM'!C93=2,'JMF SUBMITTAL FORM'!AH131,\" \"))))","v":" "}]
["REMARKS:"]
[null,"Check the above information for accuracy.  Notify OMM within 3 business days of incorrect information."]
[null,{"$f":"IF(ISBLANK('JMF INPUT SHEET'!A43),\" \",'JMF INPUT SHEET'!A43)","v":" "}]
[]
[]
[]
[]
[]
[]
["The aggregate design weights provided above are in Saturated Surface Dry (SSD) condition.  Adjustments to the batch weights and mix water are to be made to compensate for the moisture of the aggregates during mixing to assure that the specified W/Cm ratio is not exceeded.  \n\nChanges to aggregate sources requires a new JMF #. When only changing sources of certified cementitious materials or prequalified admixtures, provide OMM with the updated source, brand name, and dosage rate if applicable."]

{"sheet":"OPTIMIZED GRADATION TOOLS","index":4,"n_rows":33,"n_cols":12,"rows_kept":33,"cut":false,"hidden":false,"merged":[[15,6,18,6],[15,5,18,5],[14,5,14,6],[14,1,14,4],[3,9,3,11],[11,0,11,6],[8,1,9,7],[3,1,4,7],[5,1,6,7],[0,9,0,10],[0,0,0,4],[0,5,0,8],[13,0,13,6],[2,1,2,7],[7,1,7,7],[4,9,4,10],[5,9,5,10],[6,9,6,10],[8,9,8,12]]}
["PCC Mix Design - Optimized Aggregate Gradation",null,null,null,null,"Ohio Department of Transportation",null,null,null,"Version 1.3",null,"2025-01-22"]
[]
[null,"Instructions:"]
[null,{"$f":"\"- Please use the highlighted boxes below to enter in gradations for the selected aggregates in the JMF.\"","v":"- Please use the highlighted boxes below to enter in gradations for the selected aggregates in the JMF."},null,null,null,null,null,null,null,"Coarseness Factor Chart Data"]
[null,null,null,null,null,null,null,null,null,"Adjusted Workability",null,{"$f":"L6+('JMF SUBMITTAL FORM'!AT64-564)/94*2.5","v":-15}]
[null,{"$f":"\"- Please ensure you have entered in the JMF Form Batch Weights before entering in the aggregate gradations\"","v":"- Please ensure you have entered in the JMF Form Batch Weights before entering in the aggregate gradations"},null,null,null,null,null,null,null,"Workability",null,{"$f":"F27","v":0}]
[null,null,null,null,null,null,null,null,null,"Coarseness Factor",null,{"$f":"IF(G25=G24,SUM(G20:G24)/SUM((G20:G24,G26:G27))*100,SUM(G20:G24)/SUM(G20:G27)*100)","v":{"$error":"#DIV/0!"}}]
[null,{"$f":"\"* If Aggregate Seive No. is not specified in Report, please leave blank (i.e. 1/4\"\" and # 40)\"","v":"* If Aggregate Seive No. is not specified in Report, please leave blank (i.e. 1/4\" and # 40)"}]
[null,{"$f":"\"* For Trial Purposes: You may use the '% Mass Entered' to enter approximate % Mass, otherwise enter in results from '% Mass (JMF Computed)'\"","v":"* For Trial Purposes: You may use the '% Mass Entered' to enter approximate % Mass, otherwise enter in results from '% Mass (JMF Computed)'"},null,null,null,null,null,null,null,"Note: Included are Tarantula Curve Sheet Details for Paving and Structural Concrete"]
[]
[]
[{"$f":"IF(OR(AND(ISBLANK(B18:E18)),AND(SUM(B18:E18)<=100.01,SUM(B18:E18)>=99.99)),\"\",\"*WARNING: PLEASE ENSURE % MASS ENTERED ADDS UP TO 100%*\")","v":""}]
[]
["Aggregate Gradations Results"]
[null,"Individual Aggregate % Passing",null,null,null,"Combined"]
["JMF Aggregate List:","Aggregate 1","Aggregate 2","Aggregate 3","Aggregate 4","% Passing","% Retained"]
["% Mass (JMF Computed)",{"$f":"IF('JMF SUBMITTAL FORM'!AW40=\" \",0,'JMF SUBMITTAL FORM'!AW40*100)","v":0},{"$f":"IF('JMF SUBMITTAL FORM'!AW42=\" \",0,'JMF SUBMITTAL FORM'!AW42*100)","v":0},{"$f":"IF('JMF SUBMITTAL FORM'!AW44=\" \",0,'JMF SUBMITTAL FORM'!AW44*100)","v":0},{"$f":"IF('JMF SUBMITTAL FORM'!AW46=\" \",0,'JMF SUBMITTAL FORM'!AW46*100)","v":0}]
["% Mass Entered"]
["Material",{"$f":"IF(ISBLANK('JMF SUBMITTAL FORM'!W40),\"\",IF(ISNUMBER(SEARCH(\"Sand\",'JMF SUBMITTAL FORM'!W40)),\"Sand\",IF(ISNUMBER(SEARCH(\"No. 8\",'JMF SUBMITTAL FORM'!W40)),\"No. 8\", IF(ISNUMBER(SEARCH(\"No. 57\",'JMF SUBMITTAL FORM'!W40)),\"No. 57\",IF(ISNUMBER(SEARCH(\"No. 67\",'JMF SUBMITTAL FORM'!W40)),\"No. 67\",'JMF SUBMITTAL FORM'!W40)))))","v":""},{"$f":"IF(ISBLANK('JMF SUBMITTAL FORM'!W42),\"\",IF(ISNUMBER(SEARCH(\"Sand\",'JMF SUBMITTAL FORM'!W42)),\"Sand\",IF(ISNUMBER(SEARCH(\"No. 8\",'JMF SUBMITTAL FORM'!W42)),\"No. 8\", IF(ISNUMBER(SEARCH(\"No. 57\",'JMF SUBMITTAL FORM'!W42)),\"No. 57\",IF(ISNUMBER(SEARCH(\"No. 67\",'JMF SUBMITTAL FORM'!W42)),\"No. 67\",'JMF SUBMITTAL FORM'!W42)))))","v":""},{"$f":"IF(ISBLANK('JMF SUBMITTAL FORM'!W44),\"\",IF(ISNUMBER(SEARCH(\"Sand\",'JMF SUBMITTAL FORM'!W44)),\"Sand\",IF(ISNUMBER(SEARCH(\"No. 8\",'JMF SUBMITTAL FORM'!W44)),\"No. 8\", IF(ISNUMBER(SEARCH(\"No. 57\",'JMF SUBMITTAL FORM'!W44)),\"No. 57\",IF(ISNUMBER(SEARCH(\"No. 67\",'JMF SUBMITTAL FORM'!W44)),\"No. 67\",'JMF SUBMITTAL FORM'!W44)))))","v":""},{"$f":"IF(ISBLANK('JMF SUBMITTAL FORM'!W46),\"\",IF(ISNUMBER(SEARCH(\"Sand\",'JMF SUBMITTAL FORM'!W46)),\"Sand\",IF(ISNUMBER(SEARCH(\"No. 8\",'JMF SUBMITTAL FORM'!W46)),\"No. 8\", IF(ISNUMBER(SEARCH(\"No. 57\",'JMF SUBMITTAL FORM'!W46)),\"No. 57\",IF(ISNUMBER(SEARCH(\"No. 67\",'JMF SUBMITTAL FORM'!W46)),\"No. 67\",'JMF SUBMITTAL FORM'!W46)))))","v":""}]
["1½ inch (37.5 mm)",null,null,null,null,{"$f":"(IF(ISBLANK(B20),100*$B$18/100,B20*$B$18/100))+(IF(ISBLANK(C20),100*$C$18/100,C20*$C$18/100))+(IF(ISBLANK(D20),100*$D$18/100,D20*$D$18/100))+(IF(ISBLANK(E20),100*$E$18/100,E20*$E$18/100))","v":0},{"$f":"IF($F$20=0,0,1-F20/100)","v":0}]
["1 inch (25 mm)",null,null,null,null,{"$f":"(IF(ISBLANK(B21),100*$B$18/100,B21*$B$18/100))+(IF(ISBLANK(C21),100*$C$18/100,C21*$C$18/100))+(IF(ISBLANK(D21),100*$D$18/100,D21*$D$18/100))+(IF(ISBLANK(E21),100*$E$18/100,E21*$E$18/100))","v":0},{"$f":"IF($F$20=0,0,F20/100-F21/100)","v":0}]
["3/4 inch (19 mm)",null,null,null,null,{"$f":"(IF(ISBLANK(B22),100*$B$18/100,B22*$B$18/100))+(IF(ISBLANK(C22),100*$C$18/100,C22*$C$18/100))+(IF(ISBLANK(D22),100*$D$18/100,D22*$D$18/100))+(IF(ISBLANK(E22),100*$E$18/100,E22*$E$18/100))","v":0},0]
["1/2 inch (12.5 mm)",null,null,null,null,{"$f":"(IF(ISBLANK(B23),100*$B$18/100,B23*$B$18/100))+(IF(ISBLANK(C23),100*$C$18/100,C23*$C$18/100))+(IF(ISBLANK(D23),100*$D$18/100,D23*$D$18/100))+(IF(ISBLANK(E23),100*$E$18/100,E23*$E$18/100))","v":0},0]
["3/8 inch (9.5 mm)",null,null,null,null,{"$f":"(IF(ISBLANK(B24),100*$B$18/100,B24*$B$18/100))+(IF(ISBLANK(C24),100*$C$18/100,C24*$C$18/100))+(IF(ISBLANK(D24),100*$D$18/100,D24*$D$18/100))+(IF(ISBLANK(E24),100*$E$18/100,E24*$E$18/100))","v":0},0]
["1/4 inch (6.3 mm)*",null,null,null,null,{"$f":"IF(ISBLANK(AND($B$25:$E$25)),$F$24,(IF(ISBLANK('Gradation Interp. Vals & % Pass'!J14),100*$B$18/100,'Gradation Interp. Vals & % Pass'!J14*$B$18/100))+(IF(ISBLANK('Gradation Interp. Vals & % Pass'!K14),100*$C$18/100,'Gradation Interp. Vals & % Pass'!K14*$C$18/100))+(IF(ISBLANK('Gradation Interp. Vals & % Pass'!L14),100*$D$18/100,'Gradation Interp. Vals & % Pass'!L14*$D$18/100))+(IF(ISBLANK('Gradation Interp. Vals & % Pass'!M14),100*$E$18/100,'Gradation Interp. Vals & % Pass'!M14*$E$18/100)))","v":0},{"$f":"IF($F$20=0,0,IF(F25=F24,G24,F24/100-F25/100))","v":0}]
["#4 (4.75 mm)",null,null,null,null,{"$f":"(IF(ISBLANK(B26),100*$B$18/100,B26*$B$18/100))+(IF(ISBLANK(C26),100*$C$18/100,C26*$C$18/100))+(IF(ISBLANK(D26),100*$D$18/100,D26*$D$18/100))+(IF(ISBLANK(E26),100*$E$18/100,E26*$E$18/100))","v":0},{"$f":"IF($F$20=0,0,F25/100-F26/100)","v":0}]
["# 8 (2.36 mm)",null,null,null,null,{"$f":"(IF(ISBLANK(B27),100*$B$18/100,B27*$B$18/100))+(IF(ISBLANK(C27),100*$C$18/100,C27*$C$18/100))+(IF(ISBLANK(D27),100*$D$18/100,D27*$D$18/100))+(IF(ISBLANK(E27),100*$E$18/100,E27*$E$18/100))","v":0},0]
["# 16 (1.18 mm)",null,null,null,null,{"$f":"(IF(ISBLANK(B28),0*$B$18/100,B28*$B$18/100))+(IF(ISBLANK(C28),0*$C$18/100,C28*$C$18/100))+(IF(ISBLANK(D28),0*$D$18/100,D28*$D$18/100))+(IF(ISBLANK(E28),0*$E$18/100,E28*$E$18/100))","v":0},0]
["# 30 (600 µm)",null,null,null,null,0,0]
["# 40 (425 µm)*",null,null,null,null,{"$f":"IF(ISBLANK(AND($B$30:$E$30)),$F$29,IF(ISBLANK('Gradation Interp. Vals & % Pass'!J21),0*$B$18/100,'Gradation Interp. Vals & % Pass'!J21*$B$18/100))+(IF(ISBLANK('Gradation Interp. Vals & % Pass'!K21),0*$C$18/100,'Gradation Interp. Vals & % Pass'!K21*$C$18/100))+(IF(ISBLANK('Gradation Interp. Vals & % Pass'!L21),0*$D$18/100,'Gradation Interp. Vals & % Pass'!L21*$D$18/100))+(IF(ISBLANK('Gradation Interp. Vals & % Pass'!M21),0*$E$18/100,'Gradation Interp. Vals & % Pass'!M21*$E$18/100))","v":0},{"$f":"IF($F$20=0,0,IF(F30=F29,G29,F29/100-F30/100))","v":0}]
["# 50 (300 µm)",null,null,null,null,0,0]
["# 100 (150 µm)",null,null,null,null,0,{"$f":"IF($F$20=0,0,F31/100-F32/100)","v":0}]
["# 200 (75 µm)",null,null,null,null,0,0]

{"sheet":"Tarantula Paving Details","index":5,"n_rows":0,"n_cols":0,"rows_kept":0,"cut":false,"hidden":false,"merged":[]}

{"sheet":"Tarantula Structural Details","index":6,"n_rows":0,"n_cols":0,"rows_kept":0,"cut":false,"hidden":false,"merged":[]}

{"sheet":"Gradation Limits","index":7,"n_rows":24,"n_cols":25,"rows_kept":24,"cut":false,"hidden":true,"merged":[[0,5,0,14],[1,7,1,8],[1,9,1,10],[8,17,8,20],[9,17,9,18],[8,21,8,24],[9,21,9,22],[1,5,1,6],[1,11,1,12],[1,13,1,14]]}
["Tarantula % Retained Upper limit","Tarantula % Retained Lower limit",null,"Gradation Values",null,"Coarseness Factor Chart Limits"]
[0,0,null,"1.5\"",null,"Upper Line",null,"Trend Bar upper",null,"Trend bar lower",null,"vertical line left",null,"vertical line right"]
[0.16,0,null,"1\"",null,"x","y","x","y","x","y","x","y","x","y"]
[0.2,0,null,"3/4\"",null,100,35.5,{"$f":"J4","v":100},{"$f":"K4+2","v":27},100,25,75,39.299999999999997,45,32.75]
[0.2,0.04,null,"1/2\"",null,{"$f":"(48-50.864)/(-0.1536)","v":18.645833333333318},48,85,{"$f":"K5+2","v":27},85,25,75,28.5,45,43.95]
[0.2,0.04,null,"3/8 \"",null,null,null,15,{"$f":"K6+2","v":37},15,35]
[0.2,0.04,null,"1/4 \"",null,null,null,15,{"$f":"K7+2","v":37},15,35]
[0.2,0.04,null,"# 4 ",null,null,null,{"$f":"J8","v":0},{"$f":"K8+2","v":37},0,35]
[0.12,0,null,"# 8 ",null,null,null,null,null,null,null,null,null,null,null,null,null,"Paving Tarantula Fine/Coarse Plots",null,null,null,"Flowable Tarantula Fine/Coarse Plots"]
[0.12,0,null,"# 16",null,null,null,null,null,null,null,null,null,null,null,null,null,"Fine Box",null,"Coarse Center Point","Fine Center Point","Fine Box",null,"Coarse Center Point","Fine Center Point"]
[0.2,0.04,null,"# 30",null,null,null,null,null,null,null,null,null,null,null,null,"1½ inch (37.5 mm)"]
[0.2,0.04,null,"# 40",null,null,null,null,null,null,null,null,null,null,null,null,"1 inch (25 mm)"]
[0.2,0.04,null,"# 50",null,null,null,null,null,null,null,null,null,null,null,null,"3/4 inch (19 mm)"]
[0.1,0,null,"# 100",null,null,null,null,null,null,null,null,null,null,null,null,"1/2 inch (12.5 mm)"]
[0.02,0,null,"# 200",null,null,null,null,null,null,null,null,null,null,null,null,"3/8 inch (9.5 mm)"]
[null,null,null,null,null,null,null,null,null,null,null,null,null,null,null,null,"1/4 inch (6.3 mm)*"]
[null,null,null,null,null,null,null,null,null,null,null,null,null,null,null,null,"#4 (4.75 mm)"]
[null,null,null,null,null,null,null,null,null,null,null,null,null,null,null,null,"# 8 (2.36 mm)"]
[null,null,null,null,null,null,null,null,null,null,null,null,null,null,null,null,"# 16 (1.18 mm)",null,null,0.3,null,null,null,0.3]
[null,null,null,null,null,null,null,null,null,null,null,null,null,null,null,null,"# 30 (600 µm)",0.34,0.24,null,null,0.4,0.25]
[null,null,null,null,null,null,null,null,null,null,null,null,null,null,null,null,"# 40 (425 µm)*",0.34,0.24,null,null,0.4,0.25]
[null,null,null,null,null,null,null,null,null,null,null,null,null,null,null,null,"# 50 (300 µm)",0.34,0.24,null,0.28999999999999998,0.4,0.25,null,0.32500000000000001]
[null,null,null,null,null,null,null,null,null,null,null,null,null,null,null,null,"# 100 (150 µm)",0.34,0.24,null,null,0.4,0.25]
[null,null,null,null,null,null,null,null,null,null,null,null,null,null,null,null,"# 200 (75 µm)",0.34,0.24,null,null,0.4,0.25]

{"sheet":"Gradation Interp. Vals & % Pass","index":8,"n_rows":31,"n_cols":19,"rows_kept":31,"cut":false,"hidden":true,"merged":[[10,14,10,18],[14,14,15,18],[11,9,11,12],[18,9,18,12],[10,0,10,6],[11,1,11,4],[11,5,11,6],[12,5,14,5],[12,6,14,6]]}
[]
[]
[]
[]
[]
[]
[]
[]
[]
[]
["Aggregate Gradations Results",null,null,null,null,null,null,null,null,null,null,null,null,null,"Interpolation for Individual Aggs*"]
[null,"Individual Aggregate % Passing",null,null,null,"Combined",null,null,null,"%passing 1/4\" Seive Size",null,null,null,null,"Sieve Size","Agg 1 Interp.","Agg 2 Interp.","Agg 3 Interp.","Agg 4 Interp."]
["JMF Aggregate List:","Aggregate 1","Aggregate 2","Aggregate 3","Aggregate 4","% Passing","% Retained",null,null,"Agg 1","Agg 2","Agg 3","Agg 4",null,"1/4\"",{"$f":"IF(ISBLANK('OPTIMIZED GRADATION TOOLS'!B25),('OPTIMIZED GRADATION TOOLS'!B26+(6.3-4.75)*('OPTIMIZED GRADATION TOOLS'!B24-'OPTIMIZED GRADATION TOOLS'!B26)/(9.5-4.75)),'OPTIMIZED GRADATION TOOLS'!B25)","v":0},{"$f":"IF(ISBLANK('OPTIMIZED GRADATION TOOLS'!C25),('OPTIMIZED GRADATION TOOLS'!C26+(6.3-4.75)*('OPTIMIZED GRADATION TOOLS'!C24-'OPTIMIZED GRADATION TOOLS'!C26)/(9.5-4.75)),'OPTIMIZED GRADATION TOOLS'!C25)","v":0},{"$f":"IF(ISBLANK('OPTIMIZED GRADATION TOOLS'!D25),('OPTIMIZED GRADATION TOOLS'!D26+(6.3-4.75)*('OPTIMIZED GRADATION TOOLS'!D24-'OPTIMIZED GRADATION TOOLS'!D26)/(9.5-4.75)),'OPTIMIZED GRADATION TOOLS'!D25)","v":0},{"$f":"IF(ISBLANK('OPTIMIZED GRADATION TOOLS'!E25),('OPTIMIZED GRADATION TOOLS'!E26+(6.3-4.75)*('OPTIMIZED GRADATION TOOLS'!E24-'OPTIMIZED GRADATION TOOLS'!E26)/(9.5-4.75)),'OPTIMIZED GRADATION TOOLS'!E25)","v":0}]
["% Mass",{"$f":"IF('JMF SUBMITTAL FORM'!AW40=\" \",0,'JMF SUBMITTAL FORM'!AW40*100)","v":0},{"$f":"IF('JMF SUBMITTAL FORM'!AW42=\" \",0,'JMF SUBMITTAL FORM'!AW42*100)","v":0},{"$f":"IF('JMF SUBMITTAL FORM'!AW44=\" \",0,'JMF SUBMITTAL FORM'!AW44*100)","v":0},{"$f":"IF('JMF SUBMITTAL FORM'!AW46=\" \",0,'JMF SUBMITTAL FORM'!AW46*100)","v":0},null,null,null,null,{"$f":"IF(ISBLANK('OPTIMIZED GRADATION TOOLS'!B25),IF(ISBLANK('OPTIMIZED GRADATION TOOLS'!B24),100,'OPTIMIZED GRADATION TOOLS'!B24)-'OPTIMIZED GRADATION TOOLS'!B25,'OPTIMIZED GRADATION TOOLS'!B25)","v":100},{"$f":"IF(ISBLANK('OPTIMIZED GRADATION TOOLS'!C25),IF(ISBLANK('OPTIMIZED GRADATION TOOLS'!C24),100,'OPTIMIZED GRADATION TOOLS'!C24)-'OPTIMIZED GRADATION TOOLS'!C25,'OPTIMIZED GRADATION TOOLS'!C25)","v":100},{"$f":"IF(ISBLANK('OPTIMIZED GRADATION TOOLS'!D25),IF(ISBLANK('OPTIMIZED GRADATION TOOLS'!D24),100,'OPTIMIZED GRADATION TOOLS'!D24)-'OPTIMIZED GRADATION TOOLS'!D25,'OPTIMIZED GRADATION TOOLS'!D25)","v":100},{"$f":"IF(ISBLANK('OPTIMIZED GRADATION TOOLS'!E25),IF(ISBLANK('OPTIMIZED GRADATION TOOLS'!E24),100,'OPTIMIZED GRADATION TOOLS'!E24)-'OPTIMIZED GRADATION TOOLS'!E25,'OPTIMIZED GRADATION TOOLS'!E25)","v":100},null,"#40",{"$f":"IF(ISBLANK('OPTIMIZED GRADATION TOOLS'!B30),('OPTIMIZED GRADATION TOOLS'!B31+(6.3-4.75)*('OPTIMIZED GRADATION TOOLS'!B29-'OPTIMIZED GRADATION TOOLS'!B31)/(9.5-4.75)),'OPTIMIZED GRADATION TOOLS'!B30)","v":0},{"$f":"IF(ISBLANK('OPTIMIZED GRADATION TOOLS'!C30),('OPTIMIZED GRADATION TOOLS'!C31+(6.3-4.75)*('OPTIMIZED GRADATION TOOLS'!C29-'OPTIMIZED GRADATION TOOLS'!C31)/(9.5-4.75)),'OPTIMIZED GRADATION TOOLS'!C30)","v":0},{"$f":"IF(ISBLANK('OPTIMIZED GRADATION TOOLS'!D30),('OPTIMIZED GRADATION TOOLS'!D31+(6.3-4.75)*('OPTIMIZED GRADATION TOOLS'!D29-'OPTIMIZED GRADATION TOOLS'!D31)/(9.5-4.75)),'OPTIMIZED GRADATION TOOLS'!D30)","v":0},{"$f":"IF(ISBLANK('OPTIMIZED GRADATION TOOLS'!E30),('OPTIMIZED GRADATION TOOLS'!E31+(6.3-4.75)*('OPTIMIZED GRADATION TOOLS'!E29-'OPTIMIZED GRADATION TOOLS'!E31)/(9.5-4.75)),'OPTIMIZED GRADATION TOOLS'!E30)","v":0}]
["Material",{"$f":"IF(ISBLANK('JMF SUBMITTAL FORM'!W40),\"\",IF(ISNUMBER(SEARCH(\"Sand\",'JMF SUBMITTAL FORM'!W40)),\"Sand\",IF(ISNUMBER(SEARCH(\"No. 8\",'JMF SUBMITTAL FORM'!W40)),\"No. 8\", IF(ISNUMBER(SEARCH(\"No. 57\",'JMF SUBMITTAL FORM'!W40)),\"No. 57\",IF(ISNUMBER(SEARCH(\"No. 67\",'JMF SUBMITTAL FORM'!W40)),\"No. 67\",'JMF SUBMITTAL FORM'!W40)))))","v":""},{"$f":"IF(ISBLANK('JMF SUBMITTAL FORM'!W42),\"\",IF(ISNUMBER(SEARCH(\"Sand\",'JMF SUBMITTAL FORM'!W42)),\"Sand\",IF(ISNUMBER(SEARCH(\"No. 8\",'JMF SUBMITTAL FORM'!W42)),\"No. 8\", IF(ISNUMBER(SEARCH(\"No. 57\",'JMF SUBMITTAL FORM'!W42)),\"No. 57\",IF(ISNUMBER(SEARCH(\"No. 67\",'JMF SUBMITTAL FORM'!W42)),\"No. 67\",'JMF SUBMITTAL FORM'!W42)))))","v":""},{"$f":"IF(ISBLANK('JMF SUBMITTAL FORM'!W44),\"\",IF(ISNUMBER(SEARCH(\"Sand\",'JMF SUBMITTAL FORM'!W44)),\"Sand\",IF(ISNUMBER(SEARCH(\"No. 8\",'JMF SUBMITTAL FORM'!W44)),\"No. 8\", IF(ISNUMBER(SEARCH(\"No. 57\",'JMF SUBMITTAL FORM'!W44)),\"No. 57\",IF(ISNUMBER(SEARCH(\"No. 67\",'JMF SUBMITTAL FORM'!W44)),\"No. 67\",'JMF SUBMITTAL FORM'!W44)))))","v":""},{"$f":"IF(ISBLANK('JMF SUBMITTAL FORM'!W46),\"\",IF(ISNUMBER(SEARCH(\"Sand\",'JMF SUBMITTAL FORM'!W46)),\"Sand\",IF(ISNUMBER(SEARCH(\"No. 8\",'JMF SUBMITTAL FORM'!W46)),\"No. 8\", IF(ISNUMBER(SEARCH(\"No. 57\",'JMF SUBMITTAL FORM'!W46)),\"No. 57\",IF(ISNUMBER(SEARCH(\"No. 67\",'JMF SUBMITTAL FORM'!W46)),\"No. 67\",'JMF SUBMITTAL FORM'!W46)))))","v":""},null,null,null,null,null,null,null,null,null,"*Note: If 1/4\" and #40 gradations are blank, it will interpolate. If it isn't blank it will use value entered in gradation"]
["1½ inch (37.5 mm)",{"$f":"IF((AND(ISBLANK('OPTIMIZED GRADATION TOOLS'!$B$20:$B$33))),\"\",IF(ISBLANK('OPTIMIZED GRADATION TOOLS'!B20),100,'OPTIMIZED GRADATION TOOLS'!B20))","v":""},{"$f":"IF((AND(ISBLANK('OPTIMIZED GRADATION TOOLS'!$C$20:$C$33))),\"\",IF(ISBLANK('OPTIMIZED GRADATION TOOLS'!C20),100,'OPTIMIZED GRADATION TOOLS'!C20))","v":""},{"$f":"IF((AND(ISBLANK('OPTIMIZED GRADATION TOOLS'!$D$20:$D$33))),\"\",IF(ISBLANK('OPTIMIZED GRADATION TOOLS'!D20),100,'OPTIMIZED GRADATION TOOLS'!D20))","v":""},{"$f":"IF((AND(ISBLANK('OPTIMIZED GRADATION TOOLS'!$E$20:$E$33))),\"\",IF(ISBLANK('OPTIMIZED GRADATION TOOLS'!E20),100,'OPTIMIZED GRADATION TOOLS'!E20))","v":""},{"$f":"(IF(ISBLANK(B16),100*$B$14/100,B16*$B$14/100))+(IF(ISBLANK(C16),100*$C$14/100,C16*$C$14/100))+(IF(ISBLANK(D16),100*$D$14/100,D16*$D$14/100))+(IF(ISBLANK(E16),100*$E$14/100,E16*$E$14/100))","v":{"$error":"#VALUE!"}},{"$f":"IF($F$16=0,0,1-F16/100)","v":{"$error":"#VALUE!"}}]
["1 inch (25 mm)",{"$f":"IF((AND(ISBLANK('OPTIMIZED GRADATION TOOLS'!$B$20:$B$33))),\"\",IF(ISBLANK('OPTIMIZED GRADATION TOOLS'!B21),100,'OPTIMIZED GRADATION TOOLS'!B21))","v":""},{"$f":"IF((AND(ISBLANK('OPTIMIZED GRADATION TOOLS'!$C$20:$C$33))),\"\",IF(ISBLANK('OPTIMIZED GRADATION TOOLS'!C21),100,'OPTIMIZED GRADATION TOOLS'!C21))","v":""},{"$f":"IF((AND(ISBLANK('OPTIMIZED GRADATION TOOLS'!$D$20:$D$33))),\"\",IF(ISBLANK('OPTIMIZED GRADATION TOOLS'!D21),100,'OPTIMIZED GRADATION TOOLS'!D21))","v":""},{"$f":"IF((AND(ISBLANK('OPTIMIZED GRADATION TOOLS'!$E$20:$E$33))),\"\",IF(ISBLANK('OPTIMIZED GRADATION TOOLS'!E21),100,'OPTIMIZED GRADATION TOOLS'!E21))","v":""},{"$f":"(IF(ISBLANK(B17),100*$B$14/100,B17*$B$14/100))+(IF(ISBLANK(C17),100*$C$14/100,C17*$C$14/100))+(IF(ISBLANK(D17),100*$D$14/100,D17*$D$14/100))+(IF(ISBLANK(E17),100*$E$14/100,E17*$E$14/100))","v":{"$error":"#VALUE!"}},{"$f":"IF($F$16=0,0,F16/100-F17/100)","v":{"$error":"#VALUE!"}}]
["3/4 inch (19 mm)",{"$f":"IF((AND(ISBLANK('OPTIMIZED GRADATION TOOLS'!$B$20:$B$33))),\"\",IF(ISBLANK('OPTIMIZED GRADATION TOOLS'!B22),100,'OPTIMIZED GRADATION TOOLS'!B22))","v":""},{"$f":"IF((AND(ISBLANK('OPTIMIZED GRADATION TOOLS'!$C$20:$C$33))),\"\",IF(ISBLANK('OPTIMIZED GRADATION TOOLS'!C22),100,'OPTIMIZED GRADATION TOOLS'!C22))","v":""},{"$f":"IF((AND(ISBLANK('OPTIMIZED GRADATION TOOLS'!$D$20:$D$33))),\"\",IF(ISBLANK('OPTIMIZED GRADATION TOOLS'!D22),100,'OPTIMIZED GRADATION TOOLS'!D22))","v":""},{"$f":"IF((AND(ISBLANK('OPTIMIZED GRADATION TOOLS'!$E$20:$E$33))),\"\",IF(ISBLANK('OPTIMIZED GRADATION TOOLS'!E22),100,'OPTIMIZED GRADATION TOOLS'!E22))","v":""},{"$f":"(IF(ISBLANK(B18),100*$B$14/100,B18*$B$14/100))+(IF(ISBLANK(C18),100*$C$14/100,C18*$C$14/100))+(IF(ISBLANK(D18),100*$D$14/100,D18*$D$14/100))+(IF(ISBLANK(E18),100*$E$14/100,E18*$E$14/100))","v":{"$error":"#VALUE!"}},{"$error":"#VALUE!"}]
["1/2 inch (12.5 mm)",{"$f":"IF((AND(ISBLANK('OPTIMIZED GRADATION TOOLS'!$B$20:$B$33))),\"\",IF(ISBLANK('OPTIMIZED GRADATION TOOLS'!B23),100,'OPTIMIZED GRADATION TOOLS'!B23))","v":""},{"$f":"IF((AND(ISBLANK('OPTIMIZED GRADATION TOOLS'!$C$20:$C$33))),\"\",IF(ISBLANK('OPTIMIZED GRADATION TOOLS'!C23),100,'OPTIMIZED GRADATION TOOLS'!C23))","v":""},{"$f":"IF((AND(ISBLANK('OPTIMIZED GRADATION TOOLS'!$D$20:$D$33))),\"\",IF(ISBLANK('OPTIMIZED GRADATION TOOLS'!D23),100,'OPTIMIZED GRADATION TOOLS'!D23))","v":""},{"$f":"IF((AND(ISBLANK('OPTIMIZED GRADATION TOOLS'!$E$20:$E$33))),\"\",IF(ISBLANK('OPTIMIZED GRADATION TOOLS'!E23),100,'OPTIMIZED GRADATION TOOLS'!E23))","v":""},{"$f":"(IF(ISBLANK(B19),100*$B$14/100,B19*$B$14/100))+(IF(ISBLANK(C19),100*$C$14/100,C19*$C$14/100))+(IF(ISBLANK(D19),100*$D$14/100,D19*$D$14/100))+(IF(ISBLANK(E19),100*$E$14/100,E19*$E$14/100))","v":{"$error":"#VALUE!"}},{"$error":"#VALUE!"},null,null,"%passing # 40 Seive Size"]
["3/8 inch (9.5 mm)",{"$f":"IF((AND(ISBLANK('OPTIMIZED GRADATION TOOLS'!$B$20:$B$33))),\"\",IF(ISBLANK('OPTIMIZED GRADATION TOOLS'!B24),100,'OPTIMIZED GRADATION TOOLS'!B24))","v":""},{"$f":"IF((AND(ISBLANK('OPTIMIZED GRADATION TOOLS'!$C$20:$C$33))),\"\",IF(ISBLANK('OPTIMIZED GRADATION TOOLS'!C24),100,'OPTIMIZED GRADATION TOOLS'!C24))","v":""},{"$f":"IF((AND(ISBLANK('OPTIMIZED GRADATION TOOLS'!$D$20:$D$33))),\"\",IF(ISBLANK('OPTIMIZED GRADATION TOOLS'!D24),100,'OPTIMIZED GRADATION TOOLS'!D24))","v":""},{"$f":"IF((AND(ISBLANK('OPTIMIZED GRADATION TOOLS'!$E$20:$E$33))),\"\",IF(ISBLANK('OPTIMIZED GRADATION TOOLS'!E24),100,'OPTIMIZED GRADATION TOOLS'!E24))","v":""},{"$f":"(IF(ISBLANK(B20),100*$B$14/100,B20*$B$14/100))+(IF(ISBLANK(C20),100*$C$14/100,C20*$C$14/100))+(IF(ISBLANK(D20),100*$D$14/100,D20*$D$14/100))+(IF(ISBLANK(E20),100*$E$14/100,E20*$E$14/100))","v":{"$error":"#VALUE!"}},{"$error":"#VALUE!"},null,null,"Agg 1","Agg 2","Agg 3","Agg 4"]
["1/4 inch (6.3 mm)*",{"$f":"IF(ISBLANK('OPTIMIZED GRADATION TOOLS'!B25),(B22+(6.3-4.75)*(B20-B22)/(9.5-4.75)),'OPTIMIZED GRADATION TOOLS'!B25)","v":{"$error":"#VALUE!"}},{"$f":"IF(ISBLANK('OPTIMIZED GRADATION TOOLS'!C25),(C22+(6.3-4.75)*(C20-C22)/(9.5-4.75)),'OPTIMIZED GRADATION TOOLS'!C25)","v":{"$error":"#VALUE!"}},{"$f":"IF(ISBLANK('OPTIMIZED GRADATION TOOLS'!D25),(D22+(6.3-4.75)*(D20-D22)/(9.5-4.75)),'OPTIMIZED GRADATION TOOLS'!D25)","v":{"$error":"#VALUE!"}},{"$f":"IF(ISBLANK('OPTIMIZED GRADATION TOOLS'!E25),(E22+(6.3-4.75)*(E20-E22)/(9.5-4.75)),'OPTIMIZED GRADATION TOOLS'!E25)","v":{"$error":"#VALUE!"}},{"$f":"IF(AND(ISBLANK(#REF!)),$F$20,(IF(ISBLANK(AA18),100*$B$14/100,AA18*$B$14/100))+(IF(ISBLANK(AB18),100*$C$14/100,AB18*$C$14/100))+(IF(ISBLANK(AC18),100*$D$14/100,AC18*$D$14/100))+(IF(ISBLANK(AD18),100*$E$14/100,AD18*$E$14/100)))","v":0},{"$f":"IF($F$16=0,0,IF(F21=F20,G20,F20/100-F21/100))","v":{"$error":"#VALUE!"}},null,null,{"$f":"IF(ISBLANK('OPTIMIZED GRADATION TOOLS'!B30),'OPTIMIZED GRADATION TOOLS'!B29-'OPTIMIZED GRADATION TOOLS'!B30,'OPTIMIZED GRADATION TOOLS'!B30)","v":0},{"$f":"IF(ISBLANK('OPTIMIZED GRADATION TOOLS'!C30),'OPTIMIZED GRADATION TOOLS'!C29-'OPTIMIZED GRADATION TOOLS'!C30,'OPTIMIZED GRADATION TOOLS'!C30)","v":0},{"$f":"IF(ISBLANK('OPTIMIZED GRADATION TOOLS'!D30),'OPTIMIZED GRADATION TOOLS'!D29-'OPTIMIZED GRADATION TOOLS'!D30,'OPTIMIZED GRADATION TOOLS'!D30)","v":0},{"$f":"IF(ISBLANK('OPTIMIZED GRADATION TOOLS'!E30),'OPTIMIZED GRADATION TOOLS'!E29-'OPTIMIZED GRADATION TOOLS'!E30,'OPTIMIZED GRADATION TOOLS'!E30)","v":0}]
["#4 (4.75 mm)",{"$f":"'OPTIMIZED GRADATION TOOLS'!B26","v":0},{"$f":"'OPTIMIZED GRADATION TOOLS'!C26","v":0},{"$f":"'OPTIMIZED GRADATION TOOLS'!D26","v":0},{"$f":"'OPTIMIZED GRADATION TOOLS'!E26","v":0},{"$f":"(IF(ISBLANK(B22),100*$B$14/100,B22*$B$14/100))+(IF(ISBLANK(C22),100*$C$14/100,C22*$C$14/100))+(IF(ISBLANK(D22),100*$D$14/100,D22*$D$14/100))+(IF(ISBLANK(E22),100*$E$14/100,E22*$E$14/100))","v":0},{"$f":"IF($F$16=0,0,F21/100-F22/100)","v":{"$error":"#VALUE!"}}]
["# 8 (2.36 mm)",{"$f":"'OPTIMIZED GRADATION TOOLS'!B27","v":0},{"$f":"'OPTIMIZED GRADATION TOOLS'!C27","v":0},{"$f":"'OPTIMIZED GRADATION TOOLS'!D27","v":0},{"$f":"'OPTIMIZED GRADATION TOOLS'!E27","v":0},{"$f":"(IF(ISBLANK(B23),100*$B$14/100,B23*$B$14/100))+(IF(ISBLANK(C23),100*$C$14/100,C23*$C$14/100))+(IF(ISBLANK(D23),100*$D$14/100,D23*$D$14/100))+(IF(ISBLANK(E23),100*$E$14/100,E23*$E$14/100))","v":0},{"$f":"IF($F$16=0,0,F22/100-F23/100)","v":{"$error":"#VALUE!"}}]
["# 16 (1.18 mm)",{"$f":"'OPTIMIZED GRADATION TOOLS'!B28","v":0},{"$f":"'OPTIMIZED GRADATION TOOLS'!C28","v":0},{"$f":"'OPTIMIZED GRADATION TOOLS'!D28","v":0},{"$f":"'OPTIMIZED GRADATION TOOLS'!E28","v":0},{"$f":"(IF(ISBLANK(B24),0*$B$14/100,B24*$B$14/100))+(IF(ISBLANK(C24),0*$C$14/100,C24*$C$14/100))+(IF(ISBLANK(D24),0*$D$14/100,D24*$D$14/100))+(IF(ISBLANK(E24),0*$E$14/100,E24*$E$14/100))","v":0},{"$error":"#VALUE!"},{"$f":"SUM('OPTIMIZED GRADATION TOOLS'!$G$27:$G$29)","v":0}]
["# 30 (600 µm)",{"$f":"'OPTIMIZED GRADATION TOOLS'!B29","v":0},{"$f":"'OPTIMIZED GRADATION TOOLS'!C29","v":0},{"$f":"'OPTIMIZED GRADATION TOOLS'!D29","v":0},{"$f":"'OPTIMIZED GRADATION TOOLS'!E29","v":0},0,{"$error":"#VALUE!"},null,null,"Coarse Sand*","Fine Sand^"]
["# 40 (425 µm)*",{"$f":"IF(ISBLANK('OPTIMIZED GRADATION TOOLS'!B30),('OPTIMIZED GRADATION TOOLS'!B31+(6.3-4.75)*('OPTIMIZED GRADATION TOOLS'!B29-'OPTIMIZED GRADATION TOOLS'!B31)/(9.5-4.75)),'OPTIMIZED GRADATION TOOLS'!B30)","v":0},{"$f":"IF(ISBLANK('OPTIMIZED GRADATION TOOLS'!C30),('OPTIMIZED GRADATION TOOLS'!C31+(6.3-4.75)*('OPTIMIZED GRADATION TOOLS'!C29-'OPTIMIZED GRADATION TOOLS'!C31)/(9.5-4.75)),'OPTIMIZED GRADATION TOOLS'!C30)","v":0},{"$f":"IF(ISBLANK('OPTIMIZED GRADATION TOOLS'!D30),('OPTIMIZED GRADATION TOOLS'!D31+(6.3-4.75)*('OPTIMIZED GRADATION TOOLS'!D29-'OPTIMIZED GRADATION TOOLS'!D31)/(9.5-4.75)),'OPTIMIZED GRADATION TOOLS'!D30)","v":0},{"$f":"IF(ISBLANK('OPTIMIZED GRADATION TOOLS'!E30),('OPTIMIZED GRADATION TOOLS'!E31+(6.3-4.75)*('OPTIMIZED GRADATION TOOLS'!E29-'OPTIMIZED GRADATION TOOLS'!E31)/(9.5-4.75)),'OPTIMIZED GRADATION TOOLS'!E30)","v":0},{"$f":"IF(AND(ISBLANK(#REF!)),$F$25,IF(ISBLANK(AA25),0*$B$14/100,AA25*$B$14/100))+(IF(ISBLANK(AB25),0*$C$14/100,AB25*$C$14/100))+(IF(ISBLANK(AC25),0*$D$14/100,AC25*$D$14/100))+(IF(ISBLANK(AD25),0*$E$14/100,AD25*$E$14/100))","v":0},{"$f":"IF($F$16=0,0,IF(F26=F25,G25,F25/100-F26/100))","v":{"$error":"#VALUE!"}},null,null,{"$f":"SUM('OPTIMIZED GRADATION TOOLS'!$G$27:$G$29)","v":0},{"$f":"IF(AND(ISBLANK('OPTIMIZED GRADATION TOOLS'!B30:E30)),SUM('OPTIMIZED GRADATION TOOLS'!G29,'OPTIMIZED GRADATION TOOLS'!G31:G33),(SUM('OPTIMIZED GRADATION TOOLS'!$G$29:$G$33)))","v":0}]
["# 50 (300 µm)",{"$f":"'OPTIMIZED GRADATION TOOLS'!B31","v":0},{"$f":"'OPTIMIZED GRADATION TOOLS'!C31","v":0},{"$f":"'OPTIMIZED GRADATION TOOLS'!D31","v":0},{"$f":"'OPTIMIZED GRADATION TOOLS'!E31","v":0},{"$f":"(IF(ISBLANK(B27),0*$B$14/100,B27*$B$14/100))+(IF(ISBLANK(C27),0*$C$14/100,C27*$C$14/100))+(IF(ISBLANK(D27),0*$D$14/100,D27*$D$14/100))+(IF(ISBLANK(E27),0*$E$14/100,E27*$E$14/100))","v":0},{"$f":"IF($F$16=0,0,F26/100-F27/100)","v":{"$error":"#VALUE!"}},null,{"$f":"K26","v":0}]
["# 100 (150 µm)",{"$f":"'OPTIMIZED GRADATION TOOLS'!B32","v":0},{"$f":"'OPTIMIZED GRADATION TOOLS'!C32","v":0},{"$f":"'OPTIMIZED GRADATION TOOLS'!D32","v":0},{"$f":"'OPTIMIZED GRADATION TOOLS'!E32","v":0},0,{"$f":"IF($F$16=0,0,F27/100-F28/100)","v":{"$error":"#VALUE!"}},null,{"$f":"K26","v":0}]
["# 200 (75 µm)",{"$f":"'OPTIMIZED GRADATION TOOLS'!B33","v":0},{"$f":"'OPTIMIZED GRADATION TOOLS'!C33","v":0},{"$f":"'OPTIMIZED GRADATION TOOLS'!D33","v":0},{"$f":"'OPTIMIZED GRADATION TOOLS'!E33","v":0},0,{"$error":"#VALUE!"},null,null,"*","Coarse Sand = Sum of # 8 through # 30 of Combined % Retained, > 20%"]
[null,null,null,null,null,null,null,null,null,"^","Fine Sand = Sum of # 30 through # 200, Between 25 to 40% (Structural) and between 24% to 34% for pavement"]
[null,null,null,null,null,null,null,null,null,null,"Note: When # 40 gradation is not included, program will not include the % retained of #40 as it is a duplicate of % retained of #30"]

{"sheet":"LOOKUP TABLES","index":9,"n_rows":38,"n_cols":15,"rows_kept":38,"cut":false,"hidden":true,"merged":[[1,10,1,12],[7,10,7,12],[20,1,20,3],[5,6,5,7],[3,6,3,7],[2,6,2,7],[1,1,1,8],[20,5,20,7],[4,6,4,7],[14,6,14,7],[8,6,8,7],[13,6,13,7],[11,6,11,7],[9,6,9,7],[7,6,7,7],[6,6,6,7],[10,6,10,7],[19,10,19,11],[40,1,40,2],[39,1,39,2],[38,1,38,2],[37,1,37,2],[15,6,15,7],[16,6,16,7],[18,6,18,7],[17,6,17,7],[12,6,12,7],[19,6,19,7]]}
[]
[null,"CLASS_LIST",null,null,null,null,null,null,null,null,"ACI FORMULAS"]
[null,"CLASS","MTL CD","DSGN PSI","AGE","PERM","GRADATION RQMT",null,"ACI PSI","PWL","F1 < 5000",{"$f":"'JMF SUBMITTAL FORM'!AP153+(1.34*'JMF SUBMITTAL FORM'!AP161*'JMF SUBMITTAL FORM'!AP157)","v":{"$error":"#N/A"}},"GREATER"]
[null,"QC 1","215QC1",4000,"28 DAYS",2000,"WELL-GRADED",null,5200,null,"F2 < 5000",{"$f":"'JMF SUBMITTAL FORM'!AP153+(2.33*'JMF SUBMITTAL FORM'!AP161*'JMF SUBMITTAL FORM'!AP157)-500","v":{"$error":"#N/A"}},{"$f":"MAX(L3,L4)","v":{"$error":"#N/A"}}]
[null,"QC 1P","215QC1P",4000,"28 DAYS",2000,"WELL-GRADED",null,5200]
[null,"QC 2","215QC2",4500,"28 DAYS",1500,"WELL-GRADED",null,5700,null,"F1 > 5000",{"$f":"'JMF SUBMITTAL FORM'!AP153+(1.34*'JMF SUBMITTAL FORM'!AP161*'JMF SUBMITTAL FORM'!AP157)","v":{"$error":"#N/A"}},"GREATER"]
[null,"QC 3","215QC3","SPECIFY","SPECIFY","PER PLAN","WELL-GRADED",null,"CALC:",null,"F2 > 5000",{"$f":"('JMF SUBMITTAL FORM'!AP153*0.9)+(2.33*'JMF SUBMITTAL FORM'!AP161*'JMF SUBMITTAL FORM'!AP157)","v":{"$error":"#N/A"}},{"$f":"MAX(L6,L7)","v":{"$error":"#N/A"}}]
[null,"QC 4","215QC4","SPECIFY","SPECIFY","PER PLAN","WELL-GRADED",null,"CALC:",null,"WITH NO DATA"]
[null,"QC 5","215QC5",4500,"28 DAYS","N/A","1\" OR 3/8\" NOM. MAX SIZE",null,5700,"85 PWL","F< 5000",{"$f":"'JMF SUBMITTAL FORM'!AP153+1200","v":1200}]
[null,"QC MISC","215QCMISC",4000,"28 DAYS","N/A","1\" NOM. MAX SIZE",null,5200,"85 PWL","F> 5000",{"$f":"(1.1*'JMF SUBMITTAL FORM'!AP153)+700","v":700}]
[null,"QC SCC","215QCSCC",4500,"28 DAYS",1500,"WELL-GRADED, 1\" OR 3/8\" NOM. MAX SIZE",null,5700]
[null,"QC MS","215QCMS","400 MOR","24 HRS","N/A","1\" NOM. MAX SIZE",null,"N/A"]
[null,"QC RS","215QCRS","300 MOR","4 ≤ HRS ≤ 6",2000,"WELL-GRADED",null,"N/A"]
["*","QC FS","215QCFS","400 MOR","4 HRS","N/A","1\" NOM. MAX SIZE",null,"N/A",null,null,null,null,"*QC FS NOTE:","*PLEASE NOTE THAT QC FS WILL BE REMOVED FROM THE SPECIFICATIONS, AND A NEW MIX DESIGN CLASS QC RS HAS BEEN CREATED WITH VARYING REQUIREMENTS. QC FS MIXES WILL STILL BE ACCEPTED BUT CAN ONLY BE USED ON PROJECTS SOLD PRIOR TO THE UPDATE DATE OF THE SPECIFICATIONS. PLEASE REFER TO THE LINKS FOUND IN THE JMF SUBMITTAL INSTRUCTION SHEET TO OBTAIN THE LATEST VERSIONS OF THE SPECIFICATIONS REGARDING QC RS."]
["*","RRCM","215RRCM","400 MOR","4 HRS","N/A","1\" OR 3/8\" NOM. MAX SIZE",null,"MAT CURVE",null,null,null,null,"*RRCM NOTE:","*PLEASE NOTE THAT RRCM WILL BE REMOVED FROM THE SPECIFICATIONS, AND A NEW MIX DESIGN CLASS QC RS HAS BEEN CREATED WITH VARYING REQUIREMENTS. RRCM MIXES WILL STILL BE ACCEPTED BUT CAN ONLY BE USED ON PROJECTS SOLD PRIOR TO THE UPDATE DATE OF THE SPECIFICATIONS. PLEASE REFER TO THE LINKS FOUND IN THE JMF SUBMITTAL INSTRUCTION SHEET TO OBTAIN THE LATEST VERSIONS OF THE SPECIFICATIONS REGARDING QC RS."]
[null,"LATEX",21703,4500,"28 DAYS","N/A","SS 847/ SS 848",null,"N/A"]
[null,"MICROSILICA","21511HD",4500,"28 DAYS","N/A","SS 847/ SS 848",null,"N/A"]
[null,"MICROSILICA MOD","21511M",4500,"28 DAYS","N/A","SS 847/ SS 848",null,"N/A"]
[null,"SDC",21510,4500,"28 DAYS","N/A","SS 847/ SS 848",null,"N/A"]
[null,"SHOTCRETE","21806A",4000,"7 DAYS","N/A","ITEM 520",null,"N/A",null,"K_VALUES"]
[null,"CM_NAMES_CODES",null,null,"TEXT","ADMIX_TYPE_CODES ",null,null,null,null,"n","k"]
[null,"BLENDED CEMENT TYPE 1L",null,"3751L","3751L","AEA",null,42001,null,null,15,1.1599999999999999]
[null,"CEMENT TYPE 1",null,37504,37504,"A",null,42101,null,null,16,1.1399999999999999]
[null,"CEMENT TYPE 1A",null,37501,37501,"B",null,42102,null,null,17,1.1299999999999999]
[null,"CEMENT TYPE 2",null,37502,37502,"C",null,42103,null,null,18,1.1100000000000001]
[null,"CEMENT TYPE 3",null,37505,37505,"D",null,42104,null,null,19,1.1000000000000001]
[null,"CEMENT SPECIAL",null,375121,375121,"E",null,42105,null,null,20,1.08]
[null,"CEMENT TYPE 1SM",null,37506,37506,"F",null,42106,null,null,21,1.07]
[null,"FLY ASH CLASS C",null,2002,"002002","G",null,42107,null,null,22,1.06]
[null,"FLY ASH CLASS F",null,2003,"002003","SCC",null,42117,null,null,23,1.05]
[null,"NATURAL POZZOLAN CLASS N",null,2004,"002004","CaCL 94-97%",null,42201,null,null,24,1.04]
[null,"GGBF SLAG GR 100",null,37603,"37603","CaCL 70-80%",null,42202,null,null,25,1.03]
[null,"GGBF SLAG GR 120",null,37604,"37604","CaCL LIQ 28-42%",null,42204,null,null,26,1.02]
[null,"MICRO-FINES",null,"001CMF","001CMF","LATEX",null,42301,null,null,27,1.02]
[null,"MICRO SILICA",null,37601,"37601","CORR INHIB",null,43301,null,null,28,1.01]
[null,null,null,null,null,"ANTI WASHOUT",null,42203,null,null,29,1.01]
[null,null,null,null,null,"WATERPROOF",null,42116,null,null,30,1]
[null,null,null,null,null,"NON-SHRINK",null,43501]

{"sheet":"RM_NAME_CODE","index":10,"n_rows":81,"n_cols":2,"rows_kept":81,"cut":false,"hidden":true,"merged":[]}
["A K Ready Mix - PCCJMF","75000Q-01"]
["AB&L Concrete and Supply - PCCJMF","75102Q-01"]
["Adams Brothers - PCCJMF","75001Q-01"]
["All Ohio Ready Mix - PCCJMF","75002Q-01"]
["Allega - PCCJMF","75003Q-01"]
["Anderson - PCCJMF","75004Q-01"]
["Associated Associates - PCCJMF","75005Q-01"]
["Available Ready Mix - PCCJMF","75106Q-01"]
["Baker Shindler Ready Mix - PCCJMF","75006Q-01"]
["Becker & Scrivens - PCCJMF","75007Q-01"]
["Buckeye Ready Mix - PCCJMF","75010Q-01"]
["Caldwell Ready Mix - PCCJMF","75011Q-01"]
["Carr Brothers - PCCJMF","75014Q-01"]
["Cashen Ready Mix - PCCJMF","75015Q-01"]
["Castalia Trenching & Ready Mix - PCCJMF","75016Q-01"]
["Cement Products - PCCJMF","75017Q-01"]
["Center Concrete (CCI) - PCCJMF","75018Q-01"]
["Chappell Zimmerman - PCCJMF","75019Q-01"]
["City Concrete - PCCJMF","75021Q-01"]
["Cleveland Ready Mix - PCCJMF","75022Q-01"]
["Contractors Choice Ready Mix - PCCJMF","75013Q-01"]
["Coshocton Materials - PCCJMF","75103Q-01"]
["D.W. Dickey - PCCJMF","75025Q-01"]
["Dauch Concrete - PCCJMF","75026Q-01"]
["Ellis Brothers - PCCJMF","75027Q-01"]
["Elyria Concrete (ECI) - PCCJMF","75028Q-01"]
["Ernst Concrete - PCCJMF","75029Q-01"]
["Forest Run Ready Mix - PCCJMF","75031Q-01"]
["Fox Stone - PCCJMF","75032Q-01"]
["French's Concrete - PCCJMF","75033Q-01"]
["H.M. Miller Construction - PCCJMF","75035Q-01"]
["Heidelberg Materials - PCCJMF","75036Q-01"]
["Hensel Ready Mix - PCCJMF","75037Q-01"]
["Hilltop Companies - PCCJMF","75038Q-01"]
["Hocking Valley - PCCJMF","75039Q-01"]
["Holmes Redimix - PCCJMF","75040Q-01"]
["Hometown Concrete","75104Q-01"]
["Irving Materials - PCCJMF","75043Q-01"]
["IVS Hydro - PCCJMF","75099Q-01"]
["Jab Supply - PCCJMF","75101Q-01"]
["K & L - PCCJMF","75045Q-01"]
["Kuhlman - PCCJMF","75047Q-01"]
["Little Miami Materials - PCCJMF","75051Q-01"]
["Lockhart - PCCJMF","75052Q-01"]
["M&R Redi-Mix - PCCJMF","75053Q-01"]
["Mack Concrete - PCCJMF","75054Q-01"]
["Medina Supply- PCCJMF","75057Q-01"]
["Modified Concrete Suppliers - PCCJMF","75100Q-01"]
["Moritz - PCCJMF","75058Q-01"]
["National Concrete - PCCJMF","75059Q-01"]
["Ohio Ready Mix - PCCJMF","75061Q-01"]
["OK Coal - PCCJMF","75062Q-01"]
["Orrville - PCCJMF","75063Q-01"]
["Osborne - PCCJMF","75064Q-01"]
["Pahl Ready Mix - PCCJMF","75065Q-01"]
["Palmer Brothers - PCCJMF","75066Q-01"]
["Paul R. Lipp & Sons - PCCJMF","75067Q-01"]
["Pepcon - PCCJMF","75068Q-01"]
["Phillips Ready Mix - PCCJMF","75069Q-01"]
["Pickett - PCCJMF","75070Q-01"]
["Reliable Ready Mix - PCCJMF","75072Q-01"]
["Rockport Ready Mix - PCCJMF","75073Q-01"]
["Sagamore Concrete - PCCJMF","75105Q-01"]
["Sardinia - PCCJMF","75075Q-01"]
["Scioto Ready Mix - PCCJMF","75076Q-01"]
["Small's Ready Mix - PCCJMF","75078Q-01"]
["Smith Concrete - PCCJMF","75079Q-01"]
["Smyrna Ready Mix - PCCJMF","75080Q-01"]
["Spring Creek - PCCJMF","75081Q-01"]
["St. Henry - PCCJMF","75082Q-01"]
["Summit Concrete Supply - PCCJMF","75107Q-01"]
["Swank Construction - PCCJMF","75096Q-01"]
["T.C. Redi-Mix - PCCJMF","75084Q-01"]
["Tech Ready Mix - PCCJMF","75085Q-01"]
["Terminal Ready Mix - PCCJMF","75086Q-01"]
["Top Cat - PCCJMF","75087Q-01"]
["Tow Path Ready Mix - PCCJMF","75088Q-01"]
["Weirton Ice & Coal - PCCJMF","75091Q-01"]
["Wells Group Ready Mix - PCCJMF","75092Q-01"]
["Westview Concrete - PCCJMF","75093Q-01"]
["Williams Concrete - PCCJMF","75094Q-01"]

{"sheet":"AGG S.G. REPORT","index":11,"n_rows":691,"n_cols":21,"rows_kept":691,"cut":false,"hidden":true,"merged":[]}
["Source_ID","Material_Code","Material_Full_Name","Avg_Bulk_SSD","Absorption_Pct",null,"*TRIAL S.G. REPORT AVERAGES (NOT USED AT THIS TIME)",null,null,null,null,null,null,null,null,null,"Source_ID","Material_Code","Material_Full_Name","Avg_Bulk_SSD","Absorption_Pct"]
[{"$f":"(FIND(Q2,Q3,1))","v":1},{"$f":"(FIND(R2,R3,1))","v":1},690,{"$f":"COUNTIF(Q2:Q691,AND(Q2,LEFT(R2,3)=\"205\"))","v":0},null,null,null,null,{"$f":"MATCH(Q2,Q2:Q691,1)","v":5},{"$f":"COUNTIF(Q2:Q691,Q2)","v":5},{"$f":"COUNTIF(R2:R691,R2)","v":234},null,null,null,null,null,"40001-01",20570,"No. 57 Agg, 703.02 Super-Structure",2.7330000000000001,1]
[{"$f":"(FIND(Q3,Q4,1))","v":1},{"$f":"(FIND(R3,R4,1))","v":{"$error":"#VALUE!"}},null,null,null,null,{"$f":"CELL(\"col\",Q2)","v":17},null,{"$f":"MATCH(Q3,Q3:Q692,1)","v":4},{"$f":"COUNTIF(Q3:Q692,Q3)","v":4},null,null,null,null,null,null,"40001-01",20570,"No. 57 Agg, 703.02 Super-Structure",2.726,1.17]
[1,1,null,null,null,null,null,null,3,3,null,null,null,null,null,null,"40001-01",20080,"No. 8 Agg, 703.02 Super-Structure",2.7229999999999999,1.41]
[1,1,null,null,null,null,null,null,2,2,null,null,null,null,null,null,"40001-01",20080,"No. 8 Agg, 703.02 Super-Structure",2.7280000000000002,1.22]
[{"$error":"#VALUE!"},{"$error":"#VALUE!"},null,null,null,null,null,null,1,1,null,null,null,null,null,null,"40001-01",20080,"No. 8 Agg, 703.02 Super-Structure",2.73,1.33]
[1,1,null,null,null,null,null,null,6,6,null,null,null,null,null,null,"40002-01",20570,"No. 57 Agg, 703.02 Super-Structure",2.7469999999999999,0.88]
[1,1,null,null,null,null,null,null,5,5,null,null,null,null,null,null,"40002-01",20570,"No. 57 Agg, 703.02 Super-Structure",2.7429999999999999,0.88]
[1,1,null,null,null,null,null,null,4,4,null,null,null,null,null,null,"40002-01",20570,"No. 57 Agg, 703.02 Super-Structure",2.7410000000000001,0.95]
[1,{"$error":"#VALUE!"},null,null,null,null,null,null,3,3,null,null,null,null,null,null,"40002-01",20570,"No. 57 Agg, 703.02 Super-Structure",2.7410000000000001,0.85]
[1,1,null,null,null,null,null,null,2,2,null,null,null,null,null,null,"40002-01",2008,"No. 8 Agg, 703.02 Concrete",2.738,1]
[{"$error":"#VALUE!"},{"$error":"#VALUE!"},null,null,null,null,null,null,1,1,null,null,null,null,null,null,"40002-01",2008,"No. 8 Agg, 703.02 Concrete",2.7360000000000002,1.02]
[1,1,null,null,null,null,null,null,6,6,null,null,null,null,null,null,"40004B-01",20570,"No. 57 Agg, 703.02 Super-Structure",2.677,1.31]
[1,1,null,null,null,null,null,null,5,5,null,null,null,null,null,null,"40004B-01",20570,"No. 57 Agg, 703.02 Super-Structure",2.66,1.51]
[1,{"$error":"#VALUE!"},null,null,null,null,null,null,4,4,null,null,null,null,null,null,"40004B-01",20570,"No. 57 Agg, 703.02 Super-Structure",2.6579999999999999,1.52]
[1,1,null,null,null,null,null,null,3,3,null,null,null,null,null,null,"40004B-01",2008,"No. 8 Agg, 703.02 Concrete",2.6840000000000002,1.59]
[1,1,null,null,null,null,null,null,2,2,null,null,null,null,null,null,"40004B-01",20081,"No. 8 Agg, 703.02 Concrete Overlay",2.6920000000000002,1.34]
[{"$error":"#VALUE!"},{"$error":"#VALUE!"},null,null,null,null,null,null,1,1,null,null,null,null,null,null,"40004B-01",20081,"No. 8 Agg, 703.02 Concrete Overlay",2.673,1.7]
[1,1,null,null,null,null,null,null,6,6,null,null,null,null,null,null,"40005-01",2057,"No. 57 Agg, 703.02 Concrete",2.6110000000000002,2.38]
[1,1,null,null,null,null,null,null,5,5,null,null,null,null,null,null,"40005-01",2057,"No. 57 Agg, 703.02 Concrete",2.6230000000000002,2.1]
[1,{"$error":"#VALUE!"},null,null,null,null,null,null,4,4,null,null,null,null,null,null,"40005-01",2057,"No. 57 Agg, 703.02 Concrete",2.6160000000000001,2.38]
[1,1,null,null,null,null,null,null,3,3,null,null,null,null,null,null,"40005-01",20080,"No. 8 Agg, 703.02 Super-Structure",2.65,2.15]
[1,1,null,null,null,null,null,null,2,2,null,null,null,null,null,null,"40005-01",20080,"No. 8 Agg, 703.02 Super-Structure",2.6309999999999998,2.41]
[{"$error":"#VALUE!"},{"$error":"#VALUE!"},null,null,null,null,null,null,1,1,null,null,null,null,null,null,"40005-01",20080,"No. 8 Agg, 703.02 Super-Structure",2.6139999999999999,2.78]
[1,1,null,null,null,null,null,null,6,6,null,null,null,null,null,null,"40007-01",2057,"No. 57 Agg, 703.02 Concrete",2.714,1.45]
[1,1,null,null,null,null,null,null,5,5,null,null,null,null,null,null,"40007-01",2057,"No. 57 Agg, 703.02 Concrete",2.7109999999999999,1.49]
[1,{"$error":"#VALUE!"},null,null,null,null,null,null,4,4,null,null,null,null,null,null,"40007-01",2057,"No. 57 Agg, 703.02 Concrete",2.7160000000000002,1.38]
[1,1,null,null,null,null,null,null,3,3,null,null,null,null,null,null,"40007-01",2008,"No. 8 Agg, 703.02 Concrete",2.706,1.74]
[1,1,null,null,null,null,null,null,2,2,null,null,null,null,null,null,"40007-01",2008,"No. 8 Agg, 703.02 Concrete",2.7130000000000001,1.67]
[{"$error":"#VALUE!"},{"$error":"#VALUE!"},null,null,null,null,null,null,1,1,null,null,null,null,null,null,"40007-01",2008,"No. 8 Agg, 703.02 Concrete",2.7120000000000002,1.63]
[1,1,null,null,null,null,null,null,6,6,null,null,null,null,null,null,"40008B-01",2057,"No. 57 Agg, 703.02 Concrete",2.6779999999999999,1.39]
[1,1,null,null,null,null,null,null,5,5,null,null,null,null,null,null,"40008B-01",20570,"No. 57 Agg, 703.02 Super-Structure",2.6779999999999999,1.34]
[1,{"$error":"#VALUE!"},null,null,null,null,null,null,4,4,null,null,null,null,null,null,"40008B-01",20570,"No. 57 Agg, 703.02 Super-Structure",2.6779999999999999,1.48]
[1,1,null,null,null,null,null,null,3,3,null,null,null,null,null,null,"40008B-01",2008,"No. 8 Agg, 703.02 Concrete",2.6829999999999998,1.57]
[1,1,null,null,null,null,null,null,2,2,null,null,null,null,null,null,"40008B-01",20080,"No. 8 Agg, 703.02 Super-Structure",2.7040000000000002,1.65]
[{"$error":"#VALUE!"},{"$error":"#VALUE!"},null,null,null,null,null,null,1,1,null,null,null,null,null,null,"40008B-01",20080,"No. 8 Agg, 703.02 Super-Structure",2.6850000000000001,1.61]
[1,1,null,null,null,null,null,null,3,3,null,null,null,null,null,null,"40011-01",2057,"No. 57 Agg, 703.02 Concrete",2.718,1.25]
[1,{"$error":"#VALUE!"},null,null,null,null,null,null,2,2,null,null,null,null,null,null,"40011-01",20570,"No. 57 Agg, 703.02 Super-Structure",2.726,1.26]
[{"$error":"#VALUE!"},{"$error":"#VALUE!"},null,null,null,null,null,null,1,1,null,null,null,null,null,null,"40011-01",20080,"No. 8 Agg, 703.02 Super-Structure",2.7210000000000001,1.61]
[1,1,null,null,null,null,null,null,6,6,null,null,null,null,null,null,"40012-01",20570,"No. 57 Agg, 703.02 Super-Structure",2.589,2.86]
[1,1,null,null,null,null,null,null,5,5,null,null,null,null,null,null,"40012-01",20570,"No. 57 Agg, 703.02 Super-Structure",2.5880000000000001,2.78]
[1,{"$error":"#VALUE!"},null,null,null,null,null,null,4,4,null,null,null,null,null,null,"40012-01",20570,"No. 57 Agg, 703.02 Super-Structure",2.6120000000000001,2.57]
[1,1,null,null,null,null,null,null,3,3,null,null,null,null,null,null,"40012-01",2008,"No. 8 Agg, 703.02 Concrete",2.5990000000000002,3.01]
[1,1,null,null,null,null,null,null,2,2,null,null,null,null,null,null,"40012-01",20081,"No. 8 Agg, 703.02 Concrete Overlay",2.597,3.16]
[{"$error":"#VALUE!"},{"$error":"#VALUE!"},null,null,null,null,null,null,1,1,null,null,null,null,null,null,"40012-01",20081,"No. 8 Agg, 703.02 Concrete Overlay",2.6349999999999998,2.0499999999999998]
[1,1,null,null,null,null,null,null,6,6,null,null,null,null,null,null,"40013-01",20570,"No. 57 Agg, 703.02 Super-Structure",2.6840000000000002,1.59]
[1,1,null,null,null,null,null,null,5,5,null,null,null,null,null,null,"40013-01",20570,"No. 57 Agg, 703.02 Super-Structure",2.7,1.37]
[1,{"$error":"#VALUE!"},null,null,null,null,null,null,4,4,null,null,null,null,null,null,"40013-01",20570,"No. 57 Agg, 703.02 Super-Structure",2.6829999999999998,1.56]
[1,1,null,null,null,null,null,null,3,3,null,null,null,null,null,null,"40013-01",20081,"No. 8 Agg, 703.02 Concrete Overlay",2.714,1.44]
[1,1,null,null,null,null,null,null,2,2,null,null,null,null,null,null,"40013-01",20081,"No. 8 Agg, 703.02 Concrete Overlay",2.7109999999999999,1.5]
[{"$error":"#VALUE!"},{"$error":"#VALUE!"},null,null,null,null,null,null,1,1,null,null,null,null,null,null,"40013-01",20081,"No. 8 Agg, 703.02 Concrete Overlay",2.714,1.54]
[1,1,null,null,null,null,null,null,4,4,null,null,null,null,null,null,"40017-01",20570,"No. 57 Agg, 703.02 Super-Structure",2.7240000000000002,0.82]
[1,{"$error":"#VALUE!"},null,null,null,null,null,null,3,3,null,null,null,null,null,null,"40017-01",20570,"No. 57 Agg, 703.02 Super-Structure",2.681,1.2]
[1,1,null,null,null,null,null,null,2,2,null,null,null,null,null,null,"40017-01",20081,"No. 8 Agg, 703.02 Concrete Overlay",2.7189999999999999,1.1000000000000001]
[{"$error":"#VALUE!"},{"$error":"#VALUE!"},null,null,null,null,null,null,1,1,null,null,null,null,null,null,"40017-01",20081,"No. 8 Agg, 703.02 Concrete Overlay",2.71,1.28]
[1,1,null,null,null,null,null,null,3,3,null,null,null,null,null,null,"40020-01",20570,"No. 57 Agg, 703.02 Super-Structure",2.637,1.31]
[1,1,null,null,null,null,null,null,2,2,null,null,null,null,null,null,"40020-01",20570,"No. 57 Agg, 703.02 Super-Structure",2.63,1.61]
[{"$error":"#VALUE!"},{"$error":"#VALUE!"},null,null,null,null,null,null,1,1,null,null,null,null,null,null,"40020-01",20570,"No. 57 Agg, 703.02 Super-Structure",2.613,1.82]
[1,1,null,null,null,null,null,null,5,5,null,null,null,null,null,null,"40025-01",2057,"No. 57 Agg, 703.02 Concrete",2.68,1.28]
[1,1,null,null,null,null,null,null,4,4,null,null,null,null,null,null,"40025-01",2057,"No. 57 Agg, 703.02 Concrete",2.6920000000000002,1.3]
[1,{"$error":"#VALUE!"},null,null,null,null,null,null,3,3,null,null,null,null,null,null,"40025-01",2057,"No. 57 Agg, 703.02 Concrete",2.6669999999999998,1.46]
[1,1,null,null,null,null,null,null,2,2,null,null,null,null,null,null,"40025-01","02008M","No. 8 Agg, 703.02 Concrete, Mod Grading",2.68,1.63]
[{"$error":"#VALUE!"},{"$error":"#VALUE!"},null,null,null,null,null,null,1,1,null,null,null,null,null,null,"40025-01","02008M","No. 8 Agg, 703.02 Concrete, Mod Grading",2.6880000000000002,1.54]
[1,1,null,null,null,null,null,null,7,7,null,null,null,null,null,null,"40027-01",20570,"No. 57 Agg, 703.02 Super-Structure",2.73,1.03]
[1,1,null,null,null,null,null,null,6,6,null,null,null,null,null,null,"40027-01",20570,"No. 57 Agg, 703.02 Super-Structure",2.7349999999999999,0.95]
[1,1,null,null,null,null,null,null,5,5,null,null,null,null,null,null,"40027-01",20570,"No. 57 Agg, 703.02 Super-Structure",2.762,0.98]
[{"$f":"(FIND(Q67,Q68,1))","v":1},{"$f":"(FIND(R67,R68,1))","v":{"$error":"#VALUE!"}},null,null,null,null,null,null,{"$f":"MATCH(Q67,Q67:Q756,1)","v":4},{"$f":"COUNTIF(Q67:Q756,Q67)","v":4},null,null,null,null,null,null,"40027-01",20570,"No. 57 Agg, 703.02 Super-Structure",2.746,0.89]
[1,1,null,null,null,null,null,null,3,3,null,null,null,null,null,null,"40027-01",2008,"No. 8 Agg, 703.02 Concrete",2.7349999999999999,1.1599999999999999]
[1,1,null,null,null,null,null,null,2,2,null,null,null,null,null,null,"40027-01",20080,"No. 8 Agg, 703.02 Super-Structure",2.7589999999999999,1.3]
[{"$error":"#VALUE!"},{"$error":"#VALUE!"},null,null,null,null,null,null,1,1,null,null,null,null,null,null,"40027-01",20080,"No. 8 Agg, 703.02 Super-Structure",2.7370000000000001,1.1200000000000001]
[1,1,null,null,null,null,null,null,10,10,null,null,null,null,null,null,"40030-01",20570,"No. 57 Agg, 703.02 Super-Structure",2.65,1.6]
[1,1,null,null,null,null,null,null,9,9,null,null,null,null,null,null,"40030-01",20570,"No. 57 Agg, 703.02 Super-Structure",2.6859999999999999,1.27]
[1,1,null,null,null,null,null,null,8,8,null,null,null,null,null,null,"40030-01",20570,"No. 57 Agg, 703.02 Super-Structure",2.6859999999999999,1.08]
[1,1,null,null,null,null,null,null,7,7,null,null,null,null,null,null,"40030-01",20570,"No. 57 Agg, 703.02 Super-Structure",2.6160000000000001,2.2400000000000002]
[1,{"$error":"#VALUE!"},null,null,null,null,null,null,6,6,null,null,null,null,null,null,"40030-01",20570,"No. 57 Agg, 703.02 Super-Structure",2.6520000000000001,1.43]
[1,1,null,null,null,null,null,null,5,5,null,null,null,null,null,null,"40030-01",20081,"No. 8 Agg, 703.02 Concrete Overlay",2.6920000000000002,1.36]
[1,1,null,null,null,null,null,null,4,4,null,null,null,null,null,null,"40030-01",20081,"No. 8 Agg, 703.02 Concrete Overlay",2.6920000000000002,1.49]
[1,1,null,null,null,null,null,null,3,3,null,null,null,null,null,null,"40030-01",20081,"No. 8 Agg, 703.02 Concrete Overlay",2.6429999999999998,2.16]
[1,1,null,null,null,null,null,null,2,2,null,null,null,null,null,null,"40030-01",20081,"No. 8 Agg, 703.02 Concrete Overlay",2.6659999999999999,1.82]
[{"$error":"#VALUE!"},{"$error":"#VALUE!"},null,null,null,null,null,null,1,1,null,null,null,null,null,null,"40030-01",20081,"No. 8 Agg, 703.02 Concrete Overlay",2.6629999999999998,1.81]
[1,1,null,null,null,null,null,null,2,2,null,null,null,null,null,null,"40032-01",20570,"No. 57 Agg, 703.02 Super-Structure",2.629,1.96]
[{"$error":"#VALUE!"},{"$error":"#VALUE!"},null,null,null,null,null,null,1,1,null,null,null,null,null,null,"40032-01",20570,"No. 57 Agg, 703.02 Super-Structure",2.6190000000000002,2.04]
[1,1,null,null,null,null,null,null,8,8,null,null,null,null,null,null,"41003-01",2057,"No. 57 Agg, 703.02 Concrete",2.6829999999999998,1.1499999999999999]
[1,1,null,null,null,null,null,null,7,7,null,null,null,null,null,null,"41003-01",20570,"No. 57 Agg, 703.02 Super-Structure",2.68,1.36]
[1,1,null,null,null,null,null,null,6,6,null,null,null,null,null,null,"41003-01",20570,"No. 57 Agg, 703.02 Super-Structure",2.7,1.18]
[1,{"$error":"#VALUE!"},null,null,null,null,null,null,5,5,null,null,null,null,null,null,"41003-01",20570,"No. 57 Agg, 703.02 Super-Structure",2.702,1.25]
[1,1,null,null,null,null,null,null,4,4,null,null,null,null,null,null,"41003-01",20081,"No. 8 Agg, 703.02 Concrete Overlay",2.7069999999999999,1.49]
[1,1,null,null,null,null,null,null,3,3,null,null,null,null,null,null,"41003-01",20081,"No. 8 Agg, 703.02 Concrete Overlay",2.7010000000000001,1.45]
[1,1,null,null,null,null,null,null,2,2,null,null,null,null,null,null,"41003-01",20081,"No. 8 Agg, 703.02 Concrete Overlay",2.7040000000000002,1.48]
[{"$error":"#VALUE!"},{"$error":"#VALUE!"},null,null,null,null,null,null,1,1,null,null,null,null,null,null,"41003-01",20081,"No. 8 Agg, 703.02 Concrete Overlay",2.714,1.37]
[1,1,null,null,null,null,null,null,5,5,null,null,null,null,null,null,"41005-01",2057,"No. 57 Agg, 703.02 Concrete",2.556,3.31]
[1,1,null,null,null,null,null,null,4,4,null,null,null,null,null,null,"41005-01",20570,"No. 57 Agg, 703.02 Super-Structure",2.5499999999999998,3.31]
[1,{"$error":"#VALUE!"},null,null,null,null,null,null,3,3,null,null,null,null,null,null,"41005-01",20570,"No. 57 Agg, 703.02 Super-Structure",2.5489999999999999,3.16]
[1,1,null,null,null,null,null,null,2,2,null,null,null,null,null,null,"41005-01",20081,"No. 8 Agg, 703.02 Concrete Overlay",2.5579999999999998,3.84]
[{"$error":"#VALUE!"},{"$error":"#VALUE!"},null,null,null,null,null,null,1,1,null,null,null,null,null,null,"41005-01",20081,"No. 8 Agg, 703.02 Concrete Overlay",2.5529999999999999,4.17]
[1,1,null,null,null,null,null,null,4,4,null,null,null,null,null,null,"41007-01",20570,"No. 57 Agg, 703.02 Super-Structure",2.6379999999999999,1.89]
[1,{"$error":"#VALUE!"},null,null,null,null,null,null,3,3,null,null,null,null,null,null,"41007-01",20570,"No. 57 Agg, 703.02 Super-Structure",2.65,1.86]
[1,1,null,null,null,null,null,null,2,2,null,null,null,null,null,null,"41007-01",20081,"No. 8 Agg, 703.02 Concrete Overlay",2.66,2.13]
[{"$error":"#VALUE!"},{"$error":"#VALUE!"},null,null,null,null,null,null,1,1,null,null,null,null,null,null,"41007-01",20081,"No. 8 Agg, 703.02 Concrete Overlay",2.6440000000000001,2.46]
[1,1,null,null,null,null,null,null,7,7,null,null,null,null,null,null,"41008-01",2057,"No. 57 Agg, 703.02 Concrete",2.746,0.63]
[1,1,null,null,null,null,null,null,6,6,null,null,null,null,null,null,"41008-01",2057,"No. 57 Agg, 703.02 Concrete",2.746,0.63]
[1,1,null,null,null,null,null,null,5,5,null,null,null,null,null,null,"41008-01",20570,"No. 57 Agg, 703.02 Super-Structure",2.7250000000000001,0.81]
[1,{"$error":"#VALUE!"},null,null,null,null,null,null,4,4,null,null,null,null,null,null,"41008-01",20570,"No. 57 Agg, 703.02 Super-Structure",2.7189999999999999,0.64]
[1,1,null,null,null,null,null,null,3,3,null,null,null,null,null,null,"41008-01",20081,"No. 8 Agg, 703.02 Concrete Overlay",2.7440000000000002,0.74]
[1,1,null,null,null,null,null,null,2,2,null,null,null,null,null,null,"41008-01",20081,"No. 8 Agg, 703.02 Concrete Overlay",2.7469999999999999,0.82]
[{"$error":"#VALUE!"},{"$error":"#VALUE!"},null,null,null,null,null,null,1,1,null,null,null,null,null,null,"41008-01",20081,"No. 8 Agg, 703.02 Concrete Overlay",2.7290000000000001,1.03]
[1,1,null,null,null,null,null,null,8,8,null,null,null,null,null,null,"41010-01",20570,"No. 57 Agg, 703.02 Super-Structure",2.72,1.1000000000000001]
[1,1,null,null,null,null,null,null,7,7,null,null,null,null,null,null,"41010-01",20570,"No. 57 Agg, 703.02 Super-Structure",2.641,1.57]
[1,1,null,null,null,null,null,null,6,6,null,null,null,null,null,null,"41010-01",20570,"No. 57 Agg, 703.02 Super-Structure",2.734,1.02]
[1,1,null,null,null,null,null,null,5,5,null,null,null,null,null,null,"41010-01",20570,"No. 57 Agg, 703.02 Super-Structure",2.641,1.57]
[1,{"$error":"#VALUE!"},null,null,null,null,null,null,4,4,null,null,null,null,null,null,"41010-01",20570,"No. 57 Agg, 703.02 Super-Structure",2.7240000000000002,1.1000000000000001]
[1,1,null,null,null,null,null,null,3,3,null,null,null,null,null,null,"41010-01",20081,"No. 8 Agg, 703.02 Concrete Overlay",2.726,1.34]
[1,1,null,null,null,null,null,null,2,2,null,null,null,null,null,null,"41010-01",20081,"No. 8 Agg, 703.02 Concrete Overlay",2.7320000000000002,1.38]
[{"$error":"#VALUE!"},{"$error":"#VALUE!"},null,null,null,null,null,null,1,1,null,null,null,null,null,null,"41010-01",20081,"No. 8 Agg, 703.02 Concrete Overlay",2.7170000000000001,1.32]
[1,1,null,null,null,null,null,null,4,4,null,null,null,null,null,null,"41011-01",2057,"No. 57 Agg, 703.02 Concrete",2.637,2.11]
[1,{"$error":"#VALUE!"},null,null,null,null,null,null,3,3,null,null,null,null,null,null,"41011-01",20570,"No. 57 Agg, 703.02 Super-Structure",2.6640000000000001,1.91]
[1,1,null,null,null,null,null,null,2,2,null,null,null,null,null,null,"41011-01",2008,"No. 8 Agg, 703.02 Concrete",2.6520000000000001,2.38]
[{"$error":"#VALUE!"},{"$error":"#VALUE!"},null,null,null,null,null,null,1,1,null,null,null,null,null,null,"41011-01",20081,"No. 8 Agg, 703.02 Concrete Overlay",2.6619999999999999,2.33]
[1,1,null,null,null,null,null,null,6,6,null,null,null,null,null,null,"41013A-01",2057,"No. 57 Agg, 703.02 Concrete",2.6120000000000001,2.92]
[1,1,null,null,null,null,null,null,5,5,null,null,null,null,null,null,"41013A-01",20570,"No. 57 Agg, 703.02 Super-Structure",2.698,1.1200000000000001]
[1,1,null,null,null,null,null,null,4,4,null,null,null,null,null,null,"41013A-01",20570,"No. 57 Agg, 703.02 Super-Structure",2.698,1.1200000000000001]
[1,{"$error":"#VALUE!"},null,null,null,null,null,null,3,3,null,null,null,null,null,null,"41013A-01",20570,"No. 57 Agg, 703.02 Super-Structure",2.641,2.2400000000000002]
[1,1,null,null,null,null,null,null,2,2,null,null,null,null,null,null,"41013A-01",20081,"No. 8 Agg, 703.02 Concrete Overlay",2.6480000000000001,2.65]
[{"$error":"#VALUE!"},{"$error":"#VALUE!"},null,null,null,null,null,null,1,1,null,null,null,null,null,null,"41013A-01",20081,"No. 8 Agg, 703.02 Concrete Overlay",2.61,2.85]
[1,1,null,null,null,null,null,null,4,4,null,null,null,null,null,null,"41014-01",20570,"No. 57 Agg, 703.02 Super-Structure",2.6269999999999998,2.06]
[1,{"$error":"#VALUE!"},null,null,null,null,null,null,3,3,null,null,null,null,null,null,"41014-01",20570,"No. 57 Agg, 703.02 Super-Structure",2.6080000000000001,2.29]
[1,1,null,null,null,null,null,null,2,2,null,null,null,null,null,null,"41014-01",20081,"No. 8 Agg, 703.02 Concrete Overlay",2.6059999999999999,3.04]
[{"$error":"#VALUE!"},{"$error":"#VALUE!"},null,null,null,null,null,null,1,1,null,null,null,null,null,null,"41014-01",20081,"No. 8 Agg, 703.02 Concrete Overlay",2.621,2.5499999999999998]
[1,1,null,null,null,null,null,null,4,4,null,null,null,null,null,null,"41016-01",20570,"No. 57 Agg, 703.02 Super-Structure",2.7080000000000002,1.62]
[1,{"$error":"#VALUE!"},null,null,null,null,null,null,3,3,null,null,null,null,null,null,"41016-01",20570,"No. 57 Agg, 703.02 Super-Structure",2.726,1]
[{"$f":"(FIND(Q131,Q132,1))","v":1},{"$f":"(FIND(R131,R132,1))","v":1},null,null,null,null,null,null,{"$f":"MATCH(Q131,Q131:Q820,1)","v":2},{"$f":"COUNTIF(Q131:Q820,Q131)","v":2},null,null,null,null,null,null,"41016-01",20081,"No. 8 Agg, 703.02 Concrete Overlay",2.74,1.1499999999999999]
[{"$error":"#VALUE!"},{"$error":"#VALUE!"},null,null,null,null,null,null,1,1,null,null,null,null,null,null,"41016-01",20081,"No. 8 Agg, 703.02 Concrete Overlay",2.7149999999999999,1.89]
[1,1,null,null,null,null,null,null,6,6,null,null,null,null,null,null,"41018-01",20570,"No. 57 Agg, 703.02 Super-Structure",2.7389999999999999,1]
[1,{"$error":"#VALUE!"},null,null,null,null,null,null,5,5,null,null,null,null,null,null,"41018-01",20570,"No. 57 Agg, 703.02 Super-Structure",2.6890000000000001,1.86]
[1,1,null,null,null,null,null,null,4,4,null,null,null,null,null,null,"41018-01",2008,"No. 8 Agg, 703.02 Concrete",2.738,1.21]
[1,1,null,null,null,null,null,null,3,3,null,null,null,null,null,null,"41018-01",2008,"No. 8 Agg, 703.02 Concrete",2.738,1.19]
[1,1,null,null,null,null,null,null,2,2,null,null,null,null,null,null,"41018-01",20081,"No. 8 Agg, 703.02 Concrete Overlay",2.734,1.43]
[{"$error":"#VALUE!"},{"$error":"#VALUE!"},null,null,null,null,null,null,1,1,null,null,null,null,null,null,"41018-01",20081,"No. 8 Agg, 703.02 Concrete Overlay",2.7080000000000002,1.9]
[1,1,null,null,null,null,null,null,3,3,null,null,null,null,null,null,"41020A-01",2057,"No. 57 Agg, 703.02 Concrete",2.72,0.81]
[1,1,null,null,null,null,null,null,2,2,null,null,null,null,null,null,"41020A-01",2057,"No. 57 Agg, 703.02 Concrete",2.7280000000000002,0.82]
[{"$error":"#VALUE!"},1,null,null,null,null,null,null,1,1,null,null,null,null,null,null,"41020A-01",2057,"No. 57 Agg, 703.02 Concrete",2.7269999999999999,0.7]
[{"$error":"#VALUE!"},1,null,null,null,null,null,null,1,1,null,null,null,null,null,null,"41023-01",20570,"No. 57 Agg, 703.02 Super-Structure",2.7210000000000001,1.45]
[1,1,null,null,null,null,null,null,2,2,null,null,null,null,null,null,"41023B-01",20570,"No. 57 Agg, 703.02 Super-Structure",2.6880000000000002,1.55]
[{"$error":"#VALUE!"},1,null,null,null,null,null,null,1,1,null,null,null,null,null,null,"41023B-01",20570,"No. 57 Agg, 703.02 Super-Structure",2.72,1.45]
[1,1,null,null,null,null,null,null,4,4,null,null,null,null,null,null,"41032-01",20570,"No. 57 Agg, 703.02 Super-Structure",2.6869999999999998,1.83]
[1,{"$error":"#VALUE!"},null,null,null,null,null,null,3,3,null,null,null,null,null,null,"41032-01",20570,"No. 57 Agg, 703.02 Super-Structure",null,1.95]
[1,1,null,null,null,null,null,null,2,2,null,null,null,null,null,null,"41032-01",20080,"No. 8 Agg, 703.02 Super-Structure",null,2.44]
[{"$error":"#VALUE!"},{"$error":"#VALUE!"},null,null,null,null,null,null,1,1,null,null,null,null,null,null,"41032-01",20080,"No. 8 Agg, 703.02 Super-Structure",2.6880000000000002,2.17]
[1,1,null,null,null,null,null,null,6,6,null,null,null,null,null,null,"41033-01",20570,"No. 57 Agg, 703.02 Super-Structure",2.6859999999999999,1.17]
[1,1,null,null,null,null,null,null,5,5,null,null,null,null,null,null,"41033-01",20570,"No. 57 Agg, 703.02 Super-Structure",2.6920000000000002,1.24]
[1,{"$error":"#VALUE!"},null,null,null,null,null,null,4,4,null,null,null,null,null,null,"41033-01",20570,"No. 57 Agg, 703.02 Super-Structure",2.6909999999999998,1.25]
[1,1,null,null,null,null,null,null,3,3,null,null,null,null,null,null,"41033-01",20081,"No. 8 Agg, 703.02 Concrete Overlay",2.694,1.64]
[1,1,null,null,null,null,null,null,2,2,null,null,null,null,null,null,"41033-01",20081,"No. 8 Agg, 703.02 Concrete Overlay",2.6970000000000001,1.43]
[{"$error":"#VALUE!"},1,null,null,null,null,null,null,1,1,null,null,null,null,null,null,"41033-01",20081,"No. 8 Agg, 703.02 Concrete Overlay",2.714,1.33]
[{"$error":"#VALUE!"},{"$error":"#VALUE!"},null,null,null,null,null,null,1,1,null,null,null,null,null,null,"41044-01",20081,"No. 8 Agg, 703.02 Concrete Overlay",2.9279999999999999,0.28000000000000003]
[1,1,null,null,null,null,null,null,6,6,null,null,null,null,null,null,"41058-01",20570,"No. 57 Agg, 703.02 Super-Structure",2.6459999999999999,2.12]
[1,{"$error":"#VALUE!"},null,null,null,null,null,null,5,5,null,null,null,null,null,null,"41058-01",20570,"No. 57 Agg, 703.02 Super-Structure",2.6989999999999998,1.23]
[1,1,null,null,null,null,null,null,4,4,null,null,null,null,null,null,"41058-01",2008,"No. 8 Agg, 703.02 Concrete",2.6720000000000002,2.2000000000000002]
[1,1,null,null,null,null,null,null,3,3,null,null,null,null,null,null,"41058-01",20081,"No. 8 Agg, 703.02 Concrete Overlay",2.6989999999999998,1.76]
[1,1,null,null,null,null,null,null,2,2,null,null,null,null,null,null,"41058-01",20081,"No. 8 Agg, 703.02 Concrete Overlay",2.6309999999999998,3.12]
[{"$error":"#VALUE!"},{"$error":"#VALUE!"},null,null,null,null,null,null,1,1,null,null,null,null,null,null,"41058-01",20081,"No. 8 Agg, 703.02 Concrete Overlay",2.6309999999999998,3.36]
[1,1,null,null,null,null,null,null,6,6,null,null,null,null,null,null,"41063-01",20570,"No. 57 Agg, 703.02 Super-Structure",2.68,1.54]
[1,1,null,null,null,null,null,null,5,5,null,null,null,null,null,null,"41063-01",20570,"No. 57 Agg, 703.02 Super-Structure",2.661,1.48]
[1,{"$error":"#VALUE!"},null,null,null,null,null,null,4,4,null,null,null,null,null,null,"41063-01",20570,"No. 57 Agg, 703.02 Super-Structure",2.6819999999999999,1.23]
[1,1,null,null,null,null,null,null,3,3,null,null,null,null,null,null,"41063-01",20081,"No. 8 Agg, 703.02 Concrete Overlay",2.7040000000000002,1.31]
[1,1,null,null,null,null,null,null,2,2,null,null,null,null,null,null,"41063-01",20081,"No. 8 Agg, 703.02 Concrete Overlay",2.6680000000000001,1.92]
[{"$error":"#VALUE!"},{"$error":"#VALUE!"},null,null,null,null,null,null,1,1,null,null,null,null,null,null,"41063-01",20081,"No. 8 Agg, 703.02 Concrete Overlay",2.7240000000000002,1.22]
[1,1,null,null,null,null,null,null,6,6,null,null,null,null,null,null,"41066-01",20570,"No. 57 Agg, 703.02 Super-Structure",2.5750000000000002,2.97]
[1,1,null,null,null,null,null,null,5,5,null,null,null,null,null,null,"41066-01",20570,"No. 57 Agg, 703.02 Super-Structure",2.6160000000000001,2.4700000000000002]
[1,{"$error":"#VALUE!"},null,null,null,null,null,null,4,4,null,null,null,null,null,null,"41066-01",20570,"No. 57 Agg, 703.02 Super-Structure",2.633,2.2799999999999998]
[1,1,null,null,null,null,null,null,3,3,null,null,null,null,null,null,"41066-01",20080,"No. 8 Agg, 703.02 Super-Structure",2.6339999999999999,2.86]
[1,1,null,null,null,null,null,null,2,2,null,null,null,null,null,null,"41066-01",20080,"No. 8 Agg, 703.02 Super-Structure",2.621,3.13]
[{"$error":"#VALUE!"},{"$error":"#VALUE!"},null,null,null,null,null,null,1,1,null,null,null,null,null,null,"41066-01",20080,"No. 8 Agg, 703.02 Super-Structure",2.5939999999999999,3.5]
[1,1,null,null,null,null,null,null,6,6,null,null,null,null,null,null,"42002-01",20570,"No. 57 Agg, 703.02 Super-Structure",2.6059999999999999,2.15]
[1,1,null,null,null,null,null,null,5,5,null,null,null,null,null,null,"42002-01",20570,"No. 57 Agg, 703.02 Super-Structure",2.5939999999999999,2.36]
[1,{"$error":"#VALUE!"},null,null,null,null,null,null,4,4,null,null,null,null,null,null,"42002-01",20570,"No. 57 Agg, 703.02 Super-Structure",2.605,2.16]
[1,1,null,null,null,null,null,null,3,3,null,null,null,null,null,null,"42002-01",20081,"No. 8 Agg, 703.02 Concrete Overlay",2.59,2.83]
[1,1,null,null,null,null,null,null,2,2,null,null,null,null,null,null,"42002-01",20081,"No. 8 Agg, 703.02 Concrete Overlay",2.589,2.79]
[{"$error":"#VALUE!"},{"$error":"#VALUE!"},null,null,null,null,null,null,1,1,null,null,null,null,null,null,"42002-01",20081,"No. 8 Agg, 703.02 Concrete Overlay",2.5960000000000001,2.66]
[1,1,null,null,null,null,null,null,5,5,null,null,null,null,null,null,"42004A-01",20570,"No. 57 Agg, 703.02 Super-Structure",null,2.6]
[1,1,null,null,null,null,null,null,4,4,null,null,null,null,null,null,"42004A-01",20570,"No. 57 Agg, 703.02 Super-Structure",2.5960000000000001,2.52]
[1,{"$error":"#VALUE!"},null,null,null,null,null,null,3,3,null,null,null,null,null,null,"42004A-01",20570,"No. 57 Agg, 703.02 Super-Structure",2.621,2.2000000000000002]
[1,1,null,null,null,null,null,null,2,2,null,null,null,null,null,null,"42004A-01",20081,"No. 8 Agg, 703.02 Concrete Overlay",2.589,3.16]
[{"$error":"#VALUE!"},1,null,null,null,null,null,null,1,1,null,null,null,null,null,null,"42004A-01",20081,"No. 8 Agg, 703.02 Concrete Overlay",null,2.7]
[1,1,null,null,null,null,null,null,2,2,null,null,null,null,null,null,"42005C-01",20081,"No. 8 Agg, 703.02 Concrete Overlay",2.617,2.76]
[{"$error":"#VALUE!"},{"$error":"#VALUE!"},null,null,null,null,null,null,1,1,null,null,null,null,null,null,"42005C-01",20081,"No. 8 Agg, 703.02 Concrete Overlay",2.6150000000000002,2.77]
[1,1,null,null,null,null,null,null,2,2,null,null,null,null,null,null,"42005D-01",20570,"No. 57 Agg, 703.02 Super-Structure",2.6030000000000002,2.6]
[{"$error":"#VALUE!"},1,null,null,null,null,null,null,1,1,null,null,null,null,null,null,"42005D-01",20570,"No. 57 Agg, 703.02 Super-Structure",2.62,2.2000000000000002]
[1,1,null,null,null,null,null,null,7,7,null,null,null,null,null,null,"42006-01",20570,"No. 57 Agg, 703.02 Super-Structure",2.552,3.22]
[1,1,null,null,null,null,null,null,6,6,null,null,null,null,null,null,"42006-01",20570,"No. 57 Agg, 703.02 Super-Structure",2.5379999999999998,3.44]
[1,{"$error":"#VALUE!"},null,null,null,null,null,null,5,5,null,null,null,null,null,null,"42006-01",20570,"No. 57 Agg, 703.02 Super-Structure",2.5379999999999998,3.19]
[1,1,null,null,null,null,null,null,4,4,null,null,null,null,null,null,"42006-01",20081,"No. 8 Agg, 703.02 Concrete Overlay",2.536,4.16]
[1,1,null,null,null,null,null,null,3,3,null,null,null,null,null,null,"42006-01",20081,"No. 8 Agg, 703.02 Concrete Overlay",2.536,4.0999999999999996]
[1,1,null,null,null,null,null,null,2,2,null,null,null,null,null,null,"42006-01",20081,"No. 8 Agg, 703.02 Concrete Overlay",2.5590000000000002,3.86]
[{"$f":"(FIND(Q195,Q196,1))","v":{"$error":"#VALUE!"}},{"$f":"(FIND(R195,R196,1))","v":{"$error":"#VALUE!"}},null,null,null,null,null,null,{"$f":"MATCH(Q195,Q195:Q884,1)","v":1},{"$f":"COUNTIF(Q195:Q884,Q195)","v":1},null,null,null,null,null,null,"42006-01",20081,"No. 8 Agg, 703.02 Concrete Overlay",2.5590000000000002,3.79]
[1,1,null,null,null,null,null,null,2,2,null,null,null,null,null,null,"43003-01",2008,"No. 8 Agg, 703.02 Concrete",null,1.97]
[{"$error":"#VALUE!"},1,null,null,null,null,null,null,1,1,null,null,null,null,null,null,"43003-01",2008,"No. 8 Agg, 703.02 Concrete",2.629,1.83]
[1,1,null,null,null,null,null,null,3,3,null,null,null,null,null,null,"43007-01",2008,"No. 8 Agg, 703.02 Concrete",null,1.51]
[1,1,null,null,null,null,null,null,2,2,null,null,null,null,null,null,"43007-01",2008,"No. 8 Agg, 703.02 Concrete",null,1.49]
[{"$error":"#VALUE!"},{"$error":"#VALUE!"},null,null,null,null,null,null,1,1,null,null,null,null,null,null,"43007-01",2008,"No. 8 Agg, 703.02 Concrete",2.6349999999999998,1.57]
[1,1,null,null,null,null,null,null,4,4,null,null,null,null,null,null,"43011-01",2057,"No. 57 Agg, 703.02 Concrete",2.7069999999999999,0.43]
[1,{"$error":"#VALUE!"},null,null,null,null,null,null,3,3,null,null,null,null,null,null,"43011-01",2057,"No. 57 Agg, 703.02 Concrete",2.7029999999999998,0.53]
[1,1,null,null,null,null,null,null,2,2,null,null,null,null,null,null,"43011-01",2008,"No. 8 Agg, 703.02 Concrete",2.6960000000000002,0.61]
[{"$error":"#VALUE!"},{"$error":"#VALUE!"},null,null,null,null,null,null,1,1,null,null,null,null,null,null,"43011-01",2008,"No. 8 Agg, 703.02 Concrete",2.6989999999999998,0.53]
[1,{"$error":"#VALUE!"},null,null,null,null,null,null,4,4,null,null,null,null,null,null,"43016-01",2057,"No. 57 Agg, 703.02 Concrete",2.5760000000000001,1.98]
[1,1,null,null,null,null,null,null,3,3,null,null,null,null,null,null,"43016-01","02008M","No. 8 Agg, 703.02 Concrete, Mod Grading",2.5979999999999999,1.8]
[1,1,null,null,null,null,null,null,2,2,null,null,null,null,null,null,"43016-01","02008M","No. 8 Agg, 703.02 Concrete, Mod Grading",2.6160000000000001,1.74]
[{"$error":"#VALUE!"},{"$error":"#VALUE!"},null,null,null,null,null,null,1,1,null,null,null,null,null,null,"43016-01","02008M","No. 8 Agg, 703.02 Concrete, Mod Grading",2.5870000000000002,2.06]
[1,1,null,null,null,null,null,null,3,3,null,null,null,null,null,null,"43020-01",20080,"No. 8 Agg, 703.02 Super-Structure",2.56,2.33]
[1,1,null,null,null,null,null,null,2,2,null,null,null,null,null,null,"43020-01",20080,"No. 8 Agg, 703.02 Super-Structure",2.5859999999999999,2.15]
[{"$error":"#VALUE!"},{"$error":"#VALUE!"},null,null,null,null,null,null,1,1,null,null,null,null,null,null,"43020-01",20080,"No. 8 Agg, 703.02 Super-Structure",2.5979999999999999,2.1]
[1,1,null,null,null,null,null,null,2,2,null,null,null,null,null,null,"43025-01",2008,"No. 8 Agg, 703.02 Concrete",2.5979999999999999,2.39]
[{"$error":"#VALUE!"},1,null,null,null,null,null,null,1,1,null,null,null,null,null,null,"43025-01",2008,"No. 8 Agg, 703.02 Concrete",2.5870000000000002,2.2599999999999998]
[1,1,null,null,null,null,null,null,3,3,null,null,null,null,null,null,"43039-01",2008,"No. 8 Agg, 703.02 Concrete",2.58,2.31]
[1,1,null,null,null,null,null,null,2,2,null,null,null,null,null,null,"43039-01",2008,"No. 8 Agg, 703.02 Concrete",2.5659999999999998,2.4300000000000002]
[{"$error":"#VALUE!"},{"$error":"#VALUE!"},null,null,null,null,null,null,1,1,null,null,null,null,null,null,"43039-01",2008,"No. 8 Agg, 703.02 Concrete",2.5830000000000002,1.65]
[1,{"$error":"#VALUE!"},null,null,null,null,null,null,2,2,null,null,null,null,null,null,"43063-01",2057,"No. 57 Agg, 703.02 Concrete",2.52,2.2400000000000002]
[{"$error":"#VALUE!"},{"$error":"#VALUE!"},null,null,null,null,null,null,1,1,null,null,null,null,null,null,"43063-01",2008,"No. 8 Agg, 703.02 Concrete",2.52,2.2400000000000002]
[1,1,null,null,null,null,null,null,4,4,null,null,null,null,null,null,"43072-01",2057,"No. 57 Agg, 703.02 Concrete",2.6989999999999998,0.43]
[1,{"$error":"#VALUE!"},null,null,null,null,null,null,3,3,null,null,null,null,null,null,"43072-01",20570,"No. 57 Agg, 703.02 Super-Structure",2.6960000000000002,0.47]
[1,1,null,null,null,null,null,null,2,2,null,null,null,null,null,null,"43072-01",2008,"No. 8 Agg, 703.02 Concrete",2.6869999999999998,0.64]
[{"$error":"#VALUE!"},{"$error":"#VALUE!"},null,null,null,null,null,null,1,1,null,null,null,null,null,null,"43072-01",2008,"No. 8 Agg, 703.02 Concrete",2.6890000000000001,0.63]
[1,1,null,null,null,null,null,null,3,3,null,null,null,null,null,null,"43076-01",2057,"No. 57 Agg, 703.02 Concrete",2.6989999999999998,0.36]
[1,{"$error":"#VALUE!"},null,null,null,null,null,null,2,2,null,null,null,null,null,null,"43076-01",2057,"No. 57 Agg, 703.02 Concrete",2.698,0.44]
[{"$error":"#VALUE!"},{"$error":"#VALUE!"},null,null,null,null,null,null,1,1,null,null,null,null,null,null,"43076-01",2008,"No. 8 Agg, 703.02 Concrete",2.6909999999999998,0.61]
[1,{"$error":"#VALUE!"},null,null,null,null,null,null,2,2,null,null,null,null,null,null,"43085-01",20570,"No. 57 Agg, 703.02 Super-Structure",2.71,0.28999999999999998]
[{"$error":"#VALUE!"},{"$error":"#VALUE!"},null,null,null,null,null,null,1,1,null,null,null,null,null,null,"43085-01",20081,"No. 8 Agg, 703.02 Concrete Overlay",2.6970000000000001,0.36]
[1,1,null,null,null,null,null,null,5,5,null,null,null,null,null,null,"43094-01",2057,"No. 57 Agg, 703.02 Concrete",2.6960000000000002,0.43]
[1,{"$error":"#VALUE!"},null,null,null,null,null,null,4,4,null,null,null,null,null,null,"43094-01",2057,"No. 57 Agg, 703.02 Concrete",2.698,0.45]
[1,1,null,null,null,null,null,null,3,3,null,null,null,null,null,null,"43094-01",2008,"No. 8 Agg, 703.02 Concrete",2.6920000000000002,0.54]
[1,1,null,null,null,null,null,null,2,2,null,null,null,null,null,null,"43094-01",2008,"No. 8 Agg, 703.02 Concrete",2.6850000000000001,0.57999999999999996]
[{"$error":"#VALUE!"},{"$error":"#VALUE!"},null,null,null,null,null,null,1,1,null,null,null,null,null,null,"43094-01",2008,"No. 8 Agg, 703.02 Concrete",2.6909999999999998,0.49]
[1,1,null,null,null,null,null,null,4,4,null,null,null,null,null,null,"44003-01",2057,"No. 57 Agg, 703.02 Concrete",2.6080000000000001,1.8]
[1,{"$error":"#VALUE!"},null,null,null,null,null,null,3,3,null,null,null,null,null,null,"44003-01",20570,"No. 57 Agg, 703.02 Super-Structure",2.6259999999999999,1.8]
[1,1,null,null,null,null,null,null,2,2,null,null,null,null,null,null,"44003-01",2008,"No. 8 Agg, 703.02 Concrete",2.605,1.98]
[{"$error":"#VALUE!"},{"$error":"#VALUE!"},null,null,null,null,null,null,1,1,null,null,null,null,null,null,"44003-01",20081,"No. 8 Agg, 703.02 Concrete Overlay",2.6030000000000002,2.15]
[1,1,null,null,null,null,null,null,5,5,null,null,null,null,null,null,"44005-01",2057,"No. 57 Agg, 703.02 Concrete",2.5819999999999999,2.42]
[1,{"$error":"#VALUE!"},null,null,null,null,null,null,4,4,null,null,null,null,null,null,"44005-01",2057,"No. 57 Agg, 703.02 Concrete",2.58,2.4300000000000002]
[1,1,null,null,null,null,null,null,3,3,null,null,null,null,null,null,"44005-01",2008,"No. 8 Agg, 703.02 Concrete",2.5819999999999999,2.44]
[1,1,null,null,null,null,null,null,2,2,null,null,null,null,null,null,"44005-01",2008,"No. 8 Agg, 703.02 Concrete",2.6160000000000001,2.04]
[{"$error":"#VALUE!"},{"$error":"#VALUE!"},null,null,null,null,null,null,1,1,null,null,null,null,null,null,"44005-01",2008,"No. 8 Agg, 703.02 Concrete",2.6,2.2799999999999998]
[1,1,null,null,null,null,null,null,2,2,null,null,null,null,null,null,"44013A-01",2057,"No. 57 Agg, 703.02 Concrete",2.629,1.87]
[{"$error":"#VALUE!"},1,null,null,null,null,null,null,1,1,null,null,null,null,null,null,"44013A-01",2057,"No. 57 Agg, 703.02 Concrete",2.6309999999999998,1.77]
[1,1,null,null,null,null,null,null,4,4,null,null,null,null,null,null,"44019-01",2057,"No. 57 Agg, 703.02 Concrete",2.605,2.06]
[1,1,null,null,null,null,null,null,3,3,null,null,null,null,null,null,"44019-01",2057,"No. 57 Agg, 703.02 Concrete",2.63,1.64]
[1,1,null,null,null,null,null,null,2,2,null,null,null,null,null,null,"44019-01",2057,"No. 57 Agg, 703.02 Concrete",2.6070000000000002,1.97]
[{"$error":"#VALUE!"},1,null,null,null,null,null,null,1,1,null,null,null,null,null,null,"44019-01",2057,"No. 57 Agg, 703.02 Concrete",2.6,2.0099999999999998]
[1,1,null,null,null,null,null,null,2,2,null,null,null,null,null,null,"44020A-01",2057,"No. 57 Agg, 703.02 Concrete",2.64,1.96]
[{"$error":"#VALUE!"},1,null,null,null,null,null,null,1,1,null,null,null,null,null,null,"44020A-01",2057,"No. 57 Agg, 703.02 Concrete",2.661,1.63]
[1,1,null,null,null,null,null,null,4,4,null,null,null,null,null,null,"44032-01",2057,"No. 57 Agg, 703.02 Concrete",2.5609999999999999,1.78]
[1,{"$error":"#VALUE!"},null,null,null,null,null,null,3,3,null,null,null,null,null,null,"44032-01",2057,"No. 57 Agg, 703.02 Concrete",2.5350000000000001,2.1]
[1,1,null,null,null,null,null,null,2,2,null,null,null,null,null,null,"44032-01",2008,"No. 8 Agg, 703.02 Concrete",2.5659999999999998,2.06]
[{"$error":"#VALUE!"},{"$error":"#VALUE!"},null,null,null,null,null,null,1,1,null,null,null,null,null,null,"44032-01",2008,"No. 8 Agg, 703.02 Concrete",2.577,1.88]
[1,1,null,null,null,null,null,null,2,2,null,null,null,null,null,null,"44036-01",2057,"No. 57 Agg, 703.02 Concrete",2.59,1.57]
[{"$error":"#VALUE!"},1,null,null,null,null,null,null,1,1,null,null,null,null,null,null,"44036-01",2057,"No. 57 Agg, 703.02 Concrete",2.61,1.39]
[1,1,null,null,null,null,null,null,6,6,null,null,null,null,null,null,"44038-01",20570,"No. 57 Agg, 703.02 Super-Structure",2.5310000000000001,2.16]
[1,1,null,null,null,null,null,null,5,5,null,null,null,null,null,null,"44038-01",20570,"No. 57 Agg, 703.02 Super-Structure",2.496,2.71]
[1,{"$error":"#VALUE!"},null,null,null,null,null,null,4,4,null,null,null,null,null,null,"44038-01",20570,"No. 57 Agg, 703.02 Super-Structure",2.4980000000000002,2.75]
[{"$f":"(FIND(Q259,Q260,1))","v":1},{"$f":"(FIND(R259,R260,1))","v":1},null,null,null,null,null,null,{"$f":"MATCH(Q259,Q259:Q948,1)","v":3},{"$f":"COUNTIF(Q259:Q948,Q259)","v":3},null,null,null,null,null,null,"44038-01",20080,"No. 8 Agg, 703.02 Super-Structure",2.496,2.87]
[1,1,null,null,null,null,null,null,2,2,null,null,null,null,null,null,"44038-01",20080,"No. 8 Agg, 703.02 Super-Structure",2.488,3.01]
[{"$error":"#VALUE!"},{"$error":"#VALUE!"},null,null,null,null,null,null,1,1,null,null,null,null,null,null,"44038-01",20080,"No. 8 Agg, 703.02 Super-Structure",2.5299999999999998,2.2999999999999998]
[1,1,null,null,null,null,null,null,4,4,null,null,null,null,null,null,"45002-01",20570,"No. 57 Agg, 703.02 Super-Structure",2.6549999999999998,1.23]
[1,{"$error":"#VALUE!"},null,null,null,null,null,null,3,3,null,null,null,null,null,null,"45002-01",20570,"No. 57 Agg, 703.02 Super-Structure",2.6480000000000001,1.56]
[1,1,null,null,null,null,null,null,2,2,null,null,null,null,null,null,"45002-01",20081,"No. 8 Agg, 703.02 Concrete Overlay",2.6459999999999999,1.68]
[{"$error":"#VALUE!"},{"$error":"#VALUE!"},null,null,null,null,null,null,1,1,null,null,null,null,null,null,"45002-01",20081,"No. 8 Agg, 703.02 Concrete Overlay",2.6520000000000001,1.81]
[{"$error":"#VALUE!"},1,null,null,null,null,null,null,1,1,null,null,null,null,null,null,"45004-01",20570,"No. 57 Agg, 703.02 Super-Structure",2.63,1.71]
[1,1,null,null,null,null,null,null,6,6,null,null,null,null,null,null,"45005-01",20570,"No. 57 Agg, 703.02 Super-Structure",2.6019999999999999,2.0499999999999998]
[1,1,null,null,null,null,null,null,5,5,null,null,null,null,null,null,"45005-01",20570,"No. 57 Agg, 703.02 Super-Structure",2.613,1.88]
[1,{"$error":"#VALUE!"},null,null,null,null,null,null,4,4,null,null,null,null,null,null,"45005-01",20570,"No. 57 Agg, 703.02 Super-Structure",2.6030000000000002,2.25]
[1,1,null,null,null,null,null,null,3,3,null,null,null,null,null,null,"45005-01",20081,"No. 8 Agg, 703.02 Concrete Overlay",2.593,2.58]
[1,1,null,null,null,null,null,null,2,2,null,null,null,null,null,null,"45005-01",20081,"No. 8 Agg, 703.02 Concrete Overlay",2.5880000000000001,2.7]
[{"$error":"#VALUE!"},{"$error":"#VALUE!"},null,null,null,null,null,null,1,1,null,null,null,null,null,null,"45005-01",20081,"No. 8 Agg, 703.02 Concrete Overlay",2.585,2.91]
[1,1,null,null,null,null,null,null,5,5,null,null,null,null,null,null,"45009-01",2057,"No. 57 Agg, 703.02 Concrete",2.6659999999999999,1.52]
[1,1,null,null,null,null,null,null,4,4,null,null,null,null,null,null,"45009-01",2057,"No. 57 Agg, 703.02 Concrete",2.661,1.6]
[1,{"$error":"#VALUE!"},null,null,null,null,null,null,3,3,null,null,null,null,null,null,"45009-01",2057,"No. 57 Agg, 703.02 Concrete",2.669,1.43]
[1,1,null,null,null,null,null,null,2,2,null,null,null,null,null,null,"45009-01",2008,"No. 8 Agg, 703.02 Concrete",2.649,1.98]
[{"$error":"#VALUE!"},{"$error":"#VALUE!"},null,null,null,null,null,null,1,1,null,null,null,null,null,null,"45009-01",2008,"No. 8 Agg, 703.02 Concrete",2.6579999999999999,1.81]
[{"$error":"#VALUE!"},1,null,null,null,null,null,null,1,1,null,null,null,null,null,null,"45009A-01",2057,"No. 57 Agg, 703.02 Concrete",2.6539999999999999,1.51]
[1,1,null,null,null,null,null,null,6,6,null,null,null,null,null,null,"45011-01",20570,"No. 57 Agg, 703.02 Super-Structure",2.6469999999999998,1.91]
[1,1,null,null,null,null,null,null,5,5,null,null,null,null,null,null,"45011-01",20570,"No. 57 Agg, 703.02 Super-Structure",2.669,1.72]
[1,{"$error":"#VALUE!"},null,null,null,null,null,null,4,4,null,null,null,null,null,null,"45011-01",20570,"No. 57 Agg, 703.02 Super-Structure",2.669,1.8]
[1,1,null,null,null,null,null,null,3,3,null,null,null,null,null,null,"45011-01",20080,"No. 8 Agg, 703.02 Super-Structure",2.6669999999999998,1.99]
[1,1,null,null,null,null,null,null,2,2,null,null,null,null,null,null,"45011-01",20080,"No. 8 Agg, 703.02 Super-Structure",2.6739999999999999,2.14]
[{"$error":"#VALUE!"},{"$error":"#VALUE!"},null,null,null,null,null,null,1,1,null,null,null,null,null,null,"45011-01",20080,"No. 8 Agg, 703.02 Super-Structure",2.6680000000000001,2.1800000000000002]
[1,1,null,null,null,null,null,null,6,6,null,null,null,null,null,null,"45012-01",20570,"No. 57 Agg, 703.02 Super-Structure",2.5840000000000001,2.4300000000000002]
[1,1,null,null,null,null,null,null,5,5,null,null,null,null,null,null,"45012-01",20570,"No. 57 Agg, 703.02 Super-Structure",2.589,2.39]
[1,{"$error":"#VALUE!"},null,null,null,null,null,null,4,4,null,null,null,null,null,null,"45012-01",20570,"No. 57 Agg, 703.02 Super-Structure",2.5649999999999999,2.64]
[1,1,null,null,null,null,null,null,3,3,null,null,null,null,null,null,"45012-01",20080,"No. 8 Agg, 703.02 Super-Structure",2.57,3.29]
[1,1,null,null,null,null,null,null,2,2,null,null,null,null,null,null,"45012-01",20080,"No. 8 Agg, 703.02 Super-Structure",2.589,2.92]
[{"$error":"#VALUE!"},{"$error":"#VALUE!"},null,null,null,null,null,null,1,1,null,null,null,null,null,null,"45012-01",20080,"No. 8 Agg, 703.02 Super-Structure",2.57,3.27]
[{"$error":"#VALUE!"},1,null,null,null,null,null,null,1,1,null,null,null,null,null,null,"45012A-01",2057,"No. 57 Agg, 703.02 Concrete",2.552,3.18]
[1,1,null,null,null,null,null,null,6,6,null,null,null,null,null,null,"45013-01",20570,"No. 57 Agg, 703.02 Super-Structure",2.6779999999999999,1.83]
[1,1,null,null,null,null,null,null,5,5,null,null,null,null,null,null,"45013-01",20570,"No. 57 Agg, 703.02 Super-Structure",2.6720000000000002,1.97]
[1,{"$error":"#VALUE!"},null,null,null,null,null,null,4,4,null,null,null,null,null,null,"45013-01",20570,"No. 57 Agg, 703.02 Super-Structure",2.6720000000000002,1.98]
[1,1,null,null,null,null,null,null,3,3,null,null,null,null,null,null,"45013-01",20081,"No. 8 Agg, 703.02 Concrete Overlay",2.6829999999999998,2.1]
[1,{"$error":"#VALUE!"},null,null,null,null,null,null,2,2,null,null,null,null,null,null,"45013-01",20081,"No. 8 Agg, 703.02 Concrete Overlay",2.6760000000000002,2.27]
[{"$error":"#VALUE!"},{"$error":"#VALUE!"},null,null,null,null,null,null,1,1,null,null,null,null,null,null,"45013-01",20080,"No. 8 Agg, 703.02 Super-Structure",2.6859999999999999,2.06]
[1,1,null,null,null,null,null,null,6,6,null,null,null,null,null,null,"45019-01",20570,"No. 57 Agg, 703.02 Super-Structure",2.6139999999999999,1.7]
[1,1,null,null,null,null,null,null,5,5,null,null,null,null,null,null,"45019-01",20570,"No. 57 Agg, 703.02 Super-Structure",2.6080000000000001,2.08]
[1,{"$error":"#VALUE!"},null,null,null,null,null,null,4,4,null,null,null,null,null,null,"45019-01",20570,"No. 57 Agg, 703.02 Super-Structure",2.593,2.56]
[1,1,null,null,null,null,null,null,3,3,null,null,null,null,null,null,"45019-01",20081,"No. 8 Agg, 703.02 Concrete Overlay",2.5910000000000002,3.22]
[1,{"$error":"#VALUE!"},null,null,null,null,null,null,2,2,null,null,null,null,null,null,"45019-01",20081,"No. 8 Agg, 703.02 Concrete Overlay",2.601,2.57]
[{"$error":"#VALUE!"},{"$error":"#VALUE!"},null,null,null,null,null,null,1,1,null,null,null,null,null,null,"45019-01",20080,"No. 8 Agg, 703.02 Super-Structure",2.6059999999999999,2.41]
[1,1,null,null,null,null,null,null,2,2,null,null,null,null,null,null,"45035-01",2057,"No. 57 Agg, 703.02 Concrete",2.6429999999999998,1.85]
[{"$error":"#VALUE!"},1,null,null,null,null,null,null,1,1,null,null,null,null,null,null,"45035-01",2057,"No. 57 Agg, 703.02 Concrete",2.6150000000000002,2.4]
[1,1,null,null,null,null,null,null,6,6,null,null,null,null,null,null,"45038-01",20570,"No. 57 Agg, 703.02 Super-Structure",2.6389999999999998,1.58]
[1,1,null,null,null,null,null,null,5,5,null,null,null,null,null,null,"45038-01",20570,"No. 57 Agg, 703.02 Super-Structure",2.6440000000000001,1.47]
[1,{"$error":"#VALUE!"},null,null,null,null,null,null,4,4,null,null,null,null,null,null,"45038-01",20570,"No. 57 Agg, 703.02 Super-Structure",2.6459999999999999,1.46]
[1,1,null,null,null,null,null,null,3,3,null,null,null,null,null,null,"45038-01",20080,"No. 8 Agg, 703.02 Super-Structure",2.6379999999999999,1.72]
[1,1,null,null,null,null,null,null,2,2,null,null,null,null,null,null,"45038-01",20080,"No. 8 Agg, 703.02 Super-Structure",2.653,1.76]
[{"$error":"#VALUE!"},{"$error":"#VALUE!"},null,null,null,null,null,null,1,1,null,null,null,null,null,null,"45038-01",20080,"No. 8 Agg, 703.02 Super-Structure",2.6349999999999998,1.75]
[1,1,null,null,null,null,null,null,6,6,null,null,null,null,null,null,"46004-01",2057,"No. 57 Agg, 703.02 Concrete",2.6360000000000001,1.76]
[1,1,null,null,null,null,null,null,5,5,null,null,null,null,null,null,"46004-01",20570,"No. 57 Agg, 703.02 Super-Structure",2.6539999999999999,1.68]
[1,{"$error":"#VALUE!"},null,null,null,null,null,null,4,4,null,null,null,null,null,null,"46004-01",20570,"No. 57 Agg, 703.02 Super-Structure",2.6429999999999998,1.67]
[1,1,null,null,null,null,null,null,3,3,null,null,null,null,null,null,"46004-01",2008,"No. 8 Agg, 703.02 Concrete",2.68,1.68]
[1,{"$error":"#VALUE!"},null,null,null,null,null,null,2,2,null,null,null,null,null,null,"46004-01",20081,"No. 8 Agg, 703.02 Concrete Overlay",2.67,1.78]
[{"$error":"#VALUE!"},{"$error":"#VALUE!"},null,null,null,null,null,null,1,1,null,null,null,null,null,null,"46004-01",20080,"No. 8 Agg, 703.02 Super-Structure",2.669,1.7]
[1,1,null,null,null,null,null,null,6,6,null,null,null,null,null,null,"46007-01",2057,"No. 57 Agg, 703.02 Concrete",2.6739999999999999,1.66]
[1,1,null,null,null,null,null,null,5,5,null,null,null,null,null,null,"46007-01",20570,"No. 57 Agg, 703.02 Super-Structure",2.7050000000000001,1.19]
[1,{"$error":"#VALUE!"},null,null,null,null,null,null,4,4,null,null,null,null,null,null,"46007-01",20570,"No. 57 Agg, 703.02 Super-Structure",2.7069999999999999,1.22]
[1,1,null,null,null,null,null,null,3,3,null,null,null,null,null,null,"46007-01",2008,"No. 8 Agg, 703.02 Concrete",2.6869999999999998,1.66]
[1,1,null,null,null,null,null,null,2,2,null,null,null,null,null,null,"46007-01",2008,"No. 8 Agg, 703.02 Concrete",2.6890000000000001,1.5]
[{"$f":"(FIND(Q323,Q324,1))","v":{"$error":"#VALUE!"}},{"$f":"(FIND(R323,R324,1))","v":{"$error":"#VALUE!"}},null,null,null,null,null,null,{"$f":"MATCH(Q323,Q323:Q1012,1)","v":1},{"$f":"COUNTIF(Q323:Q1012,Q323)","v":1},null,null,null,null,null,null,"46007-01",2008,"No. 8 Agg, 703.02 Concrete",2.669,1.85]
[1,1,null,null,null,null,null,null,5,5,null,null,null,null,null,null,"46008-01",2057,"No. 57 Agg, 703.02 Concrete",2.6819999999999999,1.56]
[1,1,null,null,null,null,null,null,4,4,null,null,null,null,null,null,"46008-01",20570,"No. 57 Agg, 703.02 Super-Structure",2.6760000000000002,1.65]
[1,{"$error":"#VALUE!"},null,null,null,null,null,null,3,3,null,null,null,null,null,null,"46008-01",20570,"No. 57 Agg, 703.02 Super-Structure",2.6779999999999999,1.56]
[1,1,null,null,null,null,null,null,2,2,null,null,null,null,null,null,"46008-01",20081,"No. 8 Agg, 703.02 Concrete Overlay",2.6760000000000002,1.64]
[{"$error":"#VALUE!"},{"$error":"#VALUE!"},null,null,null,null,null,null,1,1,null,null,null,null,null,null,"46008-01",20081,"No. 8 Agg, 703.02 Concrete Overlay",2.6930000000000001,1.58]
[1,1,null,null,null,null,null,null,5,5,null,null,null,null,null,null,"46011-01",2057,"No. 57 Agg, 703.02 Concrete",2.7,1.3]
[1,1,null,null,null,null,null,null,4,4,null,null,null,null,null,null,"46011-01",20570,"No. 57 Agg, 703.02 Super-Structure",2.7010000000000001,1.27]
[1,{"$error":"#VALUE!"},null,null,null,null,null,null,3,3,null,null,null,null,null,null,"46011-01",20570,"No. 57 Agg, 703.02 Super-Structure",2.69,1.44]
[1,1,null,null,null,null,null,null,2,2,null,null,null,null,null,null,"46011-01",2008,"No. 8 Agg, 703.02 Concrete",2.6739999999999999,1.82]
[{"$error":"#VALUE!"},{"$error":"#VALUE!"},null,null,null,null,null,null,1,1,null,null,null,null,null,null,"46011-01",2008,"No. 8 Agg, 703.02 Concrete",2.6890000000000001,1.62]
[1,1,null,null,null,null,null,null,4,4,null,null,null,null,null,null,"46013-01",20570,"No. 57 Agg, 703.02 Super-Structure",2.6970000000000001,1.32]
[1,{"$error":"#VALUE!"},null,null,null,null,null,null,3,3,null,null,null,null,null,null,"46013-01",20570,"No. 57 Agg, 703.02 Super-Structure",2.6859999999999999,1.39]
[1,1,null,null,null,null,null,null,2,2,null,null,null,null,null,null,"46013-01",20080,"No. 8 Agg, 703.02 Super-Structure",2.6789999999999998,1.56]
[{"$error":"#VALUE!"},{"$error":"#VALUE!"},null,null,null,null,null,null,1,1,null,null,null,null,null,null,"46013-01",20080,"No. 8 Agg, 703.02 Super-Structure",2.6859999999999999,1.5]
[1,1,null,null,null,null,null,null,4,4,null,null,null,null,null,null,"46014-01",2057,"No. 57 Agg, 703.02 Concrete",2.6619999999999999,1.69]
[1,{"$error":"#VALUE!"},null,null,null,null,null,null,3,3,null,null,null,null,null,null,"46014-01",2057,"No. 57 Agg, 703.02 Concrete",2.673,1.68]
[1,1,null,null,null,null,null,null,2,2,null,null,null,null,null,null,"46014-01",2008,"No. 8 Agg, 703.02 Concrete",2.6539999999999999,2.17]
[{"$error":"#VALUE!"},{"$error":"#VALUE!"},null,null,null,null,null,null,1,1,null,null,null,null,null,null,"46014-01",2008,"No. 8 Agg, 703.02 Concrete",2.6579999999999999,1.92]
[1,1,null,null,null,null,null,null,6,6,null,null,null,null,null,null,"46015-01",20570,"No. 57 Agg, 703.02 Super-Structure",2.7450000000000001,1.1399999999999999]
[1,1,null,null,null,null,null,null,5,5,null,null,null,null,null,null,"46015-01",20570,"No. 57 Agg, 703.02 Super-Structure",2.738,1.27]
[1,{"$error":"#VALUE!"},null,null,null,null,null,null,4,4,null,null,null,null,null,null,"46015-01",20570,"No. 57 Agg, 703.02 Super-Structure",2.7410000000000001,1.19]
[1,1,null,null,null,null,null,null,3,3,null,null,null,null,null,null,"46015-01",20080,"No. 8 Agg, 703.02 Super-Structure",2.7290000000000001,1.47]
[1,1,null,null,null,null,null,null,2,2,null,null,null,null,null,null,"46015-01",20080,"No. 8 Agg, 703.02 Super-Structure",2.7240000000000002,1.62]
[{"$error":"#VALUE!"},{"$error":"#VALUE!"},null,null,null,null,null,null,1,1,null,null,null,null,null,null,"46015-01",20080,"No. 8 Agg, 703.02 Super-Structure",2.7360000000000002,1.35]
[1,1,null,null,null,null,null,null,7,7,null,null,null,null,null,null,"46022B-01",2057,"No. 57 Agg, 703.02 Concrete",2.63,1.92]
[1,1,null,null,null,null,null,null,6,6,null,null,null,null,null,null,"46022B-01",2057,"No. 57 Agg, 703.02 Concrete",2.6539999999999999,1.63]
[1,1,null,null,null,null,null,null,5,5,null,null,null,null,null,null,"46022B-01",2057,"No. 57 Agg, 703.02 Concrete",2.6459999999999999,1.71]
[1,{"$error":"#VALUE!"},null,null,null,null,null,null,4,4,null,null,null,null,null,null,"46022B-01",2057,"No. 57 Agg, 703.02 Concrete",2.6309999999999998,2.13]
[1,1,null,null,null,null,null,null,3,3,null,null,null,null,null,null,"46022B-01",2008,"No. 8 Agg, 703.02 Concrete",2.6560000000000001,2.14]
[1,1,null,null,null,null,null,null,2,2,null,null,null,null,null,null,"46022B-01",2008,"No. 8 Agg, 703.02 Concrete",2.6720000000000002,1.95]
[{"$error":"#VALUE!"},{"$error":"#VALUE!"},null,null,null,null,null,null,1,1,null,null,null,null,null,null,"46022B-01",2008,"No. 8 Agg, 703.02 Concrete",2.6619999999999999,2.0299999999999998]
[1,1,null,null,null,null,null,null,7,7,null,null,null,null,null,null,"46023B-01",20570,"No. 57 Agg, 703.02 Super-Structure",2.629,2.06]
[1,1,null,null,null,null,null,null,6,6,null,null,null,null,null,null,"46023B-01",20570,"No. 57 Agg, 703.02 Super-Structure",2.6669999999999998,1.71]
[1,1,null,null,null,null,null,null,5,5,null,null,null,null,null,null,"46023B-01",20570,"No. 57 Agg, 703.02 Super-Structure",2.6150000000000002,2.46]
[1,{"$error":"#VALUE!"},null,null,null,null,null,null,4,4,null,null,null,null,null,null,"46023B-01",20570,"No. 57 Agg, 703.02 Super-Structure",2.6150000000000002,2.54]
[1,1,null,null,null,null,null,null,3,3,null,null,null,null,null,null,"46023B-01",20081,"No. 8 Agg, 703.02 Concrete Overlay",2.657,2.1]
[1,1,null,null,null,null,null,null,2,2,null,null,null,null,null,null,"46023B-01",20081,"No. 8 Agg, 703.02 Concrete Overlay",2.665,2.0499999999999998]
[{"$error":"#VALUE!"},{"$error":"#VALUE!"},null,null,null,null,null,null,1,1,null,null,null,null,null,null,"46023B-01",20081,"No. 8 Agg, 703.02 Concrete Overlay",2.6469999999999998,2.23]
[1,1,null,null,null,null,null,null,6,6,null,null,null,null,null,null,"46026-01",20570,"No. 57 Agg, 703.02 Super-Structure",2.6850000000000001,1.4]
[1,1,null,null,null,null,null,null,5,5,null,null,null,null,null,null,"46026-01",20570,"No. 57 Agg, 703.02 Super-Structure",2.6909999999999998,1.41]
[1,{"$error":"#VALUE!"},null,null,null,null,null,null,4,4,null,null,null,null,null,null,"46026-01",20570,"No. 57 Agg, 703.02 Super-Structure",2.6789999999999998,1.59]
[1,1,null,null,null,null,null,null,3,3,null,null,null,null,null,null,"46026-01",20081,"No. 8 Agg, 703.02 Concrete Overlay",2.677,1.7]
[1,1,null,null,null,null,null,null,2,2,null,null,null,null,null,null,"46026-01",20081,"No. 8 Agg, 703.02 Concrete Overlay",2.6840000000000002,1.48]
[{"$error":"#VALUE!"},{"$error":"#VALUE!"},null,null,null,null,null,null,1,1,null,null,null,null,null,null,"46026-01",20081,"No. 8 Agg, 703.02 Concrete Overlay",2.6909999999999998,1.54]
[1,1,null,null,null,null,null,null,6,6,null,null,null,null,null,null,"46028-01",20570,"No. 57 Agg, 703.02 Super-Structure",2.669,1.83]
[1,1,null,null,null,null,null,null,5,5,null,null,null,null,null,null,"46028-01",20570,"No. 57 Agg, 703.02 Super-Structure",2.6709999999999998,1.64]
[1,{"$error":"#VALUE!"},null,null,null,null,null,null,4,4,null,null,null,null,null,null,"46028-01",20570,"No. 57 Agg, 703.02 Super-Structure",2.6829999999999998,1.56]
[1,1,null,null,null,null,null,null,3,3,null,null,null,null,null,null,"46028-01",2008,"No. 8 Agg, 703.02 Concrete",2.6720000000000002,1.76]
[1,1,null,null,null,null,null,null,2,2,null,null,null,null,null,null,"46028-01",2008,"No. 8 Agg, 703.02 Concrete",2.637,1.92]
[{"$error":"#VALUE!"},{"$error":"#VALUE!"},null,null,null,null,null,null,1,1,null,null,null,null,null,null,"46028-01",2008,"No. 8 Agg, 703.02 Concrete",2.6680000000000001,1.76]
[1,1,null,null,null,null,null,null,4,4,null,null,null,null,null,null,"46031-01",20570,"No. 57 Agg, 703.02 Super-Structure",2.641,1.74]
[1,{"$error":"#VALUE!"},null,null,null,null,null,null,3,3,null,null,null,null,null,null,"46031-01",20570,"No. 57 Agg, 703.02 Super-Structure",2.6459999999999999,1.93]
[1,1,null,null,null,null,null,null,2,2,null,null,null,null,null,null,"46031-01",20081,"No. 8 Agg, 703.02 Concrete Overlay",2.665,2.06]
[{"$error":"#VALUE!"},{"$error":"#VALUE!"},null,null,null,null,null,null,1,1,null,null,null,null,null,null,"46031-01",20081,"No. 8 Agg, 703.02 Concrete Overlay",2.6659999999999999,1.89]
[1,1,null,null,null,null,null,null,5,5,null,null,null,null,null,null,"46032-01",20570,"No. 57 Agg, 703.02 Super-Structure",2.6190000000000002,2.11]
[1,{"$error":"#VALUE!"},null,null,null,null,null,null,4,4,null,null,null,null,null,null,"46032-01",20570,"No. 57 Agg, 703.02 Super-Structure",null,2.2200000000000002]
[1,1,null,null,null,null,null,null,3,3,null,null,null,null,null,null,"46032-01",2008,"No. 8 Agg, 703.02 Concrete",2.6179999999999999,2.86]
[1,1,null,null,null,null,null,null,2,2,null,null,null,null,null,null,"46032-01",20080,"No. 8 Agg, 703.02 Super-Structure",2.593,3.21]
[{"$error":"#VALUE!"},{"$error":"#VALUE!"},null,null,null,null,null,null,1,1,null,null,null,null,null,null,"46032-01",20080,"No. 8 Agg, 703.02 Super-Structure",2.593,3.21]
[1,1,null,null,null,null,null,null,4,4,null,null,null,null,null,null,"46036B-01",2057,"No. 57 Agg, 703.02 Concrete",2.6389999999999998,1.79]
[1,{"$error":"#VALUE!"},null,null,null,null,null,null,3,3,null,null,null,null,null,null,"46036B-01",2057,"No. 57 Agg, 703.02 Concrete",2.661,1.38]
[1,1,null,null,null,null,null,null,2,2,null,null,null,null,null,null,"46036B-01",2008,"No. 8 Agg, 703.02 Concrete",2.677,1.65]
[{"$error":"#VALUE!"},{"$error":"#VALUE!"},null,null,null,null,null,null,1,1,null,null,null,null,null,null,"46036B-01",2008,"No. 8 Agg, 703.02 Concrete",2.653,2.04]
[{"$f":"(FIND(Q387,Q388,1))","v":1},{"$f":"(FIND(R387,R388,1))","v":1},null,null,null,null,null,null,{"$f":"MATCH(Q387,Q387:Q1076,1)","v":2},{"$f":"COUNTIF(Q387:Q1076,Q387)","v":2},null,null,null,null,null,null,"46037-01",2057,"No. 57 Agg, 703.02 Concrete",2.68,1.61]
[{"$error":"#VALUE!"},1,null,null,null,null,null,null,1,1,null,null,null,null,null,null,"46037-01",2057,"No. 57 Agg, 703.02 Concrete",2.6749999999999998,1.64]
[1,1,null,null,null,null,null,null,7,7,null,null,null,null,null,null,"46038-01",20570,"No. 57 Agg, 703.02 Super-Structure",2.7269999999999999,1.35]
[1,1,null,null,null,null,null,null,6,6,null,null,null,null,null,null,"46038-01",20570,"No. 57 Agg, 703.02 Super-Structure",2.6960000000000002,1.65]
[1,1,null,null,null,null,null,null,5,5,null,null,null,null,null,null,"46038-01",20570,"No. 57 Agg, 703.02 Super-Structure",2.6960000000000002,1.84]
[1,{"$error":"#VALUE!"},null,null,null,null,null,null,4,4,null,null,null,null,null,null,"46038-01",20570,"No. 57 Agg, 703.02 Super-Structure",2.7229999999999999,1.34]
[1,1,null,null,null,null,null,null,3,3,null,null,null,null,null,null,"46038-01",20080,"No. 8 Agg, 703.02 Super-Structure",2.7250000000000001,1.51]
[1,1,null,null,null,null,null,null,2,2,null,null,null,null,null,null,"46038-01",20080,"No. 8 Agg, 703.02 Super-Structure",2.7250000000000001,1.53]
[{"$error":"#VALUE!"},{"$error":"#VALUE!"},null,null,null,null,null,null,1,1,null,null,null,null,null,null,"46038-01",20080,"No. 8 Agg, 703.02 Super-Structure",2.72,1.51]
[1,1,null,null,null,null,null,null,3,3,null,null,null,null,null,null,"46050-01",2057,"No. 57 Agg, 703.02 Concrete",2.68,1.52]
[1,1,null,null,null,null,null,null,2,2,null,null,null,null,null,null,"46050-01",2057,"No. 57 Agg, 703.02 Concrete",2.6709999999999998,1.67]
[{"$error":"#VALUE!"},1,null,null,null,null,null,null,1,1,null,null,null,null,null,null,"46050-01",2057,"No. 57 Agg, 703.02 Concrete",2.6819999999999999,1.51]
[1,1,null,null,null,null,null,null,7,7,null,null,null,null,null,null,"46053-01",2057,"No. 57 Agg, 703.02 Concrete",2.66,1.94]
[1,1,null,null,null,null,null,null,6,6,null,null,null,null,null,null,"46053-01",2057,"No. 57 Agg, 703.02 Concrete",2.66,2.04]
[1,{"$error":"#VALUE!"},null,null,null,null,null,null,5,5,null,null,null,null,null,null,"46053-01",2057,"No. 57 Agg, 703.02 Concrete",2.6520000000000001,2.1]
[1,1,null,null,null,null,null,null,4,4,null,null,null,null,null,null,"46053-01",2008,"No. 8 Agg, 703.02 Concrete",2.629,2.56]
[1,1,null,null,null,null,null,null,3,3,null,null,null,null,null,null,"46053-01",2008,"No. 8 Agg, 703.02 Concrete",2.629,2.2999999999999998]
[1,1,null,null,null,null,null,null,2,2,null,null,null,null,null,null,"46053-01",2008,"No. 8 Agg, 703.02 Concrete",2.637,2.4300000000000002]
[{"$error":"#VALUE!"},{"$error":"#VALUE!"},null,null,null,null,null,null,1,1,null,null,null,null,null,null,"46053-01",2008,"No. 8 Agg, 703.02 Concrete",2.6429999999999998,2.4300000000000002]
[1,1,null,null,null,null,null,null,4,4,null,null,null,null,null,null,"47003-01",20570,"No. 57 Agg, 703.02 Super-Structure",2.6549999999999998,1.44]
[1,{"$error":"#VALUE!"},null,null,null,null,null,null,3,3,null,null,null,null,null,null,"47003-01",20570,"No. 57 Agg, 703.02 Super-Structure",2.6680000000000001,1.52]
[1,1,null,null,null,null,null,null,2,2,null,null,null,null,null,null,"47003-01",20081,"No. 8 Agg, 703.02 Concrete Overlay",2.6819999999999999,1.61]
[{"$error":"#VALUE!"},{"$error":"#VALUE!"},null,null,null,null,null,null,1,1,null,null,null,null,null,null,"47003-01",20081,"No. 8 Agg, 703.02 Concrete Overlay",2.629,1.84]
[{"$error":"#VALUE!"},{"$error":"#VALUE!"},null,null,null,null,null,null,1,1,null,null,null,null,null,null,"47003A-01",20570,"No. 57 Agg, 703.02 Super-Structure",2.6859999999999999,1.49]
[1,1,null,null,null,null,null,null,7,7,null,null,null,null,null,null,"47007-01",2057,"No. 57 Agg, 703.02 Concrete",2.343,1.77]
[1,1,null,null,null,null,null,null,6,6,null,null,null,null,null,null,"47007-01",2057,"No. 57 Agg, 703.02 Concrete",2.343,2.14]
[1,1,null,null,null,null,null,null,5,5,null,null,null,null,null,null,"47007-01",2057,"No. 57 Agg, 703.02 Concrete",2.3279999999999998,2.09]
[1,{"$error":"#VALUE!"},null,null,null,null,null,null,4,4,null,null,null,null,null,null,"47007-01",2057,"No. 57 Agg, 703.02 Concrete",2.3279999999999998,2.5099999999999998]
[1,1,null,null,null,null,null,null,3,3,null,null,null,null,null,null,"47007-01",20081,"No. 8 Agg, 703.02 Concrete Overlay",2.4239999999999999,3.33]
[1,1,null,null,null,null,null,null,2,2,null,null,null,null,null,null,"47007-01",20081,"No. 8 Agg, 703.02 Concrete Overlay",2.4239999999999999,4.01]
[{"$error":"#VALUE!"},{"$error":"#VALUE!"},null,null,null,null,null,null,1,1,null,null,null,null,null,null,"47007-01",20081,"No. 8 Agg, 703.02 Concrete Overlay",2.4510000000000001,2.4700000000000002]
[1,1,null,null,null,null,null,null,4,4,null,null,null,null,null,null,"47008-01",2057,"No. 57 Agg, 703.02 Concrete",2.6629999999999998,1.58]
[1,1,null,null,null,null,null,null,3,3,null,null,null,null,null,null,"47008-01",2057,"No. 57 Agg, 703.02 Concrete",2.6629999999999998,1.74]
[1,{"$error":"#VALUE!"},null,null,null,null,null,null,2,2,null,null,null,null,null,null,"47008-01",2057,"No. 57 Agg, 703.02 Concrete",null,1.68]
[{"$error":"#VALUE!"},{"$error":"#VALUE!"},null,null,null,null,null,null,1,1,null,null,null,null,null,null,"47008-01",2008,"No. 8 Agg, 703.02 Concrete",null,2.31]
[1,1,null,null,null,null,null,null,2,2,null,null,null,null,null,null,"47009-01",2057,"No. 57 Agg, 703.02 Concrete",2.6829999999999998,1.47]
[{"$error":"#VALUE!"},1,null,null,null,null,null,null,1,1,null,null,null,null,null,null,"47009-01",2057,"No. 57 Agg, 703.02 Concrete",2.6869999999999998,1.55]
[1,{"$error":"#VALUE!"},null,null,null,null,null,null,2,2,null,null,null,null,null,null,"47010-01",2057,"No. 57 Agg, 703.02 Concrete",2.6829999999999998,1.27]
[{"$error":"#VALUE!"},{"$error":"#VALUE!"},null,null,null,null,null,null,1,1,null,null,null,null,null,null,"47010-01",2008,"No. 8 Agg, 703.02 Concrete",2.665,1.66]
[1,1,null,null,null,null,null,null,2,2,null,null,null,null,null,null,"47011-01",2057,"No. 57 Agg, 703.02 Concrete",2.657,1.8]
[{"$error":"#VALUE!"},1,null,null,null,null,null,null,1,1,null,null,null,null,null,null,"47011-01",2057,"No. 57 Agg, 703.02 Concrete",2.653,1.86]
[1,1,null,null,null,null,null,null,4,4,null,null,null,null,null,null,"47019-01",20570,"No. 57 Agg, 703.02 Super-Structure",2.637,1.66]
[1,{"$error":"#VALUE!"},null,null,null,null,null,null,3,3,null,null,null,null,null,null,"47019-01",20570,"No. 57 Agg, 703.02 Super-Structure",2.6280000000000001,1.64]
[1,1,null,null,null,null,null,null,2,2,null,null,null,null,null,null,"47019-01",20081,"No. 8 Agg, 703.02 Concrete Overlay",2.6179999999999999,1.94]
[{"$error":"#VALUE!"},1,null,null,null,null,null,null,1,1,null,null,null,null,null,null,"47019-01",20081,"No. 8 Agg, 703.02 Concrete Overlay",2.6360000000000001,1.75]
[{"$error":"#VALUE!"},{"$error":"#VALUE!"},null,null,null,null,null,null,1,1,null,null,null,null,null,null,"47019A-01",20081,"No. 8 Agg, 703.02 Concrete Overlay",2.6389999999999998,1.6]
[1,1,null,null,null,null,null,null,6,6,null,null,null,null,null,null,"47021-01",20570,"No. 57 Agg, 703.02 Super-Structure",2.5950000000000002,2.27]
[1,1,null,null,null,null,null,null,5,5,null,null,null,null,null,null,"47021-01",20570,"No. 57 Agg, 703.02 Super-Structure",2.5950000000000002,2.27]
[1,1,null,null,null,null,null,null,4,4,null,null,null,null,null,null,"47021-01",20570,"No. 57 Agg, 703.02 Super-Structure",2.6,2.2400000000000002]
[1,{"$error":"#VALUE!"},null,null,null,null,null,null,3,3,null,null,null,null,null,null,"47021-01",20570,"No. 57 Agg, 703.02 Super-Structure",2.6070000000000002,2.06]
[1,1,null,null,null,null,null,null,2,2,null,null,null,null,null,null,"47021-01",20081,"No. 8 Agg, 703.02 Concrete Overlay",2.633,2.39]
[{"$error":"#VALUE!"},{"$error":"#VALUE!"},null,null,null,null,null,null,1,1,null,null,null,null,null,null,"47021-01",20081,"No. 8 Agg, 703.02 Concrete Overlay",2.6230000000000002,2.16]
[1,1,null,null,null,null,null,null,2,2,null,null,null,null,null,null,"47024-01",2057,"No. 57 Agg, 703.02 Concrete",2.6469999999999998,1.46]
[{"$error":"#VALUE!"},1,null,null,null,null,null,null,1,1,null,null,null,null,null,null,"47024-01",2057,"No. 57 Agg, 703.02 Concrete",2.66,1.49]
[1,1,null,null,null,null,null,null,6,6,null,null,null,null,null,null,"47025-01",2057,"No. 57 Agg, 703.02 Concrete",2.6339999999999999,1.92]
[1,1,null,null,null,null,null,null,5,5,null,null,null,null,null,null,"47025-01",2057,"No. 57 Agg, 703.02 Concrete",2.6459999999999999,1.88]
[1,{"$error":"#VALUE!"},null,null,null,null,null,null,4,4,null,null,null,null,null,null,"47025-01",2057,"No. 57 Agg, 703.02 Concrete",null,1.78]
[1,1,null,null,null,null,null,null,3,3,null,null,null,null,null,null,"47025-01",2008,"No. 8 Agg, 703.02 Concrete",2.6480000000000001,1.9]
[1,1,null,null,null,null,null,null,2,2,null,null,null,null,null,null,"47025-01",2008,"No. 8 Agg, 703.02 Concrete",2.64,2.0699999999999998]
[{"$error":"#VALUE!"},{"$error":"#VALUE!"},null,null,null,null,null,null,1,1,null,null,null,null,null,null,"47025-01",2008,"No. 8 Agg, 703.02 Concrete",null,1.94]
[1,1,null,null,null,null,null,null,4,4,null,null,null,null,null,null,"47026-01",2057,"No. 57 Agg, 703.02 Concrete",2.6659999999999999,1.66]
[1,{"$error":"#VALUE!"},null,null,null,null,null,null,3,3,null,null,null,null,null,null,"47026-01",2057,"No. 57 Agg, 703.02 Concrete",2.6760000000000002,1.45]
[1,1,null,null,null,null,null,null,2,2,null,null,null,null,null,null,"47026-01",2008,"No. 8 Agg, 703.02 Concrete",2.665,1.69]
[{"$error":"#VALUE!"},{"$error":"#VALUE!"},null,null,null,null,null,null,1,1,null,null,null,null,null,null,"47026-01",2008,"No. 8 Agg, 703.02 Concrete",2.6619999999999999,1.72]
[{"$f":"(FIND(Q451,Q452,1))","v":1},{"$f":"(FIND(R451,R452,1))","v":1},null,null,null,null,null,null,{"$f":"MATCH(Q451,Q451:Q1140,1)","v":6},{"$f":"COUNTIF(Q451:Q1140,Q451)","v":6},null,null,null,null,null,null,"47029-01",2057,"No. 57 Agg, 703.02 Concrete",2.6579999999999999,1.54]
[1,1,null,null,null,null,null,null,5,5,null,null,null,null,null,null,"47029-01",20570,"No. 57 Agg, 703.02 Super-Structure",2.645,1.53]
[1,{"$error":"#VALUE!"},null,null,null,null,null,null,4,4,null,null,null,null,null,null,"47029-01",20570,"No. 57 Agg, 703.02 Super-Structure",2.6579999999999999,1.55]
[1,1,null,null,null,null,null,null,3,3,null,null,null,null,null,null,"47029-01",2008,"No. 8 Agg, 703.02 Concrete",2.645,1.98]
[1,1,null,null,null,null,null,null,2,2,null,null,null,null,null,null,"47029-01",20080,"No. 8 Agg, 703.02 Super-Structure",2.6360000000000001,1.72]
[{"$error":"#VALUE!"},{"$error":"#VALUE!"},null,null,null,null,null,null,1,1,null,null,null,null,null,null,"47029-01",20080,"No. 8 Agg, 703.02 Super-Structure",2.645,1.7]
[1,1,null,null,null,null,null,null,6,6,null,null,null,null,null,null,"47030-01",2057,"No. 57 Agg, 703.02 Concrete",2.6760000000000002,1.4]
[1,1,null,null,null,null,null,null,5,5,null,null,null,null,null,null,"47030-01",2057,"No. 57 Agg, 703.02 Concrete",2.673,1.4]
[1,{"$error":"#VALUE!"},null,null,null,null,null,null,4,4,null,null,null,null,null,null,"47030-01",2057,"No. 57 Agg, 703.02 Concrete",2.6720000000000002,1.47]
[1,1,null,null,null,null,null,null,3,3,null,null,null,null,null,null,"47030-01",2008,"No. 8 Agg, 703.02 Concrete",2.6680000000000001,1.59]
[1,1,null,null,null,null,null,null,2,2,null,null,null,null,null,null,"47030-01",2008,"No. 8 Agg, 703.02 Concrete",2.661,1.68]
[{"$error":"#VALUE!"},{"$error":"#VALUE!"},null,null,null,null,null,null,1,1,null,null,null,null,null,null,"47030-01",2008,"No. 8 Agg, 703.02 Concrete",2.6739999999999999,1.49]
[1,1,null,null,null,null,null,null,6,6,null,null,null,null,null,null,"47033-01",20570,"No. 57 Agg, 703.02 Super-Structure",null,1.64]
[1,1,null,null,null,null,null,null,5,5,null,null,null,null,null,null,"47033-01",20570,"No. 57 Agg, 703.02 Super-Structure",2.6749999999999998,1.38]
[1,{"$error":"#VALUE!"},null,null,null,null,null,null,4,4,null,null,null,null,null,null,"47033-01",20570,"No. 57 Agg, 703.02 Super-Structure",2.669,1.49]
[1,1,null,null,null,null,null,null,3,3,null,null,null,null,null,null,"47033-01",20080,"No. 8 Agg, 703.02 Super-Structure",2.6509999999999998,1.65]
[1,1,null,null,null,null,null,null,2,2,null,null,null,null,null,null,"47033-01",20080,"No. 8 Agg, 703.02 Super-Structure",2.6539999999999999,1.67]
[{"$error":"#VALUE!"},{"$error":"#VALUE!"},null,null,null,null,null,null,1,1,null,null,null,null,null,null,"47033-01",20080,"No. 8 Agg, 703.02 Super-Structure",null,1.64]
[1,1,null,null,null,null,null,null,3,3,null,null,null,null,null,null,"47034-01",2057,"No. 57 Agg, 703.02 Concrete",2.6739999999999999,1.27]
[1,1,null,null,null,null,null,null,2,2,null,null,null,null,null,null,"47034-01",2057,"No. 57 Agg, 703.02 Concrete",2.6669999999999998,1.6]
[{"$error":"#VALUE!"},1,null,null,null,null,null,null,1,1,null,null,null,null,null,null,"47034-01",2057,"No. 57 Agg, 703.02 Concrete",2.6509999999999998,1.88]
[1,1,null,null,null,null,null,null,4,4,null,null,null,null,null,null,"47037-01",20570,"No. 57 Agg, 703.02 Super-Structure",2.61,1.88]
[1,{"$error":"#VALUE!"},null,null,null,null,null,null,3,3,null,null,null,null,null,null,"47037-01",20570,"No. 57 Agg, 703.02 Super-Structure",2.6120000000000001,1.83]
[1,{"$error":"#VALUE!"},null,null,null,null,null,null,2,2,null,null,null,null,null,null,"47037-01",20081,"No. 8 Agg, 703.02 Concrete Overlay",2.637,1.97]
[{"$error":"#VALUE!"},{"$error":"#VALUE!"},null,null,null,null,null,null,1,1,null,null,null,null,null,null,"47037-01",20080,"No. 8 Agg, 703.02 Super-Structure",2.649,1.98]
[1,1,null,null,null,null,null,null,6,6,null,null,null,null,null,null,"47044-01",20570,"No. 57 Agg, 703.02 Super-Structure",2.66,1.31]
[1,1,null,null,null,null,null,null,5,5,null,null,null,null,null,null,"47044-01",20570,"No. 57 Agg, 703.02 Super-Structure",2.66,1.1299999999999999]
[1,1,null,null,null,null,null,null,4,4,null,null,null,null,null,null,"47044-01",20570,"No. 57 Agg, 703.02 Super-Structure",2.6739999999999999,1.29]
[1,{"$error":"#VALUE!"},null,null,null,null,null,null,3,3,null,null,null,null,null,null,"47044-01",20570,"No. 57 Agg, 703.02 Super-Structure",2.68,1.21]
[1,1,null,null,null,null,null,null,2,2,null,null,null,null,null,null,"47044-01",2008,"No. 8 Agg, 703.02 Concrete",2.6659999999999999,1.44]
[{"$error":"#VALUE!"},1,null,null,null,null,null,null,1,1,null,null,null,null,null,null,"47044-01",2008,"No. 8 Agg, 703.02 Concrete",2.657,1.52]
[1,1,null,null,null,null,null,null,3,3,null,null,null,null,null,null,"47045A-01",2008,"No. 8 Agg, 703.02 Concrete",2.621,1.7]
[1,1,null,null,null,null,null,null,2,2,null,null,null,null,null,null,"47045A-01",2008,"No. 8 Agg, 703.02 Concrete",2.6539999999999999,1.29]
[{"$error":"#VALUE!"},{"$error":"#VALUE!"},null,null,null,null,null,null,1,1,null,null,null,null,null,null,"47045A-01",2008,"No. 8 Agg, 703.02 Concrete",2.629,1.68]
[1,1,null,null,null,null,null,null,6,6,null,null,null,null,null,null,"47047-01",2057,"No. 57 Agg, 703.02 Concrete",2.7080000000000002,1.19]
[1,1,null,null,null,null,null,null,5,5,null,null,null,null,null,null,"47047-01",20570,"No. 57 Agg, 703.02 Super-Structure",2.7290000000000001,1.1499999999999999]
[1,{"$error":"#VALUE!"},null,null,null,null,null,null,4,4,null,null,null,null,null,null,"47047-01",20570,"No. 57 Agg, 703.02 Super-Structure",2.7240000000000002,1.1599999999999999]
[1,1,null,null,null,null,null,null,3,3,null,null,null,null,null,null,"47047-01",2008,"No. 8 Agg, 703.02 Concrete",2.7389999999999999,0.95]
[1,1,null,null,null,null,null,null,2,2,null,null,null,null,null,null,"47047-01",20080,"No. 8 Agg, 703.02 Super-Structure",2.7250000000000001,1.17]
[{"$error":"#VALUE!"},{"$error":"#VALUE!"},null,null,null,null,null,null,1,1,null,null,null,null,null,null,"47047-01",20080,"No. 8 Agg, 703.02 Super-Structure",2.7120000000000002,1.48]
[1,1,null,null,null,null,null,null,6,6,null,null,null,null,null,null,"47049-01",20570,"No. 57 Agg, 703.02 Super-Structure",2.63,1.71]
[1,1,null,null,null,null,null,null,5,5,null,null,null,null,null,null,"47049-01",20570,"No. 57 Agg, 703.02 Super-Structure",2.6549999999999998,1.51]
[1,{"$error":"#VALUE!"},null,null,null,null,null,null,4,4,null,null,null,null,null,null,"47049-01",20570,"No. 57 Agg, 703.02 Super-Structure",2.6429999999999998,1.57]
[1,1,null,null,null,null,null,null,3,3,null,null,null,null,null,null,"47049-01",20080,"No. 8 Agg, 703.02 Super-Structure",2.637,1.81]
[1,1,null,null,null,null,null,null,2,2,null,null,null,null,null,null,"47049-01",20080,"No. 8 Agg, 703.02 Super-Structure",2.63,1.79]
[{"$error":"#VALUE!"},{"$error":"#VALUE!"},null,null,null,null,null,null,1,1,null,null,null,null,null,null,"47049-01",20080,"No. 8 Agg, 703.02 Super-Structure",2.6160000000000001,1.96]
[1,1,null,null,null,null,null,null,5,5,null,null,null,null,null,null,"47050-01","02057M","No. 57 Agg, 703.02 Concrete, Mod Grading",2.677,1.38]
[1,{"$error":"#VALUE!"},null,null,null,null,null,null,4,4,null,null,null,null,null,null,"47050-01","02057M","No. 57 Agg, 703.02 Concrete, Mod Grading",2.677,1.37]
[1,1,null,null,null,null,null,null,3,3,null,null,null,null,null,null,"47050-01","02008M0","No. 8 Agg, 703.02 Super-Structure, Mod Grading",2.677,1.44]
[1,1,null,null,null,null,null,null,2,2,null,null,null,null,null,null,"47050-01","02008M0","No. 8 Agg, 703.02 Super-Structure, Mod Grading",2.6779999999999999,1.5]
[{"$error":"#VALUE!"},{"$error":"#VALUE!"},null,null,null,null,null,null,1,1,null,null,null,null,null,null,"47050-01","02008M0","No. 8 Agg, 703.02 Super-Structure, Mod Grading",2.6739999999999999,1.5]
[1,1,null,null,null,null,null,null,5,5,null,null,null,null,null,null,"47069-01",20570,"No. 57 Agg, 703.02 Super-Structure",2.677,0.66]
[1,{"$error":"#VALUE!"},null,null,null,null,null,null,4,4,null,null,null,null,null,null,"47069-01",20570,"No. 57 Agg, 703.02 Super-Structure",2.6240000000000001,1.37]
[1,1,null,null,null,null,null,null,3,3,null,null,null,null,null,null,"47069-01",20081,"No. 8 Agg, 703.02 Concrete Overlay",2.6320000000000001,1.56]
[1,1,null,null,null,null,null,null,2,2,null,null,null,null,null,null,"47069-01",20081,"No. 8 Agg, 703.02 Concrete Overlay",2.6230000000000002,1.85]
[{"$error":"#VALUE!"},{"$error":"#VALUE!"},null,null,null,null,null,null,1,1,null,null,null,null,null,null,"47069-01",20081,"No. 8 Agg, 703.02 Concrete Overlay",null,1.34]
[1,1,null,null,null,null,null,null,2,2,null,null,null,null,null,null,"47071-01",2057,"No. 57 Agg, 703.02 Concrete",2.657,1.26]
[{"$error":"#VALUE!"},1,null,null,null,null,null,null,1,1,null,null,null,null,null,null,"47071-01",2057,"No. 57 Agg, 703.02 Concrete",2.6560000000000001,1.1100000000000001]
[1,1,null,null,null,null,null,null,4,4,null,null,null,null,null,null,"47072-01",2057,"No. 57 Agg, 703.02 Concrete",2.6139999999999999,1.8]
[1,{"$error":"#VALUE!"},null,null,null,null,null,null,3,3,null,null,null,null,null,null,"47072-01",2057,"No. 57 Agg, 703.02 Concrete",null,1.75]
[1,1,null,null,null,null,null,null,2,2,null,null,null,null,null,null,"47072-01",2008,"No. 8 Agg, 703.02 Concrete",null,1.91]
[{"$error":"#VALUE!"},{"$error":"#VALUE!"},null,null,null,null,null,null,1,1,null,null,null,null,null,null,"47072-01",2008,"No. 8 Agg, 703.02 Concrete",2.5990000000000002,2.0299999999999998]
[1,1,null,null,null,null,null,null,2,2,null,null,null,null,null,null,"47076-01",2057,"No. 57 Agg, 703.02 Concrete",2.653,2.2200000000000002]
[{"$error":"#VALUE!"},1,null,null,null,null,null,null,1,1,null,null,null,null,null,null,"47076-01",2057,"No. 57 Agg, 703.02 Concrete",2.653,2.19]
[{"$f":"(FIND(Q515,Q516,1))","v":{"$error":"#VALUE!"}},{"$f":"(FIND(R515,R516,1))","v":1},null,null,null,null,null,null,{"$f":"MATCH(Q515,Q515:Q1204,1)","v":1},{"$f":"COUNTIF(Q515:Q1204,Q515)","v":1},null,null,null,null,null,null,"47077-01",2057,"No. 57 Agg, 703.02 Concrete",null,1.33]
[1,1,null,null,null,null,null,null,6,6,null,null,null,null,null,null,"47079-01",20570,"No. 57 Agg, 703.02 Super-Structure",2.6429999999999998,1.67]
[1,1,null,null,null,null,null,null,5,5,null,null,null,null,null,null,"47079-01",20570,"No. 57 Agg, 703.02 Super-Structure",2.6480000000000001,1.74]
[1,{"$error":"#VALUE!"},null,null,null,null,null,null,4,4,null,null,null,null,null,null,"47079-01",20570,"No. 57 Agg, 703.02 Super-Structure",2.6320000000000001,1.72]
[1,1,null,null,null,null,null,null,3,3,null,null,null,null,null,null,"47079-01",2008,"No. 8 Agg, 703.02 Concrete",2.6190000000000002,2.0099999999999998]
[1,1,null,null,null,null,null,null,2,2,null,null,null,null,null,null,"47079-01",2008,"No. 8 Agg, 703.02 Concrete",2.625,2.02]
[{"$error":"#VALUE!"},{"$error":"#VALUE!"},null,null,null,null,null,null,1,1,null,null,null,null,null,null,"47079-01",2008,"No. 8 Agg, 703.02 Concrete",2.6259999999999999,1.81]
[1,1,null,null,null,null,null,null,5,5,null,null,null,null,null,null,"47082-01",20570,"No. 57 Agg, 703.02 Super-Structure",2.649,1.8]
[1,1,null,null,null,null,null,null,4,4,null,null,null,null,null,null,"47082-01",20570,"No. 57 Agg, 703.02 Super-Structure",2.6789999999999998,1.41]
[1,{"$error":"#VALUE!"},null,null,null,null,null,null,3,3,null,null,null,null,null,null,"47082-01",20570,"No. 57 Agg, 703.02 Super-Structure",2.6589999999999998,1.59]
[1,1,null,null,null,null,null,null,2,2,null,null,null,null,null,null,"47082-01",20081,"No. 8 Agg, 703.02 Concrete Overlay",2.6589999999999998,1.81]
[{"$error":"#VALUE!"},{"$error":"#VALUE!"},null,null,null,null,null,null,1,1,null,null,null,null,null,null,"47082-01",20081,"No. 8 Agg, 703.02 Concrete Overlay",2.6379999999999999,1.88]
[1,1,null,null,null,null,null,null,4,4,null,null,null,null,null,null,"47083-01",20570,"No. 57 Agg, 703.02 Super-Structure",null,0.64]
[1,{"$error":"#VALUE!"},null,null,null,null,null,null,3,3,null,null,null,null,null,null,"47083-01",20570,"No. 57 Agg, 703.02 Super-Structure",2.694,0.88]
[1,1,null,null,null,null,null,null,2,2,null,null,null,null,null,null,"47083-01",2008,"No. 8 Agg, 703.02 Concrete",2.681,0.87]
[{"$error":"#VALUE!"},{"$error":"#VALUE!"},null,null,null,null,null,null,1,1,null,null,null,null,null,null,"47083-01",2008,"No. 8 Agg, 703.02 Concrete",null,0.78]
[1,1,null,null,null,null,null,null,4,4,null,null,null,null,null,null,"47084-01",2057,"No. 57 Agg, 703.02 Concrete",2.6619999999999999,1.73]
[1,{"$error":"#VALUE!"},null,null,null,null,null,null,3,3,null,null,null,null,null,null,"47084-01",20570,"No. 57 Agg, 703.02 Super-Structure",2.6709999999999998,1.47]
[1,1,null,null,null,null,null,null,2,2,null,null,null,null,null,null,"47084-01",2008,"No. 8 Agg, 703.02 Concrete",2.665,1.75]
[{"$error":"#VALUE!"},{"$error":"#VALUE!"},null,null,null,null,null,null,1,1,null,null,null,null,null,null,"47084-01",20081,"No. 8 Agg, 703.02 Concrete Overlay",2.6619999999999999,1.75]
[1,1,null,null,null,null,null,null,6,6,null,null,null,null,null,null,"47087-01",20570,"No. 57 Agg, 703.02 Super-Structure",2.645,1.67]
[1,1,null,null,null,null,null,null,5,5,null,null,null,null,null,null,"47087-01",20570,"No. 57 Agg, 703.02 Super-Structure",2.6459999999999999,1.73]
[1,{"$error":"#VALUE!"},null,null,null,null,null,null,4,4,null,null,null,null,null,null,"47087-01",20570,"No. 57 Agg, 703.02 Super-Structure",2.63,1.52]
[1,1,null,null,null,null,null,null,3,3,null,null,null,null,null,null,"47087-01",20080,"No. 8 Agg, 703.02 Super-Structure",2.6349999999999998,1.73]
[1,1,null,null,null,null,null,null,2,2,null,null,null,null,null,null,"47087-01",20080,"No. 8 Agg, 703.02 Super-Structure",2.6280000000000001,1.94]
[{"$error":"#VALUE!"},{"$error":"#VALUE!"},null,null,null,null,null,null,1,1,null,null,null,null,null,null,"47087-01",20080,"No. 8 Agg, 703.02 Super-Structure",2.6320000000000001,1.83]
[1,1,null,null,null,null,null,null,4,4,null,null,null,null,null,null,"47088-01",2057,"No. 57 Agg, 703.02 Concrete",2.641,1.5]
[1,{"$error":"#VALUE!"},null,null,null,null,null,null,3,3,null,null,null,null,null,null,"47088-01",2057,"No. 57 Agg, 703.02 Concrete",null,1.43]
[1,1,null,null,null,null,null,null,2,2,null,null,null,null,null,null,"47088-01",2008,"No. 8 Agg, 703.02 Concrete",null,1.74]
[{"$error":"#VALUE!"},{"$error":"#VALUE!"},null,null,null,null,null,null,1,1,null,null,null,null,null,null,"47088-01",2008,"No. 8 Agg, 703.02 Concrete",2.621,1.95]
[1,1,null,null,null,null,null,null,7,7,null,null,null,null,null,null,"47091-01",20570,"No. 57 Agg, 703.02 Super-Structure",2.6960000000000002,0.56999999999999995]
[1,1,null,null,null,null,null,null,6,6,null,null,null,null,null,null,"47091-01",20570,"No. 57 Agg, 703.02 Super-Structure",2.6960000000000002,0.49]
[1,{"$error":"#VALUE!"},null,null,null,null,null,null,5,5,null,null,null,null,null,null,"47091-01",20570,"No. 57 Agg, 703.02 Super-Structure",2.6909999999999998,0.64]
[1,1,null,null,null,null,null,null,4,4,null,null,null,null,null,null,"47091-01",20080,"No. 8 Agg, 703.02 Super-Structure",2.68,0.8]
[1,1,null,null,null,null,null,null,3,3,null,null,null,null,null,null,"47091-01",20080,"No. 8 Agg, 703.02 Super-Structure",2.6840000000000002,0.74]
[1,1,null,null,null,null,null,null,2,2,null,null,null,null,null,null,"47091-01",20080,"No. 8 Agg, 703.02 Super-Structure",2.69,0.7]
[{"$error":"#VALUE!"},{"$error":"#VALUE!"},null,null,null,null,null,null,1,1,null,null,null,null,null,null,"47091-01",20080,"No. 8 Agg, 703.02 Super-Structure",2.6880000000000002,0.69]
[1,1,null,null,null,null,null,null,5,5,null,null,null,null,null,null,"47092-01","02057M0","No. 57 Agg, 703.02 Super-Structure, Mod Grading",2.6549999999999998,1.81]
[1,1,null,null,null,null,null,null,4,4,null,null,null,null,null,null,"47092-01","02057M0","No. 57 Agg, 703.02 Super-Structure, Mod Grading",2.66,1.75]
[1,{"$error":"#VALUE!"},null,null,null,null,null,null,3,3,null,null,null,null,null,null,"47092-01","02057M0","No. 57 Agg, 703.02 Super-Structure, Mod Grading",2.6509999999999998,1.83]
[1,1,null,null,null,null,null,null,2,2,null,null,null,null,null,null,"47092-01","02008M0","No. 8 Agg, 703.02 Super-Structure, Mod Grading",2.6360000000000001,2.1800000000000002]
[{"$error":"#VALUE!"},{"$error":"#VALUE!"},null,null,null,null,null,null,1,1,null,null,null,null,null,null,"47092-01","02008M0","No. 8 Agg, 703.02 Super-Structure, Mod Grading",2.6549999999999998,2.0099999999999998]
[{"$error":"#VALUE!"},1,null,null,null,null,null,null,1,1,null,null,null,null,null,null,"47097-01",2057,"No. 57 Agg, 703.02 Concrete",2.6920000000000002,0.64]
[1,1,null,null,null,null,null,null,3,3,null,null,null,null,null,null,"48011-01",2057,"No. 57 Agg, 703.02 Concrete",2.5819999999999999,2.46]
[1,1,null,null,null,null,null,null,2,2,null,null,null,null,null,null,"48011-01",2057,"No. 57 Agg, 703.02 Concrete",2.5939999999999999,2.27]
[{"$error":"#VALUE!"},1,null,null,null,null,null,null,1,1,null,null,null,null,null,null,"48011-01",2057,"No. 57 Agg, 703.02 Concrete",2.589,2.59]
[1,1,null,null,null,null,null,null,6,6,null,null,null,null,null,null,"48018-01",20570,"No. 57 Agg, 703.02 Super-Structure",2.6890000000000001,1.4]
[1,1,null,null,null,null,null,null,5,5,null,null,null,null,null,null,"48018-01",20570,"No. 57 Agg, 703.02 Super-Structure",2.681,1.64]
[1,{"$error":"#VALUE!"},null,null,null,null,null,null,4,4,null,null,null,null,null,null,"48018-01",20570,"No. 57 Agg, 703.02 Super-Structure",2.7050000000000001,1.48]
[1,1,null,null,null,null,null,null,3,3,null,null,null,null,null,null,"48018-01",20081,"No. 8 Agg, 703.02 Concrete Overlay",2.7,1.74]
[1,1,null,null,null,null,null,null,2,2,null,null,null,null,null,null,"48018-01",20081,"No. 8 Agg, 703.02 Concrete Overlay",2.6859999999999999,1.89]
[{"$error":"#VALUE!"},{"$error":"#VALUE!"},null,null,null,null,null,null,1,1,null,null,null,null,null,null,"48018-01",20081,"No. 8 Agg, 703.02 Concrete Overlay",2.6869999999999998,1.79]
[1,1,null,null,null,null,null,null,4,4,null,null,null,null,null,null,"48020-01",20570,"No. 57 Agg, 703.02 Super-Structure",2.661,1.81]
[1,{"$error":"#VALUE!"},null,null,null,null,null,null,3,3,null,null,null,null,null,null,"48020-01",20570,"No. 57 Agg, 703.02 Super-Structure",2.6480000000000001,1.78]
[1,1,null,null,null,null,null,null,2,2,null,null,null,null,null,null,"48020-01",20081,"No. 8 Agg, 703.02 Concrete Overlay",2.665,1.97]
[{"$error":"#VALUE!"},1,null,null,null,null,null,null,1,1,null,null,null,null,null,null,"48020-01",20081,"No. 8 Agg, 703.02 Concrete Overlay",2.6680000000000001,2.0499999999999998]
[1,1,null,null,null,null,null,null,3,3,null,null,null,null,null,null,"48028-01",20081,"No. 8 Agg, 703.02 Concrete Overlay",null,1.1499999999999999]
[1,1,null,null,null,null,null,null,2,2,null,null,null,null,null,null,"48028-01",20081,"No. 8 Agg, 703.02 Concrete Overlay",null,1.18]
[{"$error":"#VALUE!"},{"$error":"#VALUE!"},null,null,null,null,null,null,1,1,null,null,null,null,null,null,"48028-01",20081,"No. 8 Agg, 703.02 Concrete Overlay",null,1.1399999999999999]
[1,1,null,null,null,null,null,null,4,4,null,null,null,null,null,null,"48033-01",20570,"No. 57 Agg, 703.02 Super-Structure",2.698,0.56000000000000005]
[1,{"$error":"#VALUE!"},null,null,null,null,null,null,3,3,null,null,null,null,null,null,"48033-01",20570,"No. 57 Agg, 703.02 Super-Structure",2.702,0.61]
[1,1,null,null,null,null,null,null,2,2,null,null,null,null,null,null,"48033-01",20081,"No. 8 Agg, 703.02 Concrete Overlay",2.6989999999999998,0.74]
[{"$error":"#VALUE!"},{"$error":"#VALUE!"},null,null,null,null,null,null,1,1,null,null,null,null,null,null,"48033-01",20081,"No. 8 Agg, 703.02 Concrete Overlay",2.6989999999999998,0.74]
[1,{"$error":"#VALUE!"},null,null,null,null,null,null,3,3,null,null,null,null,null,null,"48036-01",2057,"No. 57 Agg, 703.02 Concrete",2.629,3.03]
[{"$f":"(FIND(Q579,Q580,1))","v":1},{"$f":"(FIND(R579,R580,1))","v":1},null,null,null,null,null,null,{"$f":"MATCH(Q579,Q579:Q1268,1)","v":2},{"$f":"COUNTIF(Q579:Q1268,Q579)","v":2},null,null,null,null,null,null,"48036-01",2008,"No. 8 Agg, 703.02 Concrete",2.6280000000000001,3.46]
[{"$error":"#VALUE!"},1,null,null,null,null,null,null,1,1,null,null,null,null,null,null,"48036-01",2008,"No. 8 Agg, 703.02 Concrete",2.6480000000000001,3.29]
[1,1,null,null,null,null,null,null,3,3,null,null,null,null,null,null,"48039-01",2008,"No. 8 Agg, 703.02 Concrete",2.6320000000000001,2.21]
[1,1,null,null,null,null,null,null,2,2,null,null,null,null,null,null,"48039-01",20080,"No. 8 Agg, 703.02 Super-Structure",2.6269999999999998,2.37]
[{"$error":"#VALUE!"},{"$error":"#VALUE!"},null,null,null,null,null,null,1,1,null,null,null,null,null,null,"48039-01",20080,"No. 8 Agg, 703.02 Super-Structure",2.609,2.56]
[1,1,null,null,null,null,null,null,4,4,null,null,null,null,null,null,"48051-01","02057M","No. 57 Agg, 703.02 Concrete, Mod Grading",2.67,0.98]
[1,{"$error":"#VALUE!"},null,null,null,null,null,null,3,3,null,null,null,null,null,null,"48051-01","02057M","No. 57 Agg, 703.02 Concrete, Mod Grading",2.68,0.74]
[1,1,null,null,null,null,null,null,2,2,null,null,null,null,null,null,"48051-01","02008M","No. 8 Agg, 703.02 Concrete, Mod Grading",2.6720000000000002,1.06]
[{"$error":"#VALUE!"},{"$error":"#VALUE!"},null,null,null,null,null,null,1,1,null,null,null,null,null,null,"48051-01","02008M","No. 8 Agg, 703.02 Concrete, Mod Grading",2.67,0.99]
[1,1,null,null,null,null,null,null,3,3,null,null,null,null,null,null,"49012-01",2057,"No. 57 Agg, 703.02 Concrete",2.5550000000000002,1.54]
[1,1,null,null,null,null,null,null,2,2,null,null,null,null,null,null,"49012-01",20570,"No. 57 Agg, 703.02 Super-Structure",2.5419999999999998,1.65]
[{"$error":"#VALUE!"},{"$error":"#VALUE!"},null,null,null,null,null,null,1,1,null,null,null,null,null,null,"49012-01",20570,"No. 57 Agg, 703.02 Super-Structure",2.5379999999999998,1.86]
[1,{"$error":"#VALUE!"},null,null,null,null,null,null,2,2,null,null,null,null,null,null,"49032-01",20081,"No. 8 Agg, 703.02 Concrete Overlay",2.6379999999999999,1.67]
[{"$error":"#VALUE!"},{"$error":"#VALUE!"},null,null,null,null,null,null,1,1,null,null,null,null,null,null,"49032-01",20080,"No. 8 Agg, 703.02 Super-Structure",null,0.93]
[{"$error":"#VALUE!"},{"$error":"#VALUE!"},null,null,null,null,null,null,1,1,null,null,null,null,null,null,"49033-01",20570,"No. 57 Agg, 703.02 Super-Structure",2.629,2.06]
[{"$error":"#VALUE!"},{"$error":"#VALUE!"},null,null,null,null,null,null,1,1,null,null,null,null,null,null,"49037-01",2008,"No. 8 Agg, 703.02 Concrete",null,1.27]
[1,1,null,null,null,null,null,null,4,4,null,null,null,null,null,null,"49045-01",20570,"No. 57 Agg, 703.02 Super-Structure",2.544,1.79]
[1,{"$error":"#VALUE!"},null,null,null,null,null,null,3,3,null,null,null,null,null,null,"49045-01",20570,"No. 57 Agg, 703.02 Super-Structure",2.5499999999999998,1.84]
[1,1,null,null,null,null,null,null,2,2,null,null,null,null,null,null,"49045-01",20081,"No. 8 Agg, 703.02 Concrete Overlay",2.5299999999999998,2.25]
[{"$error":"#VALUE!"},{"$error":"#VALUE!"},null,null,null,null,null,null,1,1,null,null,null,null,null,null,"49045-01",20081,"No. 8 Agg, 703.02 Concrete Overlay",2.5230000000000001,1.86]
[1,1,null,null,null,null,null,null,6,6,null,null,null,null,null,null,"49048-01",20570,"No. 57 Agg, 703.02 Super-Structure",2.4990000000000001,1.96]
[1,1,null,null,null,null,null,null,5,5,null,null,null,null,null,null,"49048-01",20570,"No. 57 Agg, 703.02 Super-Structure",2.4950000000000001,2.0699999999999998]
[1,{"$error":"#VALUE!"},null,null,null,null,null,null,4,4,null,null,null,null,null,null,"49048-01",20570,"No. 57 Agg, 703.02 Super-Structure",2.4990000000000001,2.17]
[1,1,null,null,null,null,null,null,3,3,null,null,null,null,null,null,"49048-01",20081,"No. 8 Agg, 703.02 Concrete Overlay",2.4940000000000002,2.23]
[1,1,null,null,null,null,null,null,2,2,null,null,null,null,null,null,"49048-01",20081,"No. 8 Agg, 703.02 Concrete Overlay",2.5009999999999999,2.17]
[{"$error":"#VALUE!"},{"$error":"#VALUE!"},null,null,null,null,null,null,1,1,null,null,null,null,null,null,"49048-01",20081,"No. 8 Agg, 703.02 Concrete Overlay",2.5059999999999998,2.08]
[1,1,null,null,null,null,null,null,8,8,null,null,null,null,null,null,"49050-01",20570,"No. 57 Agg, 703.02 Super-Structure",2.5270000000000001,2.2599999999999998]
[1,1,null,null,null,null,null,null,7,7,null,null,null,null,null,null,"49050-01",20570,"No. 57 Agg, 703.02 Super-Structure",2.5369999999999999,2.2799999999999998]
[1,1,null,null,null,null,null,null,6,6,null,null,null,null,null,null,"49050-01",20570,"No. 57 Agg, 703.02 Super-Structure",2.5259999999999998,2.13]
[1,{"$error":"#VALUE!"},null,null,null,null,null,null,5,5,null,null,null,null,null,null,"49050-01",20570,"No. 57 Agg, 703.02 Super-Structure",2.5270000000000001,2.17]
[1,1,null,null,null,null,null,null,4,4,null,null,null,null,null,null,"49050-01",2008,"No. 8 Agg, 703.02 Concrete",2.5310000000000001,2.1800000000000002]
[1,1,null,null,null,null,null,null,3,3,null,null,null,null,null,null,"49050-01",2008,"No. 8 Agg, 703.02 Concrete",2.5190000000000001,2.33]
[1,1,null,null,null,null,null,null,2,2,null,null,null,null,null,null,"49050-01",2008,"No. 8 Agg, 703.02 Concrete",2.5419999999999998,2.17]
[{"$error":"#VALUE!"},{"$error":"#VALUE!"},null,null,null,null,null,null,1,1,null,null,null,null,null,null,"49050-01",2008,"No. 8 Agg, 703.02 Concrete",2.5329999999999999,2.2999999999999998]
[1,1,null,null,null,null,null,null,5,5,null,null,null,null,null,null,"49054-01",2057,"No. 57 Agg, 703.02 Concrete",2.661,0.49]
[1,1,null,null,null,null,null,null,4,4,null,null,null,null,null,null,"49054-01",2057,"No. 57 Agg, 703.02 Concrete",2.6709999999999998,0.41]
[1,{"$error":"#VALUE!"},null,null,null,null,null,null,3,3,null,null,null,null,null,null,"49054-01",2057,"No. 57 Agg, 703.02 Concrete",2.6739999999999999,0.38]
[1,1,null,null,null,null,null,null,2,2,null,null,null,null,null,null,"49054-01",2008,"No. 8 Agg, 703.02 Concrete",2.6539999999999999,0.5]
[{"$error":"#VALUE!"},{"$error":"#VALUE!"},null,null,null,null,null,null,1,1,null,null,null,null,null,null,"49054-01",2008,"No. 8 Agg, 703.02 Concrete",2.6509999999999998,0.6]
[1,1,null,null,null,null,null,null,6,6,null,null,null,null,null,null,"49058-01",20570,"No. 57 Agg, 703.02 Super-Structure",2.5550000000000002,1.68]
[1,1,null,null,null,null,null,null,5,5,null,null,null,null,null,null,"49058-01",20570,"No. 57 Agg, 703.02 Super-Structure",2.5449999999999999,1.84]
[1,{"$error":"#VALUE!"},null,null,null,null,null,null,4,4,null,null,null,null,null,null,"49058-01",20570,"No. 57 Agg, 703.02 Super-Structure",null,2]
[1,1,null,null,null,null,null,null,3,3,null,null,null,null,null,null,"49058-01",2008,"No. 8 Agg, 703.02 Concrete",null,1.87]
[1,1,null,null,null,null,null,null,2,2,null,null,null,null,null,null,"49058-01",20080,"No. 8 Agg, 703.02 Super-Structure",2.5489999999999999,1.89]
[{"$error":"#VALUE!"},1,null,null,null,null,null,null,1,1,null,null,null,null,null,null,"49058-01",20080,"No. 8 Agg, 703.02 Super-Structure",2.5670000000000002,1.78]
[1,1,null,null,null,null,null,null,2,2,null,null,null,null,null,null,"50009-01",20080,"No. 8 Agg, 703.02 Super-Structure",2.59,2.76]
[{"$error":"#VALUE!"},{"$error":"#VALUE!"},null,null,null,null,null,null,1,1,null,null,null,null,null,null,"50009-01",20080,"No. 8 Agg, 703.02 Super-Structure",null,2.78]
[1,1,null,null,null,null,null,null,8,8,null,null,null,null,null,null,"50029-01",20570,"No. 57 Agg, 703.02 Super-Structure",2.5819999999999999,1.64]
[1,1,null,null,null,null,null,null,7,7,null,null,null,null,null,null,"50029-01",20570,"No. 57 Agg, 703.02 Super-Structure",2.5369999999999999,2.38]
[1,1,null,null,null,null,null,null,6,6,null,null,null,null,null,null,"50029-01",20570,"No. 57 Agg, 703.02 Super-Structure",2.5430000000000001,2.1800000000000002]
[1,{"$error":"#VALUE!"},null,null,null,null,null,null,5,5,null,null,null,null,null,null,"50029-01",20570,"No. 57 Agg, 703.02 Super-Structure",2.5430000000000001,2.2999999999999998]
[1,1,null,null,null,null,null,null,4,4,null,null,null,null,null,null,"50029-01",2008,"No. 8 Agg, 703.02 Concrete",2.544,2.17]
[1,1,null,null,null,null,null,null,3,3,null,null,null,null,null,null,"50029-01",2008,"No. 8 Agg, 703.02 Concrete",2.544,2.39]
[1,1,null,null,null,null,null,null,2,2,null,null,null,null,null,null,"50029-01",20080,"No. 8 Agg, 703.02 Super-Structure",2.5649999999999999,2.16]
[{"$error":"#VALUE!"},{"$error":"#VALUE!"},null,null,null,null,null,null,1,1,null,null,null,null,null,null,"50029-01",20080,"No. 8 Agg, 703.02 Super-Structure",2.5870000000000002,1.64]
[1,1,null,null,null,null,null,null,8,8,null,null,null,null,null,null,"50038-01",20570,"No. 57 Agg, 703.02 Super-Structure",null,1.87]
[1,1,null,null,null,null,null,null,7,7,null,null,null,null,null,null,"50038-01",20570,"No. 57 Agg, 703.02 Super-Structure",2.56,1.93]
[1,1,null,null,null,null,null,null,6,6,null,null,null,null,null,null,"50038-01",20570,"No. 57 Agg, 703.02 Super-Structure",2.5419999999999998,2.2200000000000002]
[1,{"$error":"#VALUE!"},null,null,null,null,null,null,5,5,null,null,null,null,null,null,"50038-01",20570,"No. 57 Agg, 703.02 Super-Structure",2.5659999999999998,1.83]
[1,1,null,null,null,null,null,null,4,4,null,null,null,null,null,null,"50038-01",20080,"No. 8 Agg, 703.02 Super-Structure",2.5710000000000002,1.97]
[1,1,null,null,null,null,null,null,3,3,null,null,null,null,null,null,"50038-01",20080,"No. 8 Agg, 703.02 Super-Structure",2.5449999999999999,2.4300000000000002]
[1,1,null,null,null,null,null,null,2,2,null,null,null,null,null,null,"50038-01",20080,"No. 8 Agg, 703.02 Super-Structure",2.57,1.97]
[{"$error":"#VALUE!"},{"$error":"#VALUE!"},null,null,null,null,null,null,1,1,null,null,null,null,null,null,"50038-01",20080,"No. 8 Agg, 703.02 Super-Structure",null,2.06]
[1,1,null,null,null,null,null,null,2,2,null,null,null,null,null,null,"50064-01",2008,"No. 8 Agg, 703.02 Concrete",2.444,3.75]
[{"$f":"(FIND(Q643,Q644,1))","v":{"$error":"#VALUE!"}},{"$f":"(FIND(R643,R644,1))","v":{"$error":"#VALUE!"}},null,null,null,null,null,null,{"$f":"MATCH(Q643,Q643:Q1332,1)","v":1},{"$f":"COUNTIF(Q643:Q1332,Q643)","v":1},null,null,null,null,null,null,"50064-01",2008,"No. 8 Agg, 703.02 Concrete",2.4569999999999999,3.37]
[1,1,null,null,null,null,null,null,8,8,null,null,null,null,null,null,"50075-01",2057,"No. 57 Agg, 703.02 Concrete",2.5609999999999999,1.95]
[1,1,null,null,null,null,null,null,7,7,null,null,null,null,null,null,"50075-01",2057,"No. 57 Agg, 703.02 Concrete",2.5819999999999999,2.04]
[1,1,null,null,null,null,null,null,6,6,null,null,null,null,null,null,"50075-01",2057,"No. 57 Agg, 703.02 Concrete",2.5609999999999999,1.83]
[1,{"$error":"#VALUE!"},null,null,null,null,null,null,5,5,null,null,null,null,null,null,"50075-01",2057,"No. 57 Agg, 703.02 Concrete",2.5459999999999998,2]
[1,1,null,null,null,null,null,null,4,4,null,null,null,null,null,null,"50075-01",2008,"No. 8 Agg, 703.02 Concrete",2.5720000000000001,1.86]
[1,1,null,null,null,null,null,null,3,3,null,null,null,null,null,null,"50075-01",2008,"No. 8 Agg, 703.02 Concrete",2.5819999999999999,1.79]
[1,1,null,null,null,null,null,null,2,2,null,null,null,null,null,null,"50075-01",2008,"No. 8 Agg, 703.02 Concrete",2.573,2.21]
[{"$error":"#VALUE!"},{"$error":"#VALUE!"},null,null,null,null,null,null,1,1,null,null,null,null,null,null,"50075-01",2008,"No. 8 Agg, 703.02 Concrete",2.5819999999999999,1.9]
[1,{"$error":"#VALUE!"},null,null,null,null,null,null,3,3,null,null,null,null,null,null,"50076-01",20570,"No. 57 Agg, 703.02 Super-Structure",2.6680000000000001,0.34]
[1,1,null,null,null,null,null,null,2,2,null,null,null,null,null,null,"50076-01",20081,"No. 8 Agg, 703.02 Concrete Overlay",2.6579999999999999,0.41]
[{"$error":"#VALUE!"},{"$error":"#VALUE!"},null,null,null,null,null,null,1,1,null,null,null,null,null,null,"50076-01",20081,"No. 8 Agg, 703.02 Concrete Overlay",2.66,0.47]
[1,1,null,null,null,null,null,null,4,4,null,null,null,null,null,null,"50079-01",2057,"No. 57 Agg, 703.02 Concrete",2.5369999999999999,2.42]
[1,{"$error":"#VALUE!"},null,null,null,null,null,null,3,3,null,null,null,null,null,null,"50079-01",2057,"No. 57 Agg, 703.02 Concrete",2.5369999999999999,2.2200000000000002]
[1,1,null,null,null,null,null,null,2,2,null,null,null,null,null,null,"50079-01",2008,"No. 8 Agg, 703.02 Concrete",2.528,2.4500000000000002]
[{"$error":"#VALUE!"},{"$error":"#VALUE!"},null,null,null,null,null,null,1,1,null,null,null,null,null,null,"50079-01",2008,"No. 8 Agg, 703.02 Concrete",2.528,2.67]
[1,1,null,null,null,null,null,null,9,9,null,null,null,null,null,null,"51006-01",20570,"No. 57 Agg, 703.02 Super-Structure",null,0.52]
[1,1,null,null,null,null,null,null,8,8,null,null,null,null,null,null,"51006-01",20570,"No. 57 Agg, 703.02 Super-Structure",2.8109999999999999,0.35]
[1,1,null,null,null,null,null,null,7,7,null,null,null,null,null,null,"51006-01",20570,"No. 57 Agg, 703.02 Super-Structure",2.8109999999999999,0.23]
[1,{"$error":"#VALUE!"},null,null,null,null,null,null,6,6,null,null,null,null,null,null,"51006-01",20570,"No. 57 Agg, 703.02 Super-Structure",2.669,0.62]
[1,1,null,null,null,null,null,null,5,5,null,null,null,null,null,null,"51006-01",20081,"No. 8 Agg, 703.02 Concrete Overlay",2.6659999999999999,0.77]
[1,1,null,null,null,null,null,null,4,4,null,null,null,null,null,null,"51006-01",20081,"No. 8 Agg, 703.02 Concrete Overlay",2.8149999999999999,0.39]
[1,1,null,null,null,null,null,null,3,3,null,null,null,null,null,null,"51006-01",20081,"No. 8 Agg, 703.02 Concrete Overlay",2.8149999999999999,0.5]
[1,{"$error":"#VALUE!"},null,null,null,null,null,null,2,2,null,null,null,null,null,null,"51006-01",20081,"No. 8 Agg, 703.02 Concrete Overlay",null,0.65]
[{"$error":"#VALUE!"},{"$error":"#VALUE!"},null,null,null,null,null,null,1,1,null,null,null,null,null,null,"51006-01","02008M","No. 8 Agg, 703.02 Concrete, Mod Grading",2.6680000000000001,0.78]
[1,1,null,null,null,null,null,null,2,2,null,null,null,null,null,null,"51009-01",20570,"No. 57 Agg, 703.02 Super-Structure",2.5840000000000001,1.27]
[{"$error":"#VALUE!"},1,null,null,null,null,null,null,1,1,null,null,null,null,null,null,"51009-01",20570,"No. 57 Agg, 703.02 Super-Structure",2.6440000000000001,1.31]
[1,1,null,null,null,null,null,null,5,5,null,null,null,null,null,null,"51011-01",20570,"No. 57 Agg, 703.02 Super-Structure",2.8090000000000002,0.31]
[1,1,null,null,null,null,null,null,4,4,null,null,null,null,null,null,"51011-01",20570,"No. 57 Agg, 703.02 Super-Structure",2.8069999999999999,0.4]
[1,{"$error":"#VALUE!"},null,null,null,null,null,null,3,3,null,null,null,null,null,null,"51011-01",20570,"No. 57 Agg, 703.02 Super-Structure",2.8109999999999999,0.31]
[1,1,null,null,null,null,null,null,2,2,null,null,null,null,null,null,"51011-01",2008,"No. 8 Agg, 703.02 Concrete",2.8109999999999999,0.48]
[{"$error":"#VALUE!"},1,null,null,null,null,null,null,1,1,null,null,null,null,null,null,"51011-01",2008,"No. 8 Agg, 703.02 Concrete",2.8050000000000002,0.45]
[{"$error":"#VALUE!"},{"$error":"#VALUE!"},null,null,null,null,null,null,1,1,null,null,null,null,null,null,"51013-01",20081,"No. 8 Agg, 703.02 Concrete Overlay",2.617,0.31]
[1,1,null,null,null,null,null,null,5,5,null,null,null,null,null,null,"51014-01",20570,"No. 57 Agg, 703.02 Super-Structure",2.8069999999999999,0.34]
[1,1,null,null,null,null,null,null,4,4,null,null,null,null,null,null,"51014-01",20570,"No. 57 Agg, 703.02 Super-Structure",2.8119999999999998,0.31]
[1,{"$error":"#VALUE!"},null,null,null,null,null,null,3,3,null,null,null,null,null,null,"51014-01",20570,"No. 57 Agg, 703.02 Super-Structure",2.8109999999999999,0.32]
[1,1,null,null,null,null,null,null,2,2,null,null,null,null,null,null,"51014-01",20081,"No. 8 Agg, 703.02 Concrete Overlay",2.8069999999999999,0.42]
[{"$error":"#VALUE!"},{"$error":"#VALUE!"},null,null,null,null,null,null,1,1,null,null,null,null,null,null,"51014-01",20081,"No. 8 Agg, 703.02 Concrete Overlay",2.8039999999999998,0.4]
[1,1,null,null,null,null,null,null,4,4,null,null,null,null,null,null,"51015-01",20570,"No. 57 Agg, 703.02 Super-Structure",2.794,0.5]
[1,{"$error":"#VALUE!"},null,null,null,null,null,null,3,3,null,null,null,null,null,null,"51015-01",20570,"No. 57 Agg, 703.02 Super-Structure",null,0.45]
[1,{"$error":"#VALUE!"},null,null,null,null,null,null,2,2,null,null,null,null,null,null,"51015-01","02008M1","No. 8 Agg, 703.02 Concrete Overlay, Mod Grading",null,0.62]
[{"$error":"#VALUE!"},{"$error":"#VALUE!"},null,null,null,null,null,null,1,1,null,null,null,null,null,null,"51015-01","02008M0","No. 8 Agg, 703.02 Super-Structure, Mod Grading",2.7909999999999999,0.52]
[1,1,null,null,null,null,null,null,6,6,null,null,null,null,null,null,"51016-01",20570,"No. 57 Agg, 703.02 Super-Structure",2.5539999999999998,1.64]
[1,1,null,null,null,null,null,null,5,5,null,null,null,null,null,null,"51016-01",20570,"No. 57 Agg, 703.02 Super-Structure",null,1.4]
[1,{"$error":"#VALUE!"},null,null,null,null,null,null,4,4,null,null,null,null,null,null,"51016-01",20570,"No. 57 Agg, 703.02 Super-Structure",2.5640000000000001,1.47]
[1,1,null,null,null,null,null,null,3,3,null,null,null,null,null,null,"51016-01",20081,"No. 8 Agg, 703.02 Concrete Overlay",2.5760000000000001,1.5]
[1,1,null,null,null,null,null,null,2,2,null,null,null,null,null,null,"51016-01",20081,"No. 8 Agg, 703.02 Concrete Overlay",2.573,1.51]
[{"$error":"#VALUE!"},{"$error":"#VALUE!"},null,null,null,null,null,null,1,1,null,null,null,null,null,null,"51016-01",20081,"No. 8 Agg, 703.02 Concrete Overlay",null,1.6]
[{"$error":"#VALUE!"},{"$error":"#VALUE!"},null,null,null,null,null,null,1,1,null,null,null,null,null,null,"51047-01",20570,"No. 57 Agg, 703.02 Super-Structure",2.3929999999999998,1.95]

{"sheet":"AGG MATL CD LIST","index":12,"n_rows":838,"n_cols":2,"rows_kept":838,"cut":false,"hidden":true,"merged":[]}
["No. 8 Agg, 703.02 Concrete Overlay (Limestone)",20081]
["No. 8 Agg, 703.02 Concrete (Limestone)",2008]
["No. 8 Agg, 703.02 Super-Structure (Limestone)",20080]
["No. 57 Agg, 703.02 Concrete (Limestone)",2057]
["No. 57 Agg, 703.02 Super-Structure (Limestone)",20570]
["No. 57 Agg, 703.13 Freeze-Thaw (Limestone)",20572]
["No. 8 Agg, 703.02 Concrete (Limestone)",2008]
["No. 57 Agg, 703.02 Concrete (Limestone)",2057]
["No. 57 Agg, 703.13 Freeze-Thaw (Limestone)",20572]
["Sand, 703.02 Concrete ","02SD2"]
["Sand, 703.02 Concrete, Acid Insoluble ","02SD23"]
["No. 8 Agg, 703.02 Concrete (Gravel)",2008]
["Sand, 703.02 Concrete ","02SD2"]
["Sand, 703.02 Concrete, Acid Insoluble ","02SD23"]
["No. 8 Agg, 703.02 Concrete (Gravel)",2008]
["No. 8 Agg, 703.02 Concrete (Limestone)",2008]
["No. 57 Agg, 703.02 Concrete (Limestone)",2057]
["No. 67 Agg, 703.02 Concrete (Limestone)",2067]
["No. 57 Agg, 703.02 Super-Structure (Limestone)",20570]
["No. 57 Agg, 703.13 Freeze-Thaw (Limestone)",20572]
["No. 8 Agg, 703.02 Concrete (Dolostone)",2008]
["No. 8 Agg, 703.02 Super-Structure (Dolostone)",20080]
["No. 8 Agg, 703.02 Concrete Overlay (Dolostone)",20081]
["No. 57 Agg, 703.02 Super-Structure (Dolostone)",20570]
["No. 57 Agg, 703.02 Concrete (Dolostone)",2057]
["No. 57 Agg, 703.13 Freeze-Thaw (Dolostone)",20572]
["Sand, 703.02 Concrete ","02SD2"]
["Sand, 703.02 Concrete ","02SD2"]
["No. 8 Agg, 703.02 Super-Structure (Gravel)",20080]
["No. 8 Agg, 703.02 Concrete Overlay (Gravel)",20081]
["No. 57 Agg, 703.02 Concrete (Gravel)",2057]
["Sand, 703.02 Concrete ","02SD2"]
["Sand, 703.02 Concrete, Acid Insoluble ","02SD23"]
["No. 8 Agg, 703.02 Concrete (Gravel)",2008]
["No. 57 Agg, 703.02 Super-Structure (Gravel)",20570]
["No. 57 Agg, 703.13 Freeze-Thaw (Gravel)",20572]
["No. 57 Agg, 703.02 Super-Structure (Limestone)",20570]
["No. 8 Agg, 703.02 Super-Structure (Limestone)",20080]
["No. 8 Agg, 703.02 Concrete (Limestone)",2008]
["No. 57 Agg, 703.02 Concrete (Limestone)",2057]
["No. 57 Agg, 703.13 Freeze-Thaw (Limestone)",20572]
["No. 8 Agg, 703.02 Super-Structure (Gravel)",20080]
["No. 57 Agg, 703.02 Concrete (Gravel)",2057]
["Sand, 703.02 Concrete ","02SD2"]
["Sand, 703.02 Concrete, Acid Insoluble ","02SD23"]
["No. 8 Agg, 703.02 Concrete (Gravel)",2008]
["No. 57 Agg, 703.02 Super-Structure (Gravel)",20570]
["No. 57 Agg, 703.13 Freeze-Thaw (Gravel)",20572]
["No. 57 Agg, 703.13 Freeze-Thaw (Gravel)",20572]
["No. 8 Agg, 703.02 Concrete (Limestone)",2008]
["No. 57 Agg, 703.02 Concrete (Limestone)",2057]
["Sand, 703.02 Concrete ","02SD2"]
["No. 57 Agg, 703.13 Freeze-Thaw (Limestone)",20572]
["No. 8 Agg, 703.02 Concrete Overlay (Limestone)",20081]
["No. 57 Agg, 703.02 Super-Structure (Limestone)",20570]
["No. 8 Agg, 703.02 Super-Structure (Limestone)",20080]
["Sand, 703.02 Concrete ","02SD2"]
["Sand, 703.02 Concrete, Acid Insoluble ","02SD23"]
["Sand, 703.02 Concrete, Acid Insoluble ","02SD23"]
["Sand, 703.02 Concrete ","02SD2"]
["Sand, 703.02 Concrete ","02SD2"]
["Sand, 703.02 Concrete, Acid Insoluble ","02SD23"]
["No. 8 Agg, 703.02 Concrete (Gravel)",2008]
["Sand, 703.02 Concrete ","02SD2"]
["No. 57 Agg, 703.02 Super-Structure (Gravel)",20570]
["No. 57 Agg, 703.02 Concrete (Gravel)",2057]
["Sand, 703.02 Concrete, Acid Insoluble ","02SD23"]
["No. 8 Agg, 703.02 Super-Structure (Limestone)",20080]
["No. 8 Agg, 703.02 Concrete Overlay (Limestone)",20081]
["No. 8 Agg, 703.02 Concrete (Limestone)",2008]
["No. 57 Agg, 703.02 Super-Structure (Limestone)",20570]
["No. 57 Agg, 703.02 Concrete (Limestone)",2057]
["No. 57 Agg, 703.13 Freeze-Thaw (Limestone)",20572]
["No. 8 Agg, 703.02 Concrete Overlay (Limestone)",20081]
["No. 8 Agg, 703.02 Concrete (Limestone)",2008]
["No. 8 Agg, 703.02 Super-Structure (Limestone)",20080]
["No. 57 Agg, 703.02 Concrete (Limestone)",2057]
["No. 57 Agg, 703.02 Super-Structure (Limestone)",20570]
["No. 57 Agg, 703.13 Freeze-Thaw (Limestone)",20572]
["No. 8 Agg, 703.02 Super-Structure (Limestone)",20080]
["No. 8 Agg, 703.02 Concrete Overlay (Limestone)",20081]
["No. 8 Agg, 703.02 Concrete (Limestone)",2008]
["No. 57 Agg, 703.02 Super-Structure (Limestone)",20570]
["No. 67 Agg, 703.02 Concrete (Limestone)",2067]
["No. 67 Agg, 703.02 Super-Structure (Limestone)",20670]
["No. 57 Agg, 703.02 Concrete (Limestone)",2057]
["No. 8 Agg, 703.02 Concrete Overlay, Mod Grading (Limestone)","02008M1"]
["No. 8 Agg, 703.02 Super-Structure, Mod Grading (Limestone)","02008M0"]
["No. 8 Agg, 703.02 Concrete, Mod Grading (Limestone)","02008M"]
["No. 8 Agg, 703.02 Concrete, Mod Grading (Limestone)","02008M"]
["No. 8 Agg, 703.02 Super-Structure (Limestone)",20080]
["No. 8 Agg, 703.02 Concrete Overlay (Limestone)",20081]
["No. 8 Agg, 703.02 Concrete (Limestone)",2008]
["No. 57 Agg, 703.02 Super-Structure (Limestone)",20570]
["No. 57 Agg, 703.02 Concrete (Limestone)",2057]
["No. 8 Agg, 703.02 Super-Structure (Limestone)",20080]
["No. 8 Agg, 703.02 Concrete Overlay (Limestone)",20081]
["No. 8 Agg, 703.02 Concrete (Limestone)",2008]
["No. 57 Agg, 703.13 Freeze-Thaw (Limestone)",20572]
["No. 8 Agg, 703.02 Super-Structure (Limestone)",20080]
["No. 8 Agg, 703.02 Concrete (Limestone)",2008]
["No. 57 Agg, 703.02 Super-Structure (Limestone)",20570]
["No. 8 Agg, 703.02 Concrete Overlay (Limestone)",20081]
["No. 57 Agg, 703.02 Concrete (Limestone)",2057]
["Sand, 703.02 Concrete ","02SD2"]
["No. 8 Agg, 703.02 Concrete (Gravel)",2008]
["No. 57 Agg, 703.02 Concrete (Gravel)",2057]
["No. 57 Agg, 703.02 Super-Structure (Gravel)",20570]
["No. 8 Agg, 703.02 Super-Structure (Gravel)",20080]
["Sand, 703.02 Concrete, Acid Insoluble ","02SD23"]
["No. 57 Agg, 703.13 Freeze-Thaw (Gravel)",20572]
["Sand, 703.02 Concrete ","02SD2"]
["Sand, 703.02 Concrete, Acid Insoluble ","02SD23"]
["Sand, 703.02 Concrete, Acid Insoluble ","02SD23"]
["Sand, 703.02 Concrete ","02SD2"]
["Sand, 703.02 Concrete, Acid Insoluble ","02SD23"]
["Sand, 703.02 Concrete ","02SD2"]
["Sand, 703.02 Concrete ","02SD2"]
["Sand, 703.02 Concrete, Acid Insoluble ","02SD23"]
["No. 8 Agg, 703.02 Concrete (Limestone)",2008]
["No. 57 Agg, 703.02 Super-Structure (Limestone)",20570]
["No. 57 Agg, 703.02 Concrete (Limestone)",2057]
["No. 8 Agg, 703.02 Super-Structure (Limestone)",20080]
["No. 8 Agg, 703.02 Concrete (Limestone)",2008]
["No. 57 Agg, 703.02 Super-Structure (Limestone)",20570]
["No. 57 Agg, 703.02 Concrete (Limestone)",2057]
["No. 57 Agg, 703.13 Freeze-Thaw (Limestone)",20572]
["Sand, 703.02 Concrete ","02SD2"]
["No. 8 Agg, 703.02 Concrete (Gravel)",2008]
["No. 57 Agg, 703.02 Concrete (Gravel)",2057]
["No. 57 Agg, 703.13 Freeze-Thaw (Gravel)",20572]
["Sand, 703.02 Concrete, Acid Insoluble ","02SD23"]
["No. 57 Agg, 703.02 Concrete (Gravel)",2057]
["Sand, 703.02 Concrete ","02SD2"]
["No. 8 Agg, 703.02 Concrete (Gravel)",2008]
["No. 57 Agg, 703.02 Super-Structure (Gravel)",20570]
["No. 57 Agg, 703.13 Freeze-Thaw (Gravel)",20572]
["Sand, 703.02 Concrete, Acid Insoluble ","02SD23"]
["No. 8 Agg, 703.02 Concrete Overlay (Limestone)",20081]
["No. 8 Agg, 703.02 Concrete (Limestone)",2008]
["No. 8 Agg, 703.02 Super-Structure (Limestone)",20080]
["No. 57 Agg, 703.02 Concrete (Limestone)",2057]
["No. 57 Agg, 703.02 Super-Structure (Limestone)",20570]
["No. 67 Agg, 703.02 Concrete (Limestone)",2067]
["No. 67 Agg, 703.02 Super-Structure (Limestone)",20670]
["Sand, 703.02 Concrete ","02SD2"]
["No. 8 Agg, 703.02 Concrete (Gravel)",2008]
["No. 8 Agg, 703.02 Super-Structure (Gravel)",20080]
["Sand, 703.02 Concrete, Acid Insoluble ","02SD23"]
["No. 8 Agg, 703.02 Concrete (Gravel)",2008]
["No. 57 Agg, 703.02 Concrete (Gravel)",2057]
["Sand, 703.02 Concrete ","02SD2"]
["Sand, 703.02 Concrete ","02SD2"]
["Sand, 703.02 Concrete ","02SD2"]
["Sand, 703.02 Concrete, Acid Insoluble ","02SD23"]
["No. 57 Agg, 703.02 Super-Structure (Limestone)",20570]
["No. 8 Agg, 703.02 Concrete (Limestone)",2008]
["No. 57 Agg, 703.02 Concrete (Limestone)",2057]
["No. 8 Agg, 703.02 Super-Structure (Limestone)",20080]
["No. 57 Agg, 703.13 Freeze-Thaw (Limestone)",20572]
["Sand, 703.02 Concrete ","02SD2"]
["Sand, 703.02 Concrete, Acid Insoluble ","02SD23"]
["Sand, 703.02 Concrete ","02SD2"]
["No. 8 Agg, 703.02 Super-Structure (Limestone)",20080]
["No. 8 Agg, 703.02 Concrete (Limestone)",2008]
["No. 57 Agg, 703.02 Super-Structure (Limestone)",20570]
["No. 8 Agg, 703.02 Concrete Overlay (Limestone)",20081]
["No. 57 Agg, 703.02 Concrete (Limestone)",2057]
["No. 57 Agg, 703.13 Freeze-Thaw (Limestone)",20572]
["No. 8 Agg, 703.02 Concrete Overlay (Dolostone)",20081]
["No. 8 Agg, 703.02 Concrete (Dolostone)",2008]
["No. 8 Agg, 703.02 Super-Structure (Dolostone)",20080]
["No. 67 Agg, 703.02 Concrete (Dolostone)",2067]
["No. 67 Agg, 703.02 Super-Structure (Dolostone)",20670]
["No. 57 Agg, 703.02 Concrete (Dolostone)",2057]
["No. 57 Agg, 703.02 Super-Structure (Dolostone)",20570]
["No. 57 Agg, 703.13 Freeze-Thaw (Dolostone)",20572]
["Sand, 703.02 Concrete ","02SD2"]
["No. 57 Agg, 703.13 Freeze-Thaw (Dolostone)",20572]
["No. 57 Agg, 703.02 Concrete (Dolostone)",2057]
["No. 57 Agg, 703.02 Super-Structure (Dolostone)",20570]
["Sand, 703.02 Concrete ","02SD2"]
["Sand, 703.02 Concrete ","02SD2"]
["Sand, 703.02 Concrete, Acid Insoluble ","02SD23"]
["No. 57 Agg, 703.02 Concrete (Gravel (Crushed))",2057]
["No. 8 Agg, 703.02 Concrete (Limestone)",2008]
["No. 8 Agg, 703.02 Concrete Overlay (Limestone)",20081]
["No. 8 Agg, 703.02 Super-Structure (Limestone)",20080]
["No. 57 Agg, 703.13 Freeze-Thaw (Limestone)",20572]
["No. 57 Agg, 703.02 Concrete (Limestone)",2057]
["No. 57 Agg, 703.02 Super-Structure (Limestone)",20570]
["No. 67 Agg, 703.02 Concrete (Limestone)",2067]
["Sand, 703.02 Concrete ","02SD2"]
["No. 8 Agg, 703.02 Concrete (Gravel)",2008]
["Sand, 703.02 Concrete ","02SD2"]
["No. 57 Agg, 703.02 Concrete (Gravel)",2057]
["No. 8 Agg, 703.02 Concrete (Limestone)",2008]
["No. 57 Agg, 703.02 Concrete (Limestone)",2057]
["No. 57 Agg, 703.13 Freeze-Thaw (Limestone)",20572]
["No. 8 Agg, 703.02 Concrete Overlay (Limestone)",20081]
["No. 8 Agg, 703.02 Concrete (Limestone)",2008]
["No. 8 Agg, 703.02 Super-Structure (Limestone)",20080]
["No. 67 Agg, 703.02 Concrete (Limestone)",2067]
["No. 67 Agg, 703.02 Super-Structure (Limestone)",20670]
["No. 57 Agg, 703.02 Concrete (Limestone)",2057]
["No. 57 Agg, 703.02 Super-Structure (Limestone)",20570]
["No. 4 Agg, 703.02 Concrete (Limestone)",2004]
["No. 8 Agg, 703.02 Super-Structure (Limestone)",20080]
["No. 8 Agg, 703.02 Concrete (Limestone)",2008]
["No. 8 Agg, 703.02 Concrete Overlay (Limestone)",20081]
["No. 57 Agg, 703.02 Super-Structure (Limestone)",20570]
["No. 57 Agg, 703.02 Concrete (Limestone)",2057]
["No. 57 Agg, 703.13 Freeze-Thaw (Limestone)",20572]
["No. 57 Agg, 703.02 Super-Structure (Limestone)",20570]
["No. 8 Agg, 703.02 Super-Structure (Limestone)",20080]
["No. 8 Agg, 703.02 Concrete Overlay (Limestone)",20081]
["No. 57 Agg, 703.13 Freeze-Thaw (Limestone)",20572]
["No. 8 Agg, 703.02 Concrete (Limestone)",2008]
["No. 57 Agg, 703.02 Concrete (Limestone)",2057]
["No. 67 Agg, 703.02 Concrete (Limestone)",2067]
["No. 67 Agg, 703.13 Freeze-Thaw (Limestone)",20672]
["No. 57 Agg, 703.13 Freeze-Thaw (Dolostone)",20572]
["No. 67 Agg, 703.13 Freeze-Thaw (Dolostone)",20672]
["No. 8 Agg, 703.02 Super-Structure (Dolostone)",20080]
["No. 8 Agg, 703.02 Concrete Overlay (Dolostone)",20081]
["No. 8 Agg, 703.02 Concrete (Dolostone)",2008]
["No. 57 Agg, 703.02 Super-Structure (Dolostone)",20570]
["No. 67 Agg, 703.02 Concrete (Dolostone)",2067]
["No. 67 Agg, 703.02 Super-Structure (Dolostone)",20670]
["No. 57 Agg, 703.02 Concrete (Dolostone)",2057]
["No. 8 Agg, 703.02 Super-Structure (Limestone)",20080]
["No. 8 Agg, 703.02 Concrete (Limestone)",2008]
["No. 57 Agg, 703.02 Super-Structure (Limestone)",20570]
["No. 8 Agg, 703.02 Concrete Overlay (Limestone)",20081]
["No. 57 Agg, 703.02 Concrete (Limestone)",2057]
["No. 4 Agg, 703.02 Concrete (Limestone)",2004]
["No. 8 Agg, 703.02 Concrete Overlay (Limestone)",20081]
["No. 8 Agg, 703.02 Concrete (Limestone)",2008]
["No. 8 Agg, 703.02 Super-Structure (Limestone)",20080]
["No. 67 Agg, 703.02 Concrete (Limestone)",2067]
["No. 67 Agg, 703.02 Super-Structure (Limestone)",20670]
["No. 57 Agg, 703.02 Concrete (Limestone)",2057]
["No. 57 Agg, 703.02 Super-Structure (Limestone)",20570]
["No. 57 Agg, 703.13 Freeze-Thaw (Limestone)",20572]
["No. 67 Agg, 703.13 Freeze-Thaw (Limestone)",20672]
["No. 4 Agg, 703.02 Concrete, Mod Grading (Limestone)","02004M"]
["No. 57 Agg, 703.02 Concrete (Limestone)",2057]
["No. 8 Agg, 703.02 Concrete (Limestone)",2008]
["No. 8 Agg, 703.02 Concrete Overlay (Limestone)",20081]
["No. 57 Agg, 703.02 Concrete (Limestone)",2057]
["No. 57 Agg, 703.02 Super-Structure (Limestone)",20570]
["No. 57 Agg, 703.13 Freeze-Thaw (Limestone)",20572]
["No. 8 Agg, 703.02 Super-Structure (Limestone)",20080]
["No. 8 Agg, 703.02 Super-Structure (Limestone)",20080]
["No. 8 Agg, 703.02 Concrete (Limestone)",2008]
["No. 57 Agg, 703.02 Super-Structure (Limestone)",20570]
["No. 57 Agg, 703.02 Concrete (Limestone)",2057]
["No. 67 Agg, 703.02 Concrete (Limestone)",2067]
["No. 8 Agg, 703.02 Concrete Overlay (Limestone)",20081]
["No. 57 Agg, 703.13 Freeze-Thaw (Limestone)",20572]
["No. 57 Agg, 703.13 Freeze-Thaw (Dolostone)",20572]
["No. 57 Agg, 703.02 Concrete (Dolostone)",2057]
["No. 8 Agg, 703.02 Concrete, Mod Grading (Dolostone)","02008M"]
["Sand, 703.02 Concrete ","02SD2"]
["Sand, 703.02 Concrete ","02SD2"]
["Sand, 703.02 Concrete, Acid Insoluble ","02SD23"]
["No. 57 Agg, 703.02 Concrete (Gravel)",2057]
["No. 57 Agg, 703.02 Concrete (Limestone)",2057]
["No. 8 Agg, 703.02 Concrete (Limestone)",2008]
["No. 57 Agg, 703.02 Super-Structure (Limestone)",20570]
["No. 57 Agg, 703.02 Concrete (Limestone)",2057]
["No. 8 Agg, 703.02 Concrete (Gravel)",2008]
["No. 8 Agg, 703.02 Super-Structure (Gravel)",20080]
["No. 8 Agg, 703.02 Concrete Overlay (Gravel)",20081]
["No. 57 Agg, 703.02 Concrete (Gravel)",2057]
["Sand, 703.02 Concrete ","02SD2"]
["No. 57 Agg, 703.02 Super-Structure (Gravel)",20570]
["No. 9 Agg, 703.02 Concrete, Mod Grading (Gravel)","02009M"]
["No. 8 Agg, 703.02 Super-Structure (Gravel)",20080]
["No. 8 Agg, 703.02 Concrete Overlay (Gravel)",20081]
["Sand, 703.02 Concrete ","02SD2"]
["No. 8 Agg, 703.02 Super-Structure (Limestone)",20080]
["No. 8 Agg, 703.02 Concrete Overlay (Limestone)",20081]
["No. 8 Agg, 703.02 Concrete (Limestone)",2008]
["No. 57 Agg, 703.02 Super-Structure (Limestone)",20570]
["No. 57 Agg, 703.02 Concrete (Limestone)",2057]
["No. 57 Agg, 703.13 Freeze-Thaw (Limestone)",20572]
["No. 8 Agg, 703.02 Concrete (Limestone)",2008]
["No. 8 Agg, 703.02 Concrete Overlay (Limestone)",20081]
["No. 8 Agg, 703.02 Super-Structure (Limestone)",20080]
["No. 57 Agg, 703.02 Concrete (Limestone)",2057]
["No. 57 Agg, 703.02 Super-Structure (Limestone)",20570]
["No. 57 Agg, 703.13 Freeze-Thaw (Limestone)",20572]
["No. 67 Agg, 703.02 Super-Structure (Limestone)",20670]
["No. 8 Agg, 703.02 Super-Structure (Limestone)",20080]
["No. 8 Agg, 703.02 Concrete Overlay (Limestone)",20081]
["No. 8 Agg, 703.02 Concrete (Limestone)",2008]
["No. 57 Agg, 703.02 Super-Structure (Limestone)",20570]
["No. 57 Agg, 703.02 Concrete (Limestone)",2057]
["No. 8 Agg, 703.02 Concrete (Slag (ACBF))",2008]
["No. 57 Agg, 703.02 Concrete (Slag (ACBF))",2057]
["Sand, 703.02 Concrete ","02SD2"]
["Sand, 703.02 Concrete ","02SD2"]
["Sand, 703.02 Concrete ","02SD2"]
["Sand, 703.02 Concrete ","02SD2"]
["Sand, 703.02 Concrete ","02SD2"]
["No. 8 Agg, 703.02 Concrete, Mod Grading (Gravel)","02008M"]
["No. 8 Agg, 703.02 Super-Structure, Mod Grading (Gravel)","02008M0"]
["Sand, 703.02 Concrete ","02SD2"]
["No. 8 Agg, 703.02 Concrete, Mod Grading (Gravel)","02008M"]
["No. 8 Agg, 703.02 Super-Structure, Mod Grading (Gravel)","02008M0"]
["Sand, 703.02 Concrete ","02SD2"]
["Sand, 703.02 Concrete ","02SD2"]
["Sand, 703.02 Concrete ","02SD2"]
["No. 8 Agg, 703.02 Super-Structure (Gravel)",20080]
["Sand, 703.02 Concrete, Acid Insoluble ","02SD23"]
["No. 8 Agg, 703.02 Concrete (Gravel)",2008]
["No. 8 Agg, 703.02 Super-Structure (Dolostone)",20080]
["No. 8 Agg, 703.02 Concrete Overlay (Dolostone)",20081]
["No. 8 Agg, 703.02 Concrete (Dolostone)",2008]
["No. 57 Agg, 703.02 Super-Structure (Dolostone)",20570]
["No. 57 Agg, 703.02 Concrete (Dolostone)",2057]
["Sand, 703.02 Concrete ","02SD2"]
["No. 57 Agg, 703.13 Freeze-Thaw (Dolostone)",20572]
["No. 57 Agg, 703.13 Freeze-Thaw (Gravel)",20572]
["No. 57 Agg, 703.02 Concrete (Gravel)",2057]
["No. 57 Agg, 703.02 Super-Structure (Gravel)",20570]
["Sand, 703.02 Concrete ","02SD2"]
["No. 8 Agg, 703.02 Concrete (Dolostone)",2008]
["No. 8 Agg, 703.02 Concrete Overlay (Dolostone)",20081]
["No. 8 Agg, 703.02 Super-Structure (Dolostone)",20080]
["No. 57 Agg, 703.02 Concrete (Dolostone)",2057]
["No. 57 Agg, 703.02 Super-Structure (Dolostone)",20570]
["No. 57 Agg, 703.13 Freeze-Thaw (Dolostone)",20572]
["No. 67 Agg, 703.13 Freeze-Thaw (Limestone)",20672]
["No. 57 Agg, 703.13 Freeze-Thaw (Limestone)",20572]
["No. 67 Agg, 703.02 Super-Structure (Limestone)",20670]
["No. 8 Agg, 703.02 Super-Structure (Limestone)",20080]
["No. 8 Agg, 703.02 Concrete Overlay (Limestone)",20081]
["No. 8 Agg, 703.02 Concrete (Limestone)",2008]
["No. 57 Agg, 703.02 Super-Structure (Limestone)",20570]
["No. 57 Agg, 703.02 Concrete (Limestone)",2057]
["No. 8 Agg, 703.02 Super-Structure (Limestone)",20080]
["No. 8 Agg, 703.02 Concrete Overlay (Limestone)",20081]
["No. 8 Agg, 703.02 Concrete (Limestone)",2008]
["No. 57 Agg, 703.02 Super-Structure (Limestone)",20570]
["No. 57 Agg, 703.13 Freeze-Thaw (Limestone)",20572]
["No. 57 Agg, 703.02 Concrete (Limestone)",2057]
["No. 67 Agg, 703.02 Concrete (Limestone)",2067]
["No. 8 Agg, 703.02 Super-Structure (Gravel)",20080]
["No. 8 Agg, 703.02 Concrete Overlay (Gravel)",20081]
["No. 57 Agg, 703.02 Concrete (Gravel)",2057]
["Sand, 703.02 Concrete ","02SD2"]
["Sand, 703.02 Concrete, Acid Insoluble ","02SD23"]
["No. 8 Agg, 703.02 Concrete (Gravel)",2008]
["No. 57 Agg, 703.02 Super-Structure (Gravel)",20570]
["No. 57 Agg, 703.13 Freeze-Thaw (Gravel)",20572]
["No. 8 Agg, 703.02 Concrete (Gravel)",2008]
["No. 8 Agg, 703.02 Super-Structure (Gravel)",20080]
["No. 8 Agg, 703.02 Concrete Overlay (Gravel)",20081]
["Sand, 703.02 Concrete ","02SD2"]
["No. 57 Agg, 703.02 Super-Structure (Gravel)",20570]
["No. 57 Agg, 703.02 Concrete (Gravel)",2057]
["No. 8 Agg, 703.02 Concrete (Gravel)",2008]
["Sand, 703.02 Concrete ","02SD2"]
["No. 57 Agg, 703.13 Freeze-Thaw (Gravel)",20572]
["No. 57 Agg, 703.02 Concrete (Gravel)",2057]
["No. 57 Agg, 703.02 Concrete (Gravel)",2057]
["No. 9 Agg, 703.02 Concrete, Mod Grading (Gravel)","02009M"]
["No. 8 Agg, 703.02 Concrete (Gravel)",2008]
["No. 8 Agg, 703.02 Super-Structure (Gravel)",20080]
["Sand, 703.02 Concrete ","02SD2"]
["No. 57 Agg, 703.02 Super-Structure (Gravel)",20570]
["No. 57 Agg, 703.13 Freeze-Thaw (Gravel)",20572]
["No. 8 Agg, 703.02 Concrete (Gravel)",2008]
["No. 8 Agg, 703.02 Super-Structure (Gravel)",20080]
["No. 8 Agg, 703.02 Concrete Overlay (Gravel)",20081]
["No. 57 Agg, 703.02 Super-Structure (Gravel)",20570]
["No. 57 Agg, 703.02 Concrete (Gravel)",2057]
["Sand, 703.02 Concrete ","02SD2"]
["No. 8 Agg, 703.02 Concrete (Limestone)",2008]
["No. 67 Agg, 703.02 Concrete (Limestone)",2067]
["No. 57 Agg, 703.02 Concrete (Limestone)",2057]
["No. 57 Agg, 703.13 Freeze-Thaw (Limestone)",20572]
["Sand, 703.02 Concrete ","02SD2"]
["Sand, 703.02 Concrete, Acid Insoluble ","02SD23"]
["No. 8 Agg, 703.02 Concrete (Gravel)",2008]
["No. 8 Agg, 703.02 Super-Structure (Gravel)",20080]
["Sand, 703.02 Concrete ","02SD2"]
["No. 57 Agg, 703.02 Super-Structure (Gravel)",20570]
["No. 57 Agg, 703.13 Freeze-Thaw (Gravel)",20572]
["No. 57 Agg, 703.02 Concrete (Gravel)",2057]
["No. 8 Agg, 703.02 Concrete Overlay (Gravel)",20081]
["Sand, 703.02 Concrete ","02SD2"]
["No. 57 Agg, 703.13 Freeze-Thaw (Gravel)",20572]
["No. 57 Agg, 703.02 Concrete (Gravel)",2057]
["Sand, 703.02 Concrete ","02SD2"]
["Sand, 703.02 Concrete, Acid Insoluble ","02SD23"]
["No. 8 Agg, 703.02 Concrete (Gravel)",2008]
["No. 57 Agg, 703.02 Super-Structure (Gravel)",20570]
["No. 57 Agg, 703.02 Concrete (Gravel)",2057]
["Sand, 703.02 Concrete ","02SD2"]
["No. 57 Agg, 703.13 Freeze-Thaw (Gravel)",20572]
["Sand, 703.02 Concrete ","02SD2"]
["Sand, 703.02 Concrete, Acid Insoluble ","02SD23"]
["Sand, 703.02 Concrete ","02SD2"]
["Sand, 703.02 Concrete, Acid Insoluble ","02SD23"]
["Sand, 703.02 Concrete ","02SD2"]
["Sand, 703.02 Concrete ","02SD2"]
["Sand, 703.02 Concrete ","02SD2"]
["Sand, 703.02 Concrete ","02SD2"]
["Sand, 703.02 Concrete, Acid Insoluble ","02SD23"]
["No. 8 Agg, 703.02 Concrete (Gravel)",2008]
["No. 57 Agg, 703.02 Concrete (Gravel)",2057]
["Sand, 703.02 Concrete ","02SD2"]
["Sand, 703.02 Concrete ","02SD2"]
["Sand, 703.02 Concrete, Acid Insoluble ","02SD23"]
["No. 57 Agg, 703.02 Concrete (Gravel)",2057]
["Sand, 703.02 Concrete ","02SD2"]
["Sand, 703.02 Concrete, Acid Insoluble ","02SD23"]
["No. 57 Agg, 703.13 Freeze-Thaw (Gravel)",20572]
["Sand, 703.02 Concrete ","02SD2"]
["No. 57 Agg, 703.02 Concrete (Limestone)",2057]
["No. 8 Agg, 703.02 Concrete (Slag (ACBF))",2008]
["No. 57 Agg, 703.02 Concrete (Slag (ACBF))",2057]
["No. 8 Agg, 703.02 Concrete Overlay (Slag (ACBF))",20081]
["No. 8 Agg, 703.02 Super-Structure (Limestone)",20080]
["No. 8 Agg, 703.02 Concrete (Limestone)",2008]
["No. 57 Agg, 703.02 Concrete (Limestone)",2057]
["No. 57 Agg, 703.02 Super-Structure (Limestone)",20570]
["No. 57 Agg, 703.13 Freeze-Thaw (Limestone)",20572]
["No. 57 Agg, 703.02 Concrete (Dolostone)",2057]
["No. 57 Agg, 703.02 Concrete (Dolostone)",2057]
["No. 8 Agg, 703.02 Concrete (Dolostone)",2008]
["No. 8 Agg, 703.02 Concrete (Limestone)",2008]
["No. 8 Agg, 703.02 Super-Structure (Dolostone)",20080]
["No. 8 Agg, 703.02 Concrete Overlay (Dolostone)",20081]
["No. 8 Agg, 703.02 Concrete (Dolostone)",2008]
["No. 57 Agg, 703.02 Super-Structure (Dolostone)",20570]
["No. 67 Agg, 703.02 Concrete (Dolostone)",2067]
["No. 67 Agg, 703.02 Super-Structure (Dolostone)",20670]
["No. 78 Agg, 703.02 Concrete (Dolostone)",2078]
["No. 57 Agg, 703.02 Concrete (Dolostone)",2057]
["No. 57 Agg, 703.13 Freeze-Thaw (Dolostone)",20572]
["No. 67 Agg, 703.13 Freeze-Thaw (Dolostone)",20672]
["Sand, 703.02 Concrete ","02SD2"]
["Sand, 703.02 Concrete ","02SD2"]
["Sand, 703.02 Concrete, Acid Insoluble ","02SD23"]
["No. 8 Agg, 703.02 Concrete, Mod Grading (Limestone)","02008M"]
["No. 57 Agg, 703.02 Concrete, Mod Grading (Limestone)","02057M"]
["No. 57 Agg, 703.02 Concrete (Limestone)",2057]
["No. 57 Agg, 703.02 Super-Structure (Limestone)",20570]
["No. 67 Agg, 703.02 Concrete (Limestone)",2067]
["No. 67 Agg, 703.02 Super-Structure (Limestone)",20670]
["No. 8 Agg, 703.02 Concrete (Limestone)",2008]
["No. 8 Agg, 703.02 Super-Structure (Limestone)",20080]
["No. 8 Agg, 703.02 Concrete Overlay (Limestone)",20081]
["No. 57 Agg, 703.13 Freeze-Thaw (Limestone)",20572]
["No. 8 Agg, 703.02 Super-Structure (Limestone)",20080]
["No. 8 Agg, 703.02 Concrete Overlay (Limestone)",20081]
["No. 8 Agg, 703.02 Concrete (Limestone)",2008]
["No. 57 Agg, 703.02 Super-Structure (Limestone)",20570]
["No. 57 Agg, 703.02 Concrete (Limestone)",2057]
["No. 67 Agg, 703.02 Concrete (Limestone)",2067]
["No. 57 Agg, 703.13 Freeze-Thaw (Limestone)",20572]
["No. 8 Agg, 703.02 Super-Structure (Limestone)",20080]
["No. 8 Agg, 703.02 Concrete Overlay (Limestone)",20081]
["No. 8 Agg, 703.02 Concrete (Limestone)",2008]
["No. 57 Agg, 703.02 Super-Structure (Limestone)",20570]
["No. 67 Agg, 703.02 Concrete (Limestone)",2067]
["No. 67 Agg, 703.02 Super-Structure (Limestone)",20670]
["No. 57 Agg, 703.02 Concrete (Limestone)",2057]
["No. 8 Agg, 703.02 Concrete Overlay (Limestone)",20081]
["No. 8 Agg, 703.02 Concrete (Limestone)",2008]
["No. 8 Agg, 703.02 Super-Structure (Limestone)",20080]
["No. 57 Agg, 703.02 Concrete (Limestone)",2057]
["No. 57 Agg, 703.02 Super-Structure (Limestone)",20570]
["No. 8 Agg, 703.02 Concrete Overlay (Limestone)",20081]
["No. 8 Agg, 703.02 Concrete (Limestone)",2008]
["No. 8 Agg, 703.02 Super-Structure (Limestone)",20080]
["No. 57 Agg, 703.02 Concrete (Limestone)",2057]
["No. 57 Agg, 703.02 Super-Structure (Limestone)",20570]
["No. 57 Agg, 703.02 Concrete (Dolostone)",2057]
["No. 8 Agg, 703.02 Concrete (Dolostone)",2008]
["No. 8 Agg, 703.02 Super-Structure (Dolostone)",20080]
["No. 57 Agg, 703.02 Super-Structure (Dolostone)",20570]
["No. 57 Agg, 703.13 Freeze-Thaw (Dolostone)",20572]
["No. 8 Agg, 703.02 Concrete (Limestone)",2008]
["No. 57 Agg, 703.02 Concrete (Limestone)",2057]
["No. 57 Agg, 703.02 Super-Structure (Limestone)",20570]
["No. 8 Agg, 703.02 Super-Structure (Limestone)",20080]
["No. 57 Agg, 703.02 Concrete (Limestone)",2057]
["No. 57 Agg, 703.13 Freeze-Thaw (Limestone)",20572]
["No. 8 Agg, 703.02 Concrete (Limestone)",2008]
["No. 8 Agg, 703.02 Super-Structure (Limestone)",20080]
["No. 57 Agg, 703.02 Concrete (Limestone)",2057]
["No. 57 Agg, 703.02 Super-Structure (Limestone)",20570]
["No. 57 Agg, 703.13 Freeze-Thaw (Limestone)",20572]
["No. 8 Agg, 703.02 Concrete (Limestone)",2008]
["No. 8 Agg, 703.02 Super-Structure (Limestone)",20080]
["No. 57 Agg, 703.02 Concrete (Limestone)",2057]
["No. 57 Agg, 703.02 Super-Structure (Limestone)",20570]
["No. 57 Agg, 703.13 Freeze-Thaw (Limestone)",20572]
["No. 8 Agg, 703.02 Concrete (Limestone)",2008]
["No. 8 Agg, 703.02 Concrete Overlay (Limestone)",20081]
["No. 8 Agg, 703.02 Super-Structure (Limestone)",20080]
["No. 57 Agg, 703.02 Concrete (Limestone)",2057]
["No. 57 Agg, 703.02 Super-Structure (Limestone)",20570]
["No. 57 Agg, 703.02 Concrete, Mod Grading (Limestone)","02057M"]
["No. 57 Agg, 703.02 Super-Structure, Mod Grading (Limestone)","02057M0"]
["No. 67 Agg, 703.02 Concrete, Mod Grading (Limestone)","02067M"]
["No. 57 Agg, 703.13 Freeze-Thaw (Limestone)",20572]
["No. 57 Agg, 703.13 Freeze-Thaw, Mod Grading (Limestone)","02057M2"]
["No. 67 Agg, 703.13 Freeze-Thaw, Mod Grading (Limestone)","02067M2"]
["Sand, 703.02 Concrete ","02SD2"]
["No. 8 Agg, 703.02 Concrete (Limestone)",2008]
["No. 57 Agg, 703.13 Freeze-Thaw (Limestone)",20572]
["No. 67 Agg, 703.02 Concrete (Limestone)",2067]
["No. 57 Agg, 703.02 Concrete (Limestone)",2057]
["No. 67 Agg, 703.13 Freeze-Thaw (Limestone)",20672]
["Sand, 703.02 Concrete ","02SD2"]
["Sand, 703.02 Concrete ","02SD2"]
["No. 8 Agg, 703.02 Concrete (Limestone)",2008]
["No. 57 Agg, 703.02 Concrete (Limestone)",2057]
["No. 57 Agg, 703.13 Freeze-Thaw (Limestone)",20572]
["Sand, 703.02 Concrete ","02SD2"]
["Sand, 703.02 Concrete, Acid Insoluble ","02SD23"]
["Sand, 703.02 Concrete ","02SD2"]
["Sand, 703.02 Concrete, Acid Insoluble ","02SD23"]
["No. 8 Agg, 703.02 Concrete (Gravel (Crushed))",2008]
["No. 57 Agg, 703.02 Concrete (Gravel (Crushed))",2057]
["No. 67 Agg, 703.13 Freeze-Thaw (Gravel (Crushed))",20672]
["Sand, 703.02 Concrete ","02SD2"]
["No. 57 Agg, 703.02 Concrete (Gravel)",2057]
["No. 8 Agg, 703.02 Concrete (Gravel (100% Crushed))",2008]
["No. 67 Agg, 703.02 Concrete (Gravel (100% Crushed))",2067]
["No. 67 Agg, 703.13 Freeze-Thaw (Gravel (100% Crushed))",20672]
["No. 57 Agg, 703.02 Concrete (Gravel (40% Crushed))",2057]
["Sand, 703.02 Concrete ","02SD2"]
["Sand, 703.02 Concrete, Acid Insoluble ","02SD23"]
["No. 57 Agg, 703.02 Concrete (Limestone)",2057]
["No. 8 Agg, 703.02 Concrete (Limestone)",2008]
["No. 8 Agg, 703.02 Super-Structure (Limestone)",20080]
["No. 57 Agg, 703.02 Super-Structure (Limestone)",20570]
["Sand, 703.02 Concrete ","02SD2"]
["Sand, 703.02 Concrete, Acid Insoluble ","02SD23"]
["No. 57 Agg, 703.02 Concrete (Gravel)",2057]
["Sand, 703.02 Concrete ","02SD2"]
["Sand, 703.02 Concrete, Acid Insoluble ","02SD23"]
["No. 8 Agg, 703.02 Concrete Overlay (Dolostone)",20081]
["No. 57 Agg, 703.02 Concrete (Dolostone)",2057]
["No. 57 Agg, 703.13 Freeze-Thaw (Dolostone)",20572]
["No. 8 Agg, 703.02 Concrete (Dolostone)",2008]
["No. 8 Agg, 703.02 Super-Structure (Dolostone)",20080]
["No. 57 Agg, 703.02 Super-Structure (Dolostone)",20570]
["Sand, 703.02 Concrete ","02SD2"]
["Sand, 703.02 Concrete, Acid Insoluble ","02SD23"]
["Sand, 703.02 Concrete ","02SD2"]
["No. 8 Agg, 703.02 Concrete Overlay (Trap Rock)",20081]
["No. 8 Agg, 703.02 Concrete (Trap Rock)",2008]
["No. 8 Agg, 703.02 Super-Structure (Trap Rock)",20080]
["No. 57 Agg, 703.02 Concrete (Trap Rock)",2057]
["No. 57 Agg, 703.02 Super-Structure (Trap Rock)",20570]
["Sand, 703.02 Concrete ","02SD2"]
["Sand, 703.02 Concrete ","02SD2"]
["Sand, 703.02 Concrete, Acid Insoluble ","02SD23"]
["No. 8 Agg, 703.02 Concrete (Gravel)",2008]
["No. 57 Agg, 703.02 Concrete (Gravel)",2057]
["Sand, 703.02 Concrete ","02SD2"]
["No. 57 Agg, 703.13 Freeze-Thaw (Gravel)",20572]
["No. 8 Agg, 703.02 Concrete (Gravel)",2008]
["No. 57 Agg, 703.02 Concrete (Gravel)",2057]
["Sand, 703.02 Concrete ","02SD2"]
["Sand, 703.02 Concrete, Acid Insoluble ","02SD23"]
["Sand, 703.02 Concrete ","02SD2"]
["No. 8 Agg, 703.02 Concrete (Gravel)",2008]
["No. 8 Agg, 703.02 Super-Structure (Dolostone)",20080]
["No. 8 Agg, 703.02 Concrete (Dolostone)",2008]
["No. 57 Agg, 703.02 Super-Structure (Dolostone)",20570]
["No. 57 Agg, 703.02 Concrete (Dolostone)",2057]
["No. 57 Agg, 703.13 Freeze-Thaw (Dolostone)",20572]
["No. 8 Agg, 703.02 Concrete Overlay (Limestone)",20081]
["No. 8 Agg, 703.02 Concrete (Limestone)",2008]
["No. 8 Agg, 703.02 Super-Structure (Limestone)",20080]
["No. 57 Agg, 703.02 Concrete (Limestone)",2057]
["No. 57 Agg, 703.02 Super-Structure (Limestone)",20570]
["No. 57 Agg, 703.13 Freeze-Thaw (Limestone)",20572]
["No. 67 Agg, 703.02 Concrete (Limestone)",2067]
["No. 57 Agg, 703.02 Concrete (Limestone)",2057]
["Sand, 703.02 Concrete ","02SD2"]
["Sand, 703.02 Concrete, Acid Insoluble ","02SD23"]
["Sand, 703.02 Concrete ","02SD2"]
["Sand, 703.02 Concrete, Acid Insoluble ","02SD23"]
["No. 8 Agg, 703.02 Super-Structure (Limestone)",20080]
["No. 8 Agg, 703.02 Concrete Overlay (Limestone)",20081]
["No. 8 Agg, 703.02 Concrete (Limestone)",2008]
["No. 57 Agg, 703.02 Super-Structure (Limestone)",20570]
["No. 57 Agg, 703.02 Concrete (Limestone)",2057]
["No. 57 Agg, 703.13 Freeze-Thaw (Limestone)",20572]
["Sand, 703.02 Concrete ","02SD2"]
["Sand, 703.02 Concrete, Acid Insoluble ","02SD23"]
["No. 8 Agg, 703.02 Super-Structure (Gravel)",20080]
["No. 8 Agg, 703.02 Concrete Overlay (Gravel)",20081]
["No. 57 Agg, 703.02 Concrete (Gravel)",2057]
["Sand, 703.02 Concrete ","02SD2"]
["Sand, 703.02 Concrete, Acid Insoluble ","02SD23"]
["No. 8 Agg, 703.02 Concrete (Gravel)",2008]
["No. 57 Agg, 703.02 Super-Structure (Gravel)",20570]
["No. 57 Agg, 703.13 Freeze-Thaw (Gravel)",20572]
["Sand, 703.02 Concrete ","02SD2"]
["No. 57 Agg, 703.02 Concrete (Limestone)",2057]
["No. 57 Agg, 703.13 Freeze-Thaw (Limestone)",20572]
["No. 8 Agg, 703.02 Concrete (Limestone)",2008]
["No. 8 Agg, 703.02 Concrete Overlay (Limestone)",20081]
["No. 8 Agg, 703.02 Super-Structure (Limestone)",20080]
["No. 57 Agg, 703.13 Freeze-Thaw (Limestone)",20572]
["No. 57 Agg, 703.02 Concrete (Limestone)",2057]
["No. 57 Agg, 703.02 Super-Structure (Limestone)",20570]
["Sand, 703.02 Concrete ","02SD2"]
["No. 57 Agg, 703.02 Concrete (Limestone)",2057]
["No. 57 Agg, 703.02 Super-Structure (Limestone)",20570]
["No. 57 Agg, 703.13 Freeze-Thaw (Limestone)",20572]
["Sand, 703.02 Concrete ","02SD2"]
["No. 8 Agg, 703.02 Concrete (Gravel)",2008]
["No. 8 Agg, 703.02 Super-Structure (Gravel)",20080]
["No. 8 Agg, 703.02 Concrete Overlay (Gravel)",20081]
["No. 57 Agg, 703.02 Super-Structure (Gravel)",20570]
["No. 57 Agg, 703.02 Concrete (Gravel)",2057]
["No. 57 Agg, 703.13 Freeze-Thaw (Gravel)",20572]
["Sand, 703.02 Concrete ","02SD2"]
["No. 57 Agg, 703.13 Freeze-Thaw (Gravel)",20572]
["No. 57 Agg, 703.02 Concrete (Gravel)",2057]
["No. 8 Agg, 703.02 Concrete (Gravel)",2008]
["Sand, 703.02 Concrete ","02SD2"]
["No. 8 Agg, 703.02 Super-Structure (Limestone)",20080]
["No. 8 Agg, 703.02 Concrete Overlay (Limestone)",20081]
["No. 8 Agg, 703.02 Concrete (Limestone)",2008]
["No. 57 Agg, 703.02 Super-Structure (Limestone)",20570]
["No. 57 Agg, 703.02 Concrete (Limestone)",2057]
["No. 57 Agg, 703.13 Freeze-Thaw (Limestone)",20572]
["No. 8 Agg, 703.02 Concrete (Gravel)",2008]
["Sand, 703.02 Concrete ","02SD2"]
["No. 57 Agg, 703.02 Concrete (Gravel)",2057]
["No. 57 Agg, 703.13 Freeze-Thaw (Gravel)",20572]
["No. 57 Agg, 703.02 Super-Structure (Gravel)",20570]
["No. 8 Agg, 703.02 Super-Structure (Gravel)",20080]
["No. 8 Agg, 703.02 Concrete (Gravel)",2008]
["No. 8 Agg, 703.02 Super-Structure (Gravel)",20080]
["No. 8 Agg, 703.02 Concrete Overlay (Gravel)",20081]
["Sand, 703.02 Concrete ","02SD2"]
["No. 57 Agg, 703.02 Super-Structure (Gravel)",20570]
["No. 57 Agg, 703.02 Concrete (Gravel)",2057]
["No. 57 Agg, 703.13 Freeze-Thaw (Gravel)",20572]
["Sand, 703.02 Concrete ","02SD2"]
["Sand, 703.02 Concrete, Acid Insoluble ","02SD23"]
["Sand, 703.02 Concrete ","02SD2"]
["Sand, 703.02 Concrete, Acid Insoluble ","02SD23"]
["No. 8 Agg, 703.02 Concrete, Mod Grading (Gravel)","02008M"]
["No. 8 Agg, 703.02 Super-Structure (Limestone)",20080]
["No. 8 Agg, 703.02 Concrete Overlay (Limestone)",20081]
["No. 8 Agg, 703.02 Concrete (Limestone)",2008]
["No. 57 Agg, 703.02 Super-Structure (Limestone)",20570]
["No. 57 Agg, 703.13 Freeze-Thaw (Limestone)",20572]
["No. 57 Agg, 703.02 Concrete (Limestone)",2057]
["No. 8 Agg, 703.02 Concrete Overlay (Limestone)",20081]
["No. 8 Agg, 703.02 Concrete (Limestone)",2008]
["No. 8 Agg, 703.02 Super-Structure (Limestone)",20080]
["No. 57 Agg, 703.02 Concrete (Limestone)",2057]
["No. 57 Agg, 703.02 Super-Structure (Limestone)",20570]
["No. 8 Agg, 703.02 Concrete (Gravel)",2008]
["No. 8 Agg, 703.02 Super-Structure (Gravel)",20080]
["Sand, 703.02 Concrete ","02SD2"]
["Sand, 703.02 Concrete, Acid Insoluble ","02SD23"]
["No. 57 Agg, 703.02 Super-Structure (Gravel)",20570]
["No. 57 Agg, 703.02 Concrete (Gravel)",2057]
["No. 57 Agg, 703.13 Freeze-Thaw (Gravel)",20572]
["Sand, 703.02 Concrete ","02SD2"]
["Sand, 703.02 Concrete ","02SD2"]
["Sand, 703.02 Concrete, Acid Insoluble ","02SD23"]
["No. 57 Agg, 703.02 Concrete (Gravel)",2057]
["Sand, 703.02 Concrete ","02SD2"]
["Sand, 703.02 Concrete, Acid Insoluble ","02SD23"]
["Sand, 703.02 Concrete ","02SD2"]
["Sand, 703.02 Concrete, Acid Insoluble ","02SD23"]
["No. 57 Agg, 703.02 Concrete (Gravel)",2057]
["Sand, 703.02 Concrete ","02SD2"]
["No. 57 Agg, 703.13 Freeze-Thaw (Gravel)",20572]
["Sand, 703.02 Concrete ","02SD2"]
["Sand, 703.02 Concrete, Acid Insoluble ","02SD23"]
["No. 8 Agg, 703.02 Concrete (Gravel)",2008]
["No. 8 Agg, 703.02 Super-Structure (Gravel)",20080]
["Sand, 703.02 Concrete ","02SD2"]
["Sand, 703.02 Concrete, Acid Insoluble ","02SD23"]
["No. 57 Agg, 703.02 Super-Structure (Gravel)",20570]
["No. 57 Agg, 703.02 Concrete (Gravel)",2057]
["No. 57 Agg, 703.13 Freeze-Thaw (Gravel)",20572]
["No. 8 Agg, 703.02 Concrete (Gravel)",2008]
["Sand, 703.02 Concrete ","02SD2"]
["Sand, 703.02 Concrete, Acid Insoluble ","02SD23"]
["No. 57 Agg, 703.02 Concrete (Gravel)",2057]
["No. 9 Agg, 703.02 Concrete, Mod Grading (Gravel)","02009M"]
["Sand, 703.02 Concrete, Mod Grading ","02SD2M"]
["Sand, 703.02 Concrete ","02SD2"]
["Sand, 703.02 Concrete, Acid Insoluble ","02SD23"]
["No. 8 Agg, 703.02 Concrete (Gravel)",2008]
["No. 8 Agg, 703.02 Concrete (Limestone)",2008]
["No. 8 Agg, 703.02 Concrete Overlay (Limestone)",20081]
["No. 8 Agg, 703.02 Super-Structure (Limestone)",20080]
["No. 57 Agg, 703.02 Concrete (Limestone)",2057]
["No. 57 Agg, 703.02 Super-Structure (Limestone)",20570]
["No. 57 Agg, 703.13 Freeze-Thaw (Limestone)",20572]
["No. 57 Agg, 703.13 Freeze-Thaw (Limestone)",20572]
["No. 8 Agg, 703.02 Concrete (Limestone)",2008]
["No. 57 Agg, 703.02 Concrete (Limestone)",2057]
["No. 8 Agg, 703.02 Concrete Overlay (Dolostone)",20081]
["No. 8 Agg, 703.02 Concrete (Dolostone)",2008]
["No. 8 Agg, 703.02 Super-Structure (Dolostone)",20080]
["No. 57 Agg, 703.02 Concrete (Dolostone)",2057]
["No. 57 Agg, 703.02 Super-Structure (Dolostone)",20570]
["No. 57 Agg, 703.13 Freeze-Thaw (Dolostone)",20572]
["No. 357 Agg, 703.02 Concrete (Dolostone)",2357]
["No. 8 Agg, 703.02 Concrete (Limestone)",2008]
["No. 8 Agg, 703.02 Concrete Overlay (Limestone)",20081]
["No. 8 Agg, 703.02 Super-Structure (Limestone)",20080]
["No. 57 Agg, 703.02 Concrete (Limestone)",2057]
["No. 57 Agg, 703.02 Super-Structure (Limestone)",20570]
["No. 57 Agg, 703.13 Freeze-Thaw (Limestone)",20572]
["No. 57 Agg, 703.02 Concrete (Dolostone)",2057]
["No. 57 Agg, 703.02 Super-Structure (Dolostone)",20570]
["No. 57 Agg, 703.02 Super-Structure (Dolostone)",20570]
["No. 57 Agg, 703.02 Concrete (Dolostone)",2057]
["No. 57 Agg, 703.13 Freeze-Thaw (Dolostone)",20572]
["No. 8 Agg, 703.02 Concrete (Limestone)",2008]
["No. 8 Agg, 703.02 Concrete Overlay (Limestone)",20081]
["No. 8 Agg, 703.02 Super-Structure (Limestone)",20080]
["No. 57 Agg, 703.13 Freeze-Thaw (Limestone)",20572]
["No. 57 Agg, 703.02 Concrete (Limestone)",2057]
["No. 57 Agg, 703.02 Super-Structure (Limestone)",20570]
["No. 8 Agg, 703.02 Concrete (Limestone)",2008]
["No. 8 Agg, 703.02 Concrete Overlay (Limestone)",20081]
["No. 8 Agg, 703.02 Super-Structure (Limestone)",20080]
["No. 57 Agg, 703.13 Freeze-Thaw (Limestone)",20572]
["No. 57 Agg, 703.02 Concrete (Limestone)",2057]
["No. 57 Agg, 703.02 Super-Structure (Limestone)",20570]
["No. 8 Agg, 703.02 Concrete (Limestone)",2008]
["No. 57 Agg, 703.02 Concrete (Limestone)",2057]
["No. 57 Agg, 703.02 Super-Structure (Limestone)",20570]
["No. 57 Agg, 703.13 Freeze-Thaw (Limestone)",20572]
["Sand, 703.02 Concrete ","02SD2"]
["Sand, 703.02 Concrete ","02SD2"]
["No. 57 Agg, 703.02 Concrete (Limestone)",2057]
["No. 57 Agg, 703.02 Super-Structure (Limestone)",20570]
["No. 8 Agg, 703.02 Super-Structure (Limestone)",20080]
["No. 8 Agg, 703.02 Concrete (Limestone)",2008]
["No. 57 Agg, 703.13 Freeze-Thaw (Limestone)",20572]
["No. 67 Agg, 703.02 Concrete (Limestone)",2067]
["No. 8 Agg, 703.02 Concrete (Limestone)",2008]
["No. 57 Agg, 703.13 Freeze-Thaw (Limestone)",20572]
["No. 57 Agg, 703.02 Concrete (Limestone)",2057]
["Sand, 703.02 Concrete ","02SD2"]
["Sand, 703.02 Concrete ","02SD2"]
["Sand, 703.02 Concrete ","02SD2"]
["Sand, 703.02 Concrete ","02SD2"]
["No. 57 Agg, 703.02 Concrete (Slag (ACBF))",2057]
["No. 57 Agg, 703.02 Super-Structure (Slag (ACBF))",20570]
["No. 57 Agg, 703.13 Freeze-Thaw (Slag (ACBF))",20572]
["Sand, 703.02 Concrete ","02SD2"]
["Sand, 703.02 Concrete ","02SD2"]
["Sand, 703.02 Concrete, Acid Insoluble ","02SD23"]
["No. 57 Agg, 703.02 Concrete (Limestone)",2057]
["No. 8 Agg, 703.02 Concrete (Limestone)",2008]
["No. 8 Agg, 703.02 Super-Structure (Limestone)",20080]
["No. 57 Agg, 703.02 Super-Structure (Limestone)",20570]
["No. 57 Agg, 703.02 Concrete (Limestone)",2057]
["No. 57 Agg, 703.02 Concrete (Gravel)",2057]
["Sand, 703.02 Concrete ","02SD2"]
["No. 57 Agg, 703.13 Freeze-Thaw (Gravel)",20572]
["Sand, 703.02 Concrete ","02SD2"]
["No. 8 Agg, 703.02 Concrete (Gravel)",2008]
["Sand, 703.02 Concrete ","02SD2"]
["Sand, 703.02 Concrete, Acid Insoluble ","02SD23"]
["No. 57 Agg, 703.02 Concrete (Gravel)",2057]
["Sand, 703.02 Concrete ","02SD2"]
["Sand, 703.02 Concrete, Acid Insoluble ","02SD23"]
["No. 8 Agg, 703.02 Concrete (Gravel)",2008]
["No. 57 Agg, 703.13 Freeze-Thaw (Gravel)",20572]
["No. 57 Agg, 703.02 Super-Structure (Gravel)",20570]
["No. 8 Agg, 703.02 Concrete (Gravel)",2008]
["No. 8 Agg, 703.02 Super-Structure (Gravel)",20080]
["Sand, 703.02 Concrete ","02SD2"]
["No. 57 Agg, 703.02 Super-Structure (Gravel)",20570]
["No. 57 Agg, 703.02 Concrete (Gravel)",2057]
["No. 8 Agg, 703.02 Concrete (Gravel)",2008]
["No. 8 Agg, 703.02 Super-Structure (Gravel)",20080]
["No. 57 Agg, 703.02 Concrete (Gravel)",2057]
["Sand, 703.02 Concrete ","02SD2"]
["No. 57 Agg, 703.02 Super-Structure (Gravel)",20570]
["No. 8 Agg, 703.02 Concrete (Gravel)",2008]
["Sand, 703.02 Concrete ","02SD2"]
["Sand, 703.02 Concrete, Acid Insoluble ","02SD23"]
["No. 57 Agg, 703.02 Super-Structure (Gravel)",20570]
["No. 57 Agg, 703.02 Concrete (Gravel)",2057]
["No. 8 Agg, 703.02 Concrete (Gravel)",2008]
["Sand, 703.02 Concrete ","02SD2"]
["No. 57 Agg, 703.02 Super-Structure (Gravel)",20570]
["No. 57 Agg, 703.02 Concrete (Gravel)",2057]
["No. 57 Agg, 703.13 Freeze-Thaw (Gravel)",20572]
["No. 57 Agg, 703.13 Freeze-Thaw (Dolostone)",20572]
["No. 57 Agg, 703.02 Super-Structure (Dolostone)",20570]
["No. 57 Agg, 703.02 Concrete (Dolostone)",2057]
["No. 8 Agg, 703.02 Concrete (Dolostone)",2008]
["No. 8 Agg, 703.02 Super-Structure (Dolostone)",20080]
["Sand, 703.02 Concrete ","02SD2"]
["Sand, 703.02 Concrete, Acid Insoluble ","02SD23"]
["No. 57 Agg, 703.02 Concrete (Gravel)",2057]
["Sand, 703.02 Concrete ","02SD2"]
["No. 57 Agg, 703.02 Super-Structure (Gravel)",20570]
["No. 8 Agg, 703.02 Concrete (Gravel)",2008]
["No. 8 Agg, 703.02 Super-Structure (Gravel)",20080]
["Sand, 703.02 Concrete ","02SD2"]
["No. 57 Agg, 703.02 Concrete (Gravel)",2057]
["No. 8 Agg, 703.02 Concrete (Gravel)",2008]
["No. 57 Agg, 703.02 Concrete (Gravel)",2057]
["Sand, 703.02 Concrete ","02SD2"]
["No. 57 Agg, 703.13 Freeze-Thaw (Gravel)",20572]
["No. 8 Agg, 703.02 Concrete (Limestone)",2008]
["No. 57 Agg, 703.13 Freeze-Thaw (Limestone)",20572]
["No. 57 Agg, 703.02 Concrete (Limestone)",2057]
["No. 57 Agg, 703.02 Super-Structure (Limestone)",20570]
["No. 8 Agg, 703.02 Super-Structure (Limestone)",20080]
["No. 57 Agg, 703.02 Concrete (Gravel)",2057]
["Sand, 703.02 Concrete ","02SD2"]
["No. 57 Agg, 703.13 Freeze-Thaw (Gravel)",20572]
["Sand, 703.02 Concrete ","02SD2"]
["Sand, 703.02 Concrete, Acid Insoluble ","02SD23"]
["Sand, 703.02 Concrete ","02SD2"]
["Sand, 703.02 Concrete ","02SD2"]
["Sand, 703.02 Concrete, Acid Insoluble ","02SD23"]

{"sheet":"AGG PRODR LIST","index":13,"n_rows":226,"n_cols":10,"rows_kept":226,"cut":false,"hidden":true,"merged":[[2,3,7,6]]}
[{"$f":"I1&\" (\"&J1&\")\"","v":"Allegheny Mineral - Harrisville, PA (43085-01)"},{"$f":"J1","v":"43085-01"},null,null,null,null,null,null,"Allegheny Mineral - Harrisville, PA","43085-01"]
["Allegheny Mineral - Slippery Rock, PA (43076-01)","43076-01",null,null,null,null,null,null,"Allegheny Mineral - Slippery Rock, PA","43076-01"]
["Allied Corp. - Massillon, OH (43039-01)","43039-01",null,"INSERT QUERY OVERTOP VALUES ON THE RIGHT\n->>>",null,null,null,null,"Allied Corp. - Massillon, OH","43039-01"]
["American S&G - Massillon, OH (43003-01)","43003-01",null,null,null,null,null,null,"American S&G - Massillon, OH","43003-01"]
["Arch Materials - Batavia, OH (47091-01)","47091-01",null,null,null,null,null,null,"Arch Materials - Batavia, OH","47091-01"]
["Area Aggregates - Woodville, OH (41063-01)","41063-01",null,null,null,null,null,null,"Area Aggregates - Woodville, OH","41063-01"]
["Ballentine Sand & Gravel - Ravenna, OH (43078-01)","43078-01",null,null,null,null,null,null,"Ballentine Sand & Gravel - Ravenna, OH","43078-01"]
["Barrett Paving - Fairborn, OH (46008-01)","46008-01",null,null,null,null,null,null,"Barrett Paving - Fairborn, OH","46008-01"]
["Barrett Paving - Richmond, IN (47047-01)","47047-01",null,null,null,null,null,null,"Barrett Paving - Richmond, IN","47047-01"]
["Barrett Paving Materials - Miamisburg, OH (46013-01)","46013-01",null,null,null,null,null,null,"Barrett Paving Materials - Miamisburg, OH","46013-01"]
["Barrett Paving Materials - Sidney, OH (46024-01)","46024-01",null,null,null,null,null,null,"Barrett Paving Materials - Sidney, OH","46024-01"]
["Barrett Paving Materials - Sidney, OH (46023B-01)","46023B-01",null,null,null,null,null,null,"Barrett Paving Materials - Sidney, OH","46023B-01"]
["BCE Materials - Wheelersburg, OH (48003-01)","48003-01",null,null,null,null,null,null,"BCE Materials - Wheelersburg, OH","48003-01"]
["Beck Sand & Gravel - Ravenna, OH (43005-01)","43005-01",null,null,null,null,null,null,"Beck Sand & Gravel - Ravenna, OH","43005-01"]
["Belpre S&G - Little Hocking, OH (49050-01)","49050-01",null,null,null,null,null,null,"Belpre S&G - Little Hocking, OH","49050-01"]
["C.F. Poeppelman - Bradford, OH (46031-01)","46031-01",null,null,null,null,null,null,"C.F. Poeppelman - Bradford, OH","46031-01"]
["Cardinal Agg - Perrysburg, OH (41058-01)","41058-01",null,null,null,null,null,null,"Cardinal Agg - Perrysburg, OH","41058-01"]
["Carmeuse - Butler, KY (47041-01)","47041-01",null,null,null,null,null,null,"Carmeuse - Butler, KY","47041-01"]
["Carmeuse - Cedarville, MI (51015-01)","51015-01",null,null,null,null,null,null,"Carmeuse - Cedarville, MI","51015-01"]
["Carmeuse - Gulliver, MI (51006-01)","51006-01",null,null,null,null,null,null,"Carmeuse - Gulliver, MI","51006-01"]
["Carmeuse - Maysville, KY (48028-01)","48028-01",null,null,null,null,null,null,"Carmeuse - Maysville, KY","48028-01"]
["Carmeuse - Rogers City, MI (51016-01)","51016-01",null,null,null,null,null,null,"Carmeuse - Rogers City, MI","51016-01"]
["Clark Clay - Newcomerstown, OH (44038-01)","44038-01",null,null,null,null,null,null,"Clark Clay - Newcomerstown, OH","44038-01"]
["Clifford Aggregate - Angola, IN (41061-01)","41061-01",null,null,null,null,null,null,"Clifford Aggregate - Angola, IN","41061-01"]
["Clifford Aggregate - Wolcottville, IN (41062-01)","41062-01",null,null,null,null,null,null,"Clifford Aggregate - Wolcottville, IN","41062-01"]
["Coshocton Materials - Coshocton, OH (44039-01)","44039-01",null,null,null,null,null,null,"Coshocton Materials - Coshocton, OH","44039-01"]
["D & K Materials - Mogadore, OH (43097-01)","43097-01",null,null,null,null,null,null,"D & K Materials - Mogadore, OH","43097-01"]
["Drummond Isle Stone - Drummond, MI (51011-01)","51011-01",null,null,null,null,null,null,"Drummond Isle Stone - Drummond, MI","51011-01"]
["Duff Quarry - Huntsville, OH (46038-01)","46038-01",null,null,null,null,null,null,"Duff Quarry - Huntsville, OH","46038-01"]
["Eagle Materials - Germantown, OH (47030-01)","47030-01",null,null,null,null,null,null,"Eagle Materials - Germantown, OH","47030-01"]
["Enon S & G - Springfield, OH (46011-01)","46011-01",null,null,null,null,null,null,"Enon S & G - Springfield, OH","46011-01"]
["Erie Materials - Sandusky, OH (42006-01)","42006-01",null,null,null,null,null,null,"Erie Materials - Sandusky, OH","42006-01"]
["Ervin Hill - Hillsboro, OH (48039-01)","48039-01",null,null,null,null,null,null,"Ervin Hill - Hillsboro, OH","48039-01"]
["Evans S & G - Cincinnati, OH (47088-01)","47088-01",null,null,null,null,null,null,"Evans S & G - Cincinnati, OH","47088-01"]
["Feikert S & G - Fredericksburg, OH (50009-01)","50009-01",null,null,null,null,null,null,"Feikert S & G - Fredericksburg, OH","50009-01"]
["Gerken - Addison, MI (41022-01)","41022-01",null,null,null,null,null,null,"Gerken - Addison, MI","41022-01"]
["Gerken - Bluffton, OH (40001-01)","40001-01",null,null,null,null,null,null,"Gerken - Bluffton, OH","40001-01"]
["Gerken - Clinton, MI (41028-01)","41028-01",null,null,null,null,null,null,"Gerken - Clinton, MI","41028-01"]
["Gerken - Custar, OH (41013A-01)","41013A-01",null,null,null,null,null,null,"Gerken - Custar, OH","41013A-01"]
["Gerken - Genoa, OH (41018-01)","41018-01",null,null,null,null,null,null,"Gerken - Genoa, OH","41018-01"]
["Gerken - Glacial S&G, MI (41056-01)","41056-01",null,null,null,null,null,null,"Gerken - Glacial S&G, MI","41056-01"]
["Gerken - Paulding, OH (40002-01)","40002-01",null,null,null,null,null,null,"Gerken - Paulding, OH","40002-01"]
["Gerken - Tecumseh, MI (41059-01)","41059-01",null,null,null,null,null,null,"Gerken - Tecumseh, MI","41059-01"]
["Gerken - Waldron, OH (41020-01)","41020-01",null,null,null,null,null,null,"Gerken - Waldron, OH","41020-01"]
["Gerken - Waldron, OH (41020A-01)","41020A-01",null,null,null,null,null,null,"Gerken - Waldron, OH","41020A-01"]
["Gerken - West Millgrove, OH (41008-01)","41008-01",null,null,null,null,null,null,"Gerken - West Millgrove, OH","41008-01"]
["Heidelberg Material Midwest Agg. - Cleves, OH (47072-01)","47072-01",null,null,null,null,null,null,"Heidelberg Material Midwest Agg. - Cleves, OH","47072-01"]
["Heidelberg Materials - Bessemer, PA (43011-01)","43011-01",null,null,null,null,null,null,"Heidelberg Materials - Bessemer, PA","43011-01"]
["Heidelberg Materials - Bloomville, OH (41014-01)","41014-01",null,null,null,null,null,null,"Heidelberg Materials - Bloomville, OH","41014-01"]
["Heidelberg Materials - Castalia, OH (42005C-01)","42005C-01",null,null,null,null,null,null,"Heidelberg Materials - Castalia, OH","42005C-01"]
["Heidelberg Materials - Castalia, OH (42005D-01)","42005D-01",null,null,null,null,null,null,"Heidelberg Materials - Castalia, OH","42005D-01"]
["Heidelberg Materials - Connellsville, PA (50076-01)","50076-01",null,null,null,null,null,null,"Heidelberg Materials - Connellsville, PA","50076-01"]
["Heidelberg Materials - Grayson, KY (48037A-01)","48037A-01",null,null,null,null,null,null,"Heidelberg Materials - Grayson, KY","48037A-01"]
["Heidelberg Materials - Peebles, OH (48020-01)","48020-01",null,null,null,null,null,null,"Heidelberg Materials - Peebles, OH","48020-01"]
["Heidelberg Materials - Sandusky, OH (42004A-01)","42004A-01",null,null,null,null,null,null,"Heidelberg Materials - Sandusky, OH","42004A-01"]
["Heidelberg Materials - Sylvania, OH (41011-01)","41011-01",null,null,null,null,null,null,"Heidelberg Materials - Sylvania, OH","41011-01"]
["Heidelberg Materials - Versailles, IN (47076-01)","47076-01",null,null,null,null,null,null,"Heidelberg Materials - Versailles, IN","47076-01"]
["Heidelberg Materials - Waterville, OH (41010-01)","41010-01",null,null,null,null,null,null,"Heidelberg Materials - Waterville, OH","41010-01"]
["Heidelberg Materials - Winchester, OH (48033-01)","48033-01",null,null,null,null,null,null,"Heidelberg Materials - Winchester, OH","48033-01"]
["Heidelberg Materials - Woodburn, IN (40025-01)","40025-01",null,null,null,null,null,null,"Heidelberg Materials - Woodburn, IN","40025-01"]
["Heidelberg Materials Midwest Agg. - Angola, IN (41039-01)","41039-01",null,null,null,null,null,null,"Heidelberg Materials Midwest Agg. - Angola, IN","41039-01"]
["Heidelberg Materials Midwest Agg. - Piketon, OH (48011-01)","48011-01",null,null,null,null,null,null,"Heidelberg Materials Midwest Agg. - Piketon, OH","48011-01"]
["Hilltop Basic - Battletown, KY (47071-01)","47071-01",null,null,null,null,null,null,"Hilltop Basic - Battletown, KY","47071-01"]
["Hilltop Basic - Butler, KY (47083-01)","47083-01",null,null,null,null,null,null,"Hilltop Basic - Butler, KY","47083-01"]
[{"$f":"I65&\" (\"&J65&\")\"","v":"Hilltop Basic - Patriot, IN (47019-01)"},{"$f":"J65","v":"47019-01"},null,null,null,null,null,null,"Hilltop Basic - Patriot, IN","47019-01"]
["Hilltop Basic - Patriot, IN (47019A-01)","47019A-01",null,null,null,null,null,null,"Hilltop Basic - Patriot, IN","47019A-01"]
["Hocking Valley Concrete - Logan, OH (49027-01)","49027-01",null,null,null,null,null,null,"Hocking Valley Concrete - Logan, OH","49027-01"]
["Holcim - Manitoulin, ON (51014-01)","51014-01",null,null,null,null,null,null,"Holcim - Manitoulin, ON","51014-01"]
["Holcim - Marblehead, OH (41005-01)","41005-01",null,null,null,null,null,null,"Holcim - Marblehead, OH","41005-01"]
["Holcim - Presque Isle, MI (51009-01)","51009-01",null,null,null,null,null,null,"Holcim - Presque Isle, MI","51009-01"]
["Holcim - West Mifflin, PA (43063-01)","43063-01",null,null,null,null,null,null,"Holcim - West Mifflin, PA","43063-01"]
["Holmes Redimix Concrete - Millersburg, OH (50017-01)","50017-01",null,null,null,null,null,null,"Holmes Redimix Concrete - Millersburg, OH","50017-01"]
["Holmes Redimix Concrete - Millersburg, OH (50017C-01)","50017C-01",null,null,null,null,null,null,"Holmes Redimix Concrete - Millersburg, OH","50017C-01"]
["Holmes Supply - Holmesville, OH (50057-01)","50057-01",null,null,null,null,null,null,"Holmes Supply - Holmesville, OH","50057-01"]
["Hugo Sand Company - Kent, OH (43015-01)","43015-01",null,null,null,null,null,null,"Hugo Sand Company - Kent, OH","43015-01"]
["Irving Materials - Cambridge City, IN (47092-01)","47092-01",null,null,null,null,null,null,"Irving Materials - Cambridge City, IN","47092-01"]
["Irving Materials - Connersville, IN (47050-01)","47050-01",null,null,null,null,null,null,"Irving Materials - Connersville, IN","47050-01"]
["Kirby S&G - Upper Sandusky, OH (40023-01)","40023-01",null,null,null,null,null,null,"Kirby S&G - Upper Sandusky, OH","40023-01"]
["Kirby S&G - Upper Sandusky, OH (40023B-01)","40023B-01",null,null,null,null,null,null,"Kirby S&G - Upper Sandusky, OH","40023B-01"]
["Lakeside Sand & Gravel - Mantua, OH (43020-01)","43020-01",null,null,null,null,null,null,"Lakeside Sand & Gravel - Mantua, OH","43020-01"]
["Latham Limestone - Latham, OH (48018-01)","48018-01",null,null,null,null,null,null,"Latham Limestone - Latham, OH","48018-01"]
["Letart - Gallipolis Ferry, WV (49012-01)","49012-01",null,null,null,null,null,null,"Letart - Gallipolis Ferry, WV","49012-01"]
["Maple Grove Materials - Tiffin, OH (41007-01)","41007-01",null,null,null,null,null,null,"Maple Grove Materials - Tiffin, OH","41007-01"]
["Martin Marietta - Brookville, OH (46004-01)","46004-01",null,null,null,null,null,null,"Martin Marietta - Brookville, OH","46004-01"]
["Martin Marietta - Cedarville, OH (47037-01)","47037-01",null,null,null,null,null,null,"Martin Marietta - Cedarville, OH","47037-01"]
["Martin Marietta - Fairborn, OH (46001-01)","46001-01",null,null,null,null,null,null,"Martin Marietta - Fairborn, OH","46001-01"]
["Martin Marietta - Fairfield, OH (47003-01)","47003-01",null,null,null,null,null,null,"Martin Marietta - Fairfield, OH","47003-01"]
["Martin Marietta - Hamilton, OH (47008-01)","47008-01",null,null,null,null,null,null,"Martin Marietta - Hamilton, OH","47008-01"]
["Martin Marietta - North Bend, OH (47049-01)","47049-01",null,null,null,null,null,null,"Martin Marietta - North Bend, OH","47049-01"]
["Martin Marietta - Petersburg, KY (47082-01)","47082-01",null,null,null,null,null,null,"Martin Marietta - Petersburg, KY","47082-01"]
["Martin Marietta - Petroleum, WV (49054-01)","49054-01",null,null,null,null,null,null,"Martin Marietta - Petroleum, WV","49054-01"]
["Martin Marietta - Racine, OH (49015-01)","49015-01",null,null,null,null,null,null,"Martin Marietta - Racine, OH","49015-01"]
["Martin Marietta - Spring Valley, OH (47084-01)","47084-01",null,null,null,null,null,null,"Martin Marietta - Spring Valley, OH","47084-01"]
["Martin Marietta - Trenton, OH (47026-01)","47026-01",null,null,null,null,null,null,"Martin Marietta - Trenton, OH","47026-01"]
["Martin Marietta - Troy, OH (46007-01)","46007-01",null,null,null,null,null,null,"Martin Marietta - Troy, OH","46007-01"]
["Martin Marietta - Xenia, OH (47011-01)","47011-01",null,null,null,null,null,null,"Martin Marietta - Xenia, OH","47011-01"]
["Mar-Zane Materials - Chillicothe, OH (48007-01)","48007-01",null,null,null,null,null,null,"Mar-Zane Materials - Chillicothe, OH","48007-01"]
["Mar-Zane Materials - Haydenville, OH (49003-01)","49003-01",null,null,null,null,null,null,"Mar-Zane Materials - Haydenville, OH","49003-01"]
["Mar-Zane Materials - Logan, OH (49059A-01)","49059A-01",null,null,null,null,null,null,"Mar-Zane Materials - Logan, OH","49059A-01"]
["Mar-Zane Materials - Perrysville, OH (42012A-01)","42012A-01",null,null,null,null,null,null,"Mar-Zane Materials - Perrysville, OH","42012A-01"]
["Mar-Zane Materials - Ravenna, OH (43073A-01)","43073A-01",null,null,null,null,null,null,"Mar-Zane Materials - Ravenna, OH","43073A-01"]
["Mar-Zane Materials - Zanesville, OH (44016-01)","44016-01",null,null,null,null,null,null,"Mar-Zane Materials - Zanesville, OH","44016-01"]
["Massillon Materials - Bolivar, OH (50079-01)","50079-01",null,null,null,null,null,null,"Massillon Materials - Bolivar, OH","50079-01"]
["Massillon Materials - Massillon, OH (43052-01)","43052-01",null,null,null,null,null,null,"Massillon Materials - Massillon, OH","43052-01"]
["Mechanicsburg S & G - Mechanicsburg, OH (46037-01)","46037-01",null,null,null,null,null,null,"Mechanicsburg S & G - Mechanicsburg, OH","46037-01"]
["Melvin Stone - Circleville, OH (45026-01)","45026-01",null,null,null,null,null,null,"Melvin Stone - Circleville, OH","45026-01"]
["Melvin Stone - Corning, OH (44036-01)","44036-01",null,null,null,null,null,null,"Melvin Stone - Corning, OH","44036-01"]
["Melvin Stone - Middletown, OH (47007-01)","47007-01",null,null,null,null,null,null,"Melvin Stone - Middletown, OH","47007-01"]
["Melvin Stone - New Holland, OH (45011-01)","45011-01",null,null,null,null,null,null,"Melvin Stone - New Holland, OH","45011-01"]
["Melvin Stone - Sabina, OH (47077-01)","47077-01",null,null,null,null,null,null,"Melvin Stone - Sabina, OH","47077-01"]
["Melvin Stone - Washington Court House, OH (48036-01)","48036-01",null,null,null,null,null,null,"Melvin Stone - Washington Court House, OH","48036-01"]
["Melvin Stone - Wellston, OH (49007-01)","49007-01",null,null,null,null,null,null,"Melvin Stone - Wellston, OH","49007-01"]
["Melvin Stone Company - Wilmington, OH (47021-01)","47021-01",null,null,null,null,null,null,"Melvin Stone Company - Wilmington, OH","47021-01"]
["Miami View Mining - Morrow, OH (47023-01)","47023-01",null,null,null,null,null,null,"Miami View Mining - Morrow, OH","47023-01"]
["Milton Materials - Ludlow Falls, OH (46012-01)","46012-01",null,null,null,null,null,null,"Milton Materials - Ludlow Falls, OH","46012-01"]
["Mountain Materials (Brushy Creek) - Olive Hill, KY (48051-01)","48051-01",null,null,null,null,null,null,"Mountain Materials (Brushy Creek) - Olive Hill, KY","48051-01"]
["Mulzer Crushed Stone - Cape Sandy, IN (49032-01)","49032-01",null,null,null,null,null,null,"Mulzer Crushed Stone - Cape Sandy, IN","49032-01"]
["Mulzer Crushed Stone - Charlestown, IN (49033-01)","49033-01",null,null,null,null,null,null,"Mulzer Crushed Stone - Charlestown, IN","49033-01"]
["Mulzer Crushed Stone - Charlestown, IN (49033A-01)","49033A-01",null,null,null,null,null,null,"Mulzer Crushed Stone - Charlestown, IN","49033A-01"]
["Mulzer Crushed Stone - Mauckport, IN (47069-01)","47069-01",null,null,null,null,null,null,"Mulzer Crushed Stone - Mauckport, IN","47069-01"]
["National L&S - Bucyrus, OH (42002-01)","42002-01",null,null,null,null,null,null,"National L&S - Bucyrus, OH","42002-01"]
["National L&S - Delaware, OH (45005-01)","45005-01",null,null,null,null,null,null,"National L&S - Delaware, OH","45005-01"]
["National L&S - Lima, OH (40008B-01)","40008B-01",null,null,null,null,null,null,"National L&S - Lima, OH","40008B-01"]
["National L&S - Marion, OH (45012-01)","45012-01",null,null,null,null,null,null,"National L&S - Marion, OH","45012-01"]
["National L&S - Marion, OH (45012A-01)","45012A-01",null,null,null,null,null,null,"National L&S - Marion, OH","45012A-01"]
["National L&S - Ottawa, OH (40011-01)","40011-01",null,null,null,null,null,null,"National L&S - Ottawa, OH","40011-01"]
["National L&S - Rimer, OH (40027-01)","40027-01",null,null,null,null,null,null,"National L&S - Rimer, OH","40027-01"]
["National Lime & Stone - Carey, OH (40030-01)","40030-01",null,null,null,null,null,null,"National Lime & Stone - Carey, OH","40030-01"]
[{"$f":"I129&\" (\"&J129&\")\"","v":"National Lime & Stone - Chesterville, OH (45021-01)"},{"$f":"J129","v":"45021-01"},null,null,null,null,null,null,"National Lime & Stone - Chesterville, OH","45021-01"]
["National Lime & Stone - Findlay, OH (40007-01)","40007-01",null,null,null,null,null,null,"National Lime & Stone - Findlay, OH","40007-01"]
["National Lime & Stone - Lockbourne, OH (45041-01)","45041-01",null,null,null,null,null,null,"National Lime & Stone - Lockbourne, OH","45041-01"]
["National Lime & Stone - Upper Sandusky, OH (40019-01)","40019-01",null,null,null,null,null,null,"National Lime & Stone - Upper Sandusky, OH","40019-01"]
["National Lime & Stone - Wapakoneta, OH (46036B-01)","46036B-01",null,null,null,null,null,null,"National Lime & Stone - Wapakoneta, OH","46036B-01"]
["Neers S & G - Bellefontaine, OH (46029-01)","46029-01",null,null,null,null,null,null,"Neers S & G - Bellefontaine, OH","46029-01"]
["Northern Kentucky Aggregates - Petersburg, KY (47045-01)","47045-01",null,null,null,null,null,null,"Northern Kentucky Aggregates - Petersburg, KY","47045-01"]
["Northern Kentucky Aggregates - Petersburg, KY (47045A-01)","47045A-01",null,null,null,null,null,null,"Northern Kentucky Aggregates - Petersburg, KY","47045A-01"]
["Oeder & Sons S & G - Lebanon, OH (47024-01)","47024-01",null,null,null,null,null,null,"Oeder & Sons S & G - Lebanon, OH","47024-01"]
["Olen Corp - Columbus, OH (45009-01)","45009-01",null,null,null,null,null,null,"Olen Corp - Columbus, OH","45009-01"]
["Olen Corp - Columbus, OH (45009A-01)","45009A-01",null,null,null,null,null,null,"Olen Corp - Columbus, OH","45009A-01"]
["Olen Corp - Columbus, OH (45038-01)","45038-01",null,null,null,null,null,null,"Olen Corp - Columbus, OH","45038-01"]
["Olen Corp - Fredericktown, OH (44020-01)","44020-01",null,null,null,null,null,null,"Olen Corp - Fredericktown, OH","44020-01"]
["Olen Corp - Fredericktown, OH (44020A-01)","44020A-01",null,null,null,null,null,null,"Olen Corp - Fredericktown, OH","44020A-01"]
["Olen Corp - St. Louisville, OH (44010-01)","44010-01",null,null,null,null,null,null,"Olen Corp - St. Louisville, OH","44010-01"]
["Olen Corp - Upper Sandusky, OH (40004B-01)","40004B-01",null,null,null,null,null,null,"Olen Corp - Upper Sandusky, OH","40004B-01"]
["Olen Corp - Wooster, OH (42015-01)","42015-01",null,null,null,null,null,null,"Olen Corp - Wooster, OH","42015-01"]
["Ontario Trap Rock - Ontario, Canada (41044-01)","41044-01",null,null,null,null,null,null,"Ontario Trap Rock - Ontario, Canada","41044-01"]
["Oscar Brugmann Sand & Gravel - Mantua, OH (43006-01)","43006-01",null,null,null,null,null,null,"Oscar Brugmann Sand & Gravel - Mantua, OH","43006-01"]
["Oster S & G - Massillon, OH (43025-01)","43025-01",null,null,null,null,null,null,"Oster S & G - Massillon, OH","43025-01"]
["Phillips Companies - Vandalia, OH (46014-01)","46014-01",null,null,null,null,null,null,"Phillips Companies - Vandalia, OH","46014-01"]
["Phillips Companies - Xenia, OH (47025-01)","47025-01",null,null,null,null,null,null,"Phillips Companies - Xenia, OH","47025-01"]
["Phoenix Asphalt - Magnolia, OH (50064-01)","50064-01",null,null,null,null,null,null,"Phoenix Asphalt - Magnolia, OH","50064-01"]
["Piqua Materials - Piqua, OH (46015-01)","46015-01",null,null,null,null,null,null,"Piqua Materials - Piqua, OH","46015-01"]
["Precision Agg - Portage, OH (41033-01)","41033-01",null,null,null,null,null,null,"Precision Agg - Portage, OH","41033-01"]
["Riverside - Battletown, KY (49037-01)","49037-01",null,null,null,null,null,null,"Riverside - Battletown, KY","49037-01"]
["Rootstown S & G - Ravenna, OH (43077-01)","43077-01",null,null,null,null,null,null,"Rootstown S & G - Ravenna, OH","43077-01"]
["Rupp Construction - Marshallville, OH (42014-01)","42014-01",null,null,null,null,null,null,"Rupp Construction - Marshallville, OH","42014-01"]
["Shelly Materials - Belle Center, OH (46026-01)","46026-01",null,null,null,null,null,null,"Shelly Materials - Belle Center, OH","46026-01"]
["Shelly Materials - Chillicothe, OH (48004-01)","48004-01",null,null,null,null,null,null,"Shelly Materials - Chillicothe, OH","48004-01"]
["Shelly Materials - Coshocton, OH (44003-01)","44003-01",null,null,null,null,null,null,"Shelly Materials - Coshocton, OH","44003-01"]
["Shelly Materials - Dresden, OH (44002-01)","44002-01",null,null,null,null,null,null,"Shelly Materials - Dresden, OH","44002-01"]
["Shelly Materials - East Fultonham, OH (44013A-01)","44013A-01",null,null,null,null,null,null,"Shelly Materials - East Fultonham, OH","44013A-01"]
["Shelly Materials - Forest, OH (40020-01)","40020-01",null,null,null,null,null,null,"Shelly Materials - Forest, OH","40020-01"]
["Shelly Materials - Grove City, OH (45003-01)","45003-01",null,null,null,null,null,null,"Shelly Materials - Grove City, OH","45003-01"]
["Shelly Materials - Hilliard, OH (45004-01)","45004-01",null,null,null,null,null,null,"Shelly Materials - Hilliard, OH","45004-01"]
["Shelly Materials - Hilliard, OH (45004A-01)","45004A-01",null,null,null,null,null,null,"Shelly Materials - Hilliard, OH","45004A-01"]
["Shelly Materials - Lockbourne, OH (45043-01)","45043-01",null,null,null,null,null,null,"Shelly Materials - Lockbourne, OH","45043-01"]
["Shelly Materials - Marietta, OH (49048-01)","49048-01",null,null,null,null,null,null,"Shelly Materials - Marietta, OH","49048-01"]
["Shelly Materials - Mechanicsburg, OH (46053-01)","46053-01",null,null,null,null,null,null,"Shelly Materials - Mechanicsburg, OH","46053-01"]
["Shelly Materials - Ostrander, OH (45019-01)","45019-01",null,null,null,null,null,null,"Shelly Materials - Ostrander, OH","45019-01"]
["Shelly Materials - Portland, OH (49058-01)","49058-01",null,null,null,null,null,null,"Shelly Materials - Portland, OH","49058-01"]
["Shelly Materials - Reedsville, OH (49045-01)","49045-01",null,null,null,null,null,null,"Shelly Materials - Reedsville, OH","49045-01"]
["Shelly Materials - St. Louisville, OH (44007-01)","44007-01",null,null,null,null,null,null,"Shelly Materials - St. Louisville, OH","44007-01"]
["Shelly Materials - Streetsboro, OH (43016-01)","43016-01",null,null,null,null,null,null,"Shelly Materials - Streetsboro, OH","43016-01"]
["Shelly Materials - West Mansfield, OH (45013-01)","45013-01",null,null,null,null,null,null,"Shelly Materials - West Mansfield, OH","45013-01"]
["Shelly Materials- Grove City, OH (45002-01)","45002-01",null,null,null,null,null,null,"Shelly Materials- Grove City, OH","45002-01"]
["Sidwell Materials - New Philadelphia, OH (50029-01)","50029-01",null,null,null,null,null,null,"Sidwell Materials - New Philadelphia, OH","50029-01"]
["Simak Trucking & Excavating - North Kingsville, OH (43080-01)","43080-01",null,null,null,null,null,null,"Simak Trucking & Excavating - North Kingsville, OH","43080-01"]
["Smalls S & G - Gambier, OH (44019-01)","44019-01",null,null,null,null,null,null,"Smalls S & G - Gambier, OH","44019-01"]
["Smelter Bay Sand - Marysville, MI (41026-01)","41026-01",null,null,null,null,null,null,"Smelter Bay Sand - Marysville, MI","41026-01"]
["Soehnlen Brothers Sand & Gravel - Beach City, OH (50069-01)","50069-01",null,null,null,null,null,null,"Soehnlen Brothers Sand & Gravel - Beach City, OH","50069-01"]
["SRM Materials - Germantown, OH (46050-01)","46050-01",null,null,null,null,null,null,"SRM Materials - Germantown, OH","46050-01"]
["Stafford Gravel - Butler, IN (41035-01)","41035-01",null,null,null,null,null,null,"Stafford Gravel - Butler, IN","41035-01"]
["Stocker Sand & Gravel - Gnadenhutten, OH (50038-01)","50038-01",null,null,null,null,null,null,"Stocker Sand & Gravel - Gnadenhutten, OH","50038-01"]
["Stocker Sand & Gravel - Gnadenhutten, OH (50075-01)","50075-01",null,null,null,null,null,null,"Stocker Sand & Gravel - Gnadenhutten, OH","50075-01"]
["Stone Street Quarries - Hoagland, IN (40036-01)","40036-01",null,null,null,null,null,null,"Stone Street Quarries - Hoagland, IN","40036-01"]
["Stoneco - Canton, OH (43007-01)","43007-01",null,null,null,null,null,null,"Stoneco - Canton, OH","43007-01"]
["Stoneco - Carey, OH (40017-01)","40017-01",null,null,null,null,null,null,"Stoneco - Carey, OH","40017-01"]
["Stoneco - Celina, OH (46022B-01)","46022B-01",null,null,null,null,null,null,"Stoneco - Celina, OH","46022B-01"]
["Stoneco - Clay Center, OH (41016-01)","41016-01",null,null,null,null,null,null,"Stoneco - Clay Center, OH","41016-01"]
["Stoneco - Convoy, OH (40013-01)","40013-01",null,null,null,null,null,null,"Stoneco - Convoy, OH","40013-01"]
["Stoneco - Maumee, OH (41023-01)","41023-01",null,null,null,null,null,null,"Stoneco - Maumee, OH","41023-01"]
["Stoneco - Maumee, OH (41023B-01)","41023B-01",null,null,null,null,null,null,"Stoneco - Maumee, OH","41023B-01"]
[{"$f":"I193&\" (\"&J193&\")\"","v":"Stoneco - Oakwood, OH (40012-01)"},{"$f":"J193","v":"40012-01"},null,null,null,null,null,null,"Stoneco - Oakwood, OH","40012-01"]
["Stoneco - Portage, OH (41003-01)","41003-01",null,null,null,null,null,null,"Stoneco - Portage, OH","41003-01"]
["Stoneco / Allied Corp - Petersburg, OH (43072-01)","43072-01",null,null,null,null,null,null,"Stoneco / Allied Corp - Petersburg, OH","43072-01"]
["Stoneco of Michigan - Ann Arbor (41060-01)","41060-01",null,null,null,null,null,null,"Stoneco of Michigan - Ann Arbor","41060-01"]
["Stoneco of Michigan - Horton, MI (41031-01)","41031-01",null,null,null,null,null,null,"Stoneco of Michigan - Horton, MI","41031-01"]
["Stoneco of Michigan - Ottawa Lake, MI (41032-01)","41032-01",null,null,null,null,null,null,"Stoneco of Michigan - Ottawa Lake, MI","41032-01"]
["Subtropolis Mining - Petersburg, OH (43094-01)","43094-01",null,null,null,null,null,null,"Subtropolis Mining - Petersburg, OH","43094-01"]
["Three Rivers Aggregates - Slippery Rock, PA (43075-01)","43075-01",null,null,null,null,null,null,"Three Rivers Aggregates - Slippery Rock, PA","43075-01"]
["Three Rivers Aggregates - Slippery Rock, PA (43095-01)","43095-01",null,null,null,null,null,null,"Three Rivers Aggregates - Slippery Rock, PA","43095-01"]
["Three Rivers Aggregates - Wampum, PA (43088-01)","43088-01",null,null,null,null,null,null,"Three Rivers Aggregates - Wampum, PA","43088-01"]
["Tiger S & G - Massillon, OH (43044-01)","43044-01",null,null,null,null,null,null,"Tiger S & G - Massillon, OH","43044-01"]
["TMS International / Stein LLC - Cleveland, OH (51047-01)","51047-01",null,null,null,null,null,null,"TMS International / Stein LLC - Cleveland, OH","51047-01"]
["Tow Path Materials - Chillicothe, OH (48050-01)","48050-01",null,null,null,null,null,null,"Tow Path Materials - Chillicothe, OH","48050-01"]
["Tow Path Materials - Lucasville, OH (48038-01)","48038-01",null,null,null,null,null,null,"Tow Path Materials - Lucasville, OH","48038-01"]
["U.S. Aggregates - Decatur, IN (40005-01)","40005-01",null,null,null,null,null,null,"U.S. Aggregates - Decatur, IN","40005-01"]
["U.S. Aggregates - Portland, IN (40032-01)","40032-01",null,null,null,null,null,null,"U.S. Aggregates - Portland, IN","40032-01"]
["U.S. Aggregates - Richmond, IN (47009-01)","47009-01",null,null,null,null,null,null,"U.S. Aggregates - Richmond, IN","47009-01"]
["United Agg - Danville, OH (44005-01)","44005-01",null,null,null,null,null,null,"United Agg - Danville, OH","44005-01"]
["United Agg - Mt. Vernon, OH (44009-01)","44009-01",null,null,null,null,null,null,"United Agg - Mt. Vernon, OH","44009-01"]
["Urbana Materials - Urbana, OH (46028-01)","46028-01",null,null,null,null,null,null,"Urbana Materials - Urbana, OH","46028-01"]
["Watson Gravel - Cleves, OH (47087-01)","47087-01",null,null,null,null,null,null,"Watson Gravel - Cleves, OH","47087-01"]
["Watson Gravel - Hamilton, OH (47029-01)","47029-01",null,null,null,null,null,null,"Watson Gravel - Hamilton, OH","47029-01"]
["Watson Gravel - Harrison, OH (47079-01)","47079-01",null,null,null,null,null,null,"Watson Gravel - Harrison, OH","47079-01"]
["Watson Gravel - Middletown, OH (47044-01)","47044-01",null,null,null,null,null,null,"Watson Gravel - Middletown, OH","47044-01"]
["Weber Materials - St. Mary's, OH (46032-01)","46032-01",null,null,null,null,null,null,"Weber Materials - St. Mary's, OH","46032-01"]
["Weber Sand & Gravel - Edgerton, OH (41017-01)","41017-01",null,null,null,null,null,null,"Weber Sand & Gravel - Edgerton, OH","41017-01"]
["Welch Sand & Gravel - Harrison, OH (47033-01)","47033-01",null,null,null,null,null,null,"Welch Sand & Gravel - Harrison, OH","47033-01"]
["Westfall Agg & Materials - Circleville, OH (45035-01)","45035-01",null,null,null,null,null,null,"Westfall Agg & Materials - Circleville, OH","45035-01"]
["William Albert - Coshocton, OH (44032-01)","44032-01",null,null,null,null,null,null,"William Albert - Coshocton, OH","44032-01"]
["Wylie & Sons Landscaping - Perrysburg, OH (41066-01)","41066-01",null,null,null,null,null,null,"Wylie & Sons Landscaping - Perrysburg, OH","41066-01"]
["Wysong Gravel - Camden, OH (47034-01)","47034-01",null,null,null,null,null,null,"Wysong Gravel - Camden, OH","47034-01"]
["Wysong Gravel - West Alexandria, OH (47036-01)","47036-01",null,null,null,null,null,null,"Wysong Gravel - West Alexandria, OH","47036-01"]
["XL S & G - Negley, OH (50039-01)","50039-01",null,null,null,null,null,null,"XL S & G - Negley, OH","50039-01"]
["Youngs S & G - Loudonville, OH (42001-01)","42001-01",null,null,null,null,null,null,"Youngs S & G - Loudonville, OH","42001-01"]

{"sheet":"AGG PROD LIST","index":14,"n_rows":226,"n_cols":10,"rows_kept":226,"cut":false,"hidden":true,"merged":[[2,3,7,6]]}
[{"$f":"I1&\" (\"&J1&\")\"","v":"Allegheny Mineral - Harrisville, PA (43085-01)"},{"$f":"J1","v":"43085-01"},null,null,null,null,null,null,"Allegheny Mineral - Harrisville, PA","43085-01"]
["Allegheny Mineral - Slippery Rock, PA (43076-01)","43076-01",null,null,null,null,null,null,"Allegheny Mineral - Slippery Rock, PA","43076-01"]
["Allied Corp. - Massillon, OH (43039-01)","43039-01",null,"INSERT QUERY OVERTOP VALUES ON THE RIGHT\n->>>",null,null,null,null,"Allied Corp. - Massillon, OH","43039-01"]
["American S&G - Massillon, OH (43003-01)","43003-01",null,null,null,null,null,null,"American S&G - Massillon, OH","43003-01"]
["Arch Materials - Batavia, OH (47091-01)","47091-01",null,null,null,null,null,null,"Arch Materials - Batavia, OH","47091-01"]
["Area Aggregates - Woodville, OH (41063-01)","41063-01",null,null,null,null,null,null,"Area Aggregates - Woodville, OH","41063-01"]
["Ballentine Sand & Gravel - Ravenna, OH (43078-01)","43078-01",null,null,null,null,null,null,"Ballentine Sand & Gravel - Ravenna, OH","43078-01"]
["Barrett Paving - Fairborn, OH (46008-01)","46008-01",null,null,null,null,null,null,"Barrett Paving - Fairborn, OH","46008-01"]
["Barrett Paving - Richmond, IN (47047-01)","47047-01",null,null,null,null,null,null,"Barrett Paving - Richmond, IN","47047-01"]
["Barrett Paving Materials - Miamisburg, OH (46013-01)","46013-01",null,null,null,null,null,null,"Barrett Paving Materials - Miamisburg, OH","46013-01"]
["Barrett Paving Materials - Sidney, OH (46024-01)","46024-01",null,null,null,null,null,null,"Barrett Paving Materials - Sidney, OH","46024-01"]
["Barrett Paving Materials - Sidney, OH (46023B-01)","46023B-01",null,null,null,null,null,null,"Barrett Paving Materials - Sidney, OH","46023B-01"]
["BCE Materials - Wheelersburg, OH (48003-01)","48003-01",null,null,null,null,null,null,"BCE Materials - Wheelersburg, OH","48003-01"]
["Beck Sand & Gravel - Ravenna, OH (43005-01)","43005-01",null,null,null,null,null,null,"Beck Sand & Gravel - Ravenna, OH","43005-01"]
["Belpre S&G - Little Hocking, OH (49050-01)","49050-01",null,null,null,null,null,null,"Belpre S&G - Little Hocking, OH","49050-01"]
["C.F. Poeppelman - Bradford, OH (46031-01)","46031-01",null,null,null,null,null,null,"C.F. Poeppelman - Bradford, OH","46031-01"]
["Cardinal Agg - Perrysburg, OH (41058-01)","41058-01",null,null,null,null,null,null,"Cardinal Agg - Perrysburg, OH","41058-01"]
["Carmeuse - Butler, KY (47041-01)","47041-01",null,null,null,null,null,null,"Carmeuse - Butler, KY","47041-01"]
["Carmeuse - Cedarville, MI (51015-01)","51015-01",null,null,null,null,null,null,"Carmeuse - Cedarville, MI","51015-01"]
["Carmeuse - Gulliver, MI (51006-01)","51006-01",null,null,null,null,null,null,"Carmeuse - Gulliver, MI","51006-01"]
["Carmeuse - Maysville, KY (48028-01)","48028-01",null,null,null,null,null,null,"Carmeuse - Maysville, KY","48028-01"]
["Carmeuse - Rogers City, MI (51016-01)","51016-01",null,null,null,null,null,null,"Carmeuse - Rogers City, MI","51016-01"]
["Clark Clay - Newcomerstown, OH (44038-01)","44038-01",null,null,null,null,null,null,"Clark Clay - Newcomerstown, OH","44038-01"]
["Clifford Aggregate - Angola, IN (41061-01)","41061-01",null,null,null,null,null,null,"Clifford Aggregate - Angola, IN","41061-01"]
["Clifford Aggregate - Wolcottville, IN (41062-01)","41062-01",null,null,null,null,null,null,"Clifford Aggregate - Wolcottville, IN","41062-01"]
["Coshocton Materials - Coshocton, OH (44039-01)","44039-01",null,null,null,null,null,null,"Coshocton Materials - Coshocton, OH","44039-01"]
["D & K Materials - Mogadore, OH (43097-01)","43097-01",null,null,null,null,null,null,"D & K Materials - Mogadore, OH","43097-01"]
["Drummond Isle Stone - Drummond, MI (51011-01)","51011-01",null,null,null,null,null,null,"Drummond Isle Stone - Drummond, MI","51011-01"]
["Duff Quarry - Huntsville, OH (46038-01)","46038-01",null,null,null,null,null,null,"Duff Quarry - Huntsville, OH","46038-01"]
["Eagle Materials - Germantown, OH (47030-01)","47030-01",null,null,null,null,null,null,"Eagle Materials - Germantown, OH","47030-01"]
["Enon S & G - Springfield, OH (46011-01)","46011-01",null,null,null,null,null,null,"Enon S & G - Springfield, OH","46011-01"]
["Erie Materials - Sandusky, OH (42006-01)","42006-01",null,null,null,null,null,null,"Erie Materials - Sandusky, OH","42006-01"]
["Ervin Hill - Hillsboro, OH (48039-01)","48039-01",null,null,null,null,null,null,"Ervin Hill - Hillsboro, OH","48039-01"]
["Evans S & G - Cincinnati, OH (47088-01)","47088-01",null,null,null,null,null,null,"Evans S & G - Cincinnati, OH","47088-01"]
["Feikert S & G - Fredericksburg, OH (50009-01)","50009-01",null,null,null,null,null,null,"Feikert S & G - Fredericksburg, OH","50009-01"]
["Gerken - Addison, MI (41022-01)","41022-01",null,null,null,null,null,null,"Gerken - Addison, MI","41022-01"]
["Gerken - Bluffton, OH (40001-01)","40001-01",null,null,null,null,null,null,"Gerken - Bluffton, OH","40001-01"]
["Gerken - Clinton, MI (41028-01)","41028-01",null,null,null,null,null,null,"Gerken - Clinton, MI","41028-01"]
["Gerken - Custar, OH (41013A-01)","41013A-01",null,null,null,null,null,null,"Gerken - Custar, OH","41013A-01"]
["Gerken - Genoa, OH (41018-01)","41018-01",null,null,null,null,null,null,"Gerken - Genoa, OH","41018-01"]
["Gerken - Glacial S&G, MI (41056-01)","41056-01",null,null,null,null,null,null,"Gerken - Glacial S&G, MI","41056-01"]
["Gerken - Paulding, OH (40002-01)","40002-01",null,null,null,null,null,null,"Gerken - Paulding, OH","40002-01"]
["Gerken - Tecumseh, MI (41059-01)","41059-01",null,null,null,null,null,null,"Gerken - Tecumseh, MI","41059-01"]
["Gerken - Waldron, OH (41020-01)","41020-01",null,null,null,null,null,null,"Gerken - Waldron, OH","41020-01"]
["Gerken - Waldron, OH (41020A-01)","41020A-01",null,null,null,null,null,null,"Gerken - Waldron, OH","41020A-01"]
["Gerken - West Millgrove, OH (41008-01)","41008-01",null,null,null,null,null,null,"Gerken - West Millgrove, OH","41008-01"]
["Heidelberg Material Midwest Agg. - Cleves, OH (47072-01)","47072-01",null,null,null,null,null,null,"Heidelberg Material Midwest Agg. - Cleves, OH","47072-01"]
["Heidelberg Materials - Bessemer, PA (43011-01)","43011-01",null,null,null,null,null,null,"Heidelberg Materials - Bessemer, PA","43011-01"]
["Heidelberg Materials - Bloomville, OH (41014-01)","41014-01",null,null,null,null,null,null,"Heidelberg Materials - Bloomville, OH","41014-01"]
["Heidelberg Materials - Castalia, OH (42005C-01)","42005C-01",null,null,null,null,null,null,"Heidelberg Materials - Castalia, OH","42005C-01"]
["Heidelberg Materials - Castalia, OH (42005D-01)","42005D-01",null,null,null,null,null,null,"Heidelberg Materials - Castalia, OH","42005D-01"]
["Heidelberg Materials - Connellsville, PA (50076-01)","50076-01",null,null,null,null,null,null,"Heidelberg Materials - Connellsville, PA","50076-01"]
["Heidelberg Materials - Grayson, KY (48037A-01)","48037A-01",null,null,null,null,null,null,"Heidelberg Materials - Grayson, KY","48037A-01"]
["Heidelberg Materials - Peebles, OH (48020-01)","48020-01",null,null,null,null,null,null,"Heidelberg Materials - Peebles, OH","48020-01"]
["Heidelberg Materials - Sandusky, OH (42004A-01)","42004A-01",null,null,null,null,null,null,"Heidelberg Materials - Sandusky, OH","42004A-01"]
["Heidelberg Materials - Sylvania, OH (41011-01)","41011-01",null,null,null,null,null,null,"Heidelberg Materials - Sylvania, OH","41011-01"]
["Heidelberg Materials - Versailles, IN (47076-01)","47076-01",null,null,null,null,null,null,"Heidelberg Materials - Versailles, IN","47076-01"]
["Heidelberg Materials - Waterville, OH (41010-01)","41010-01",null,null,null,null,null,null,"Heidelberg Materials - Waterville, OH","41010-01"]
["Heidelberg Materials - Winchester, OH (48033-01)","48033-01",null,null,null,null,null,null,"Heidelberg Materials - Winchester, OH","48033-01"]
["Heidelberg Materials - Woodburn, IN (40025-01)","40025-01",null,null,null,null,null,null,"Heidelberg Materials - Woodburn, IN","40025-01"]
["Heidelberg Materials Midwest Agg. - Angola, IN (41039-01)","41039-01",null,null,null,null,null,null,"Heidelberg Materials Midwest Agg. - Angola, IN","41039-01"]
["Heidelberg Materials Midwest Agg. - Piketon, OH (48011-01)","48011-01",null,null,null,null,null,null,"Heidelberg Materials Midwest Agg. - Piketon, OH","48011-01"]
["Hilltop Basic - Battletown, KY (47071-01)","47071-01",null,null,null,null,null,null,"Hilltop Basic - Battletown, KY","47071-01"]
["Hilltop Basic - Butler, KY (47083-01)","47083-01",null,null,null,null,null,null,"Hilltop Basic - Butler, KY","47083-01"]
[{"$f":"I65&\" (\"&J65&\")\"","v":"Hilltop Basic - Patriot, IN (47019-01)"},{"$f":"J65","v":"47019-01"},null,null,null,null,null,null,"Hilltop Basic - Patriot, IN","47019-01"]
["Hilltop Basic - Patriot, IN (47019A-01)","47019A-01",null,null,null,null,null,null,"Hilltop Basic - Patriot, IN","47019A-01"]
["Hocking Valley Concrete - Logan, OH (49027-01)","49027-01",null,null,null,null,null,null,"Hocking Valley Concrete - Logan, OH","49027-01"]
["Holcim - Manitoulin, ON (51014-01)","51014-01",null,null,null,null,null,null,"Holcim - Manitoulin, ON","51014-01"]
["Holcim - Marblehead, OH (41005-01)","41005-01",null,null,null,null,null,null,"Holcim - Marblehead, OH","41005-01"]
["Holcim - Presque Isle, MI (51009-01)","51009-01",null,null,null,null,null,null,"Holcim - Presque Isle, MI","51009-01"]
["Holcim - West Mifflin, PA (43063-01)","43063-01",null,null,null,null,null,null,"Holcim - West Mifflin, PA","43063-01"]
["Holmes Redimix Concrete - Millersburg, OH (50017-01)","50017-01",null,null,null,null,null,null,"Holmes Redimix Concrete - Millersburg, OH","50017-01"]
["Holmes Redimix Concrete - Millersburg, OH (50017C-01)","50017C-01",null,null,null,null,null,null,"Holmes Redimix Concrete - Millersburg, OH","50017C-01"]
["Holmes Supply - Holmesville, OH (50057-01)","50057-01",null,null,null,null,null,null,"Holmes Supply - Holmesville, OH","50057-01"]
["Hugo Sand Company - Kent, OH (43015-01)","43015-01",null,null,null,null,null,null,"Hugo Sand Company - Kent, OH","43015-01"]
["Irving Materials - Cambridge City, IN (47092-01)","47092-01",null,null,null,null,null,null,"Irving Materials - Cambridge City, IN","47092-01"]
["Irving Materials - Connersville, IN (47050-01)","47050-01",null,null,null,null,null,null,"Irving Materials - Connersville, IN","47050-01"]
["Kirby S&G - Upper Sandusky, OH (40023-01)","40023-01",null,null,null,null,null,null,"Kirby S&G - Upper Sandusky, OH","40023-01"]
["Kirby S&G - Upper Sandusky, OH (40023B-01)","40023B-01",null,null,null,null,null,null,"Kirby S&G - Upper Sandusky, OH","40023B-01"]
["Lakeside Sand & Gravel - Mantua, OH (43020-01)","43020-01",null,null,null,null,null,null,"Lakeside Sand & Gravel - Mantua, OH","43020-01"]
["Latham Limestone - Latham, OH (48018-01)","48018-01",null,null,null,null,null,null,"Latham Limestone - Latham, OH","48018-01"]
["Letart - Gallipolis Ferry, WV (49012-01)","49012-01",null,null,null,null,null,null,"Letart - Gallipolis Ferry, WV","49012-01"]
["Maple Grove Materials - Tiffin, OH (41007-01)","41007-01",null,null,null,null,null,null,"Maple Grove Materials - Tiffin, OH","41007-01"]
["Martin Marietta - Brookville, OH (46004-01)","46004-01",null,null,null,null,null,null,"Martin Marietta - Brookville, OH","46004-01"]
["Martin Marietta - Cedarville, OH (47037-01)","47037-01",null,null,null,null,null,null,"Martin Marietta - Cedarville, OH","47037-01"]
["Martin Marietta - Fairborn, OH (46001-01)","46001-01",null,null,null,null,null,null,"Martin Marietta - Fairborn, OH","46001-01"]
["Martin Marietta - Fairfield, OH (47003-01)","47003-01",null,null,null,null,null,null,"Martin Marietta - Fairfield, OH","47003-01"]
["Martin Marietta - Hamilton, OH (47008-01)","47008-01",null,null,null,null,null,null,"Martin Marietta - Hamilton, OH","47008-01"]
["Martin Marietta - North Bend, OH (47049-01)","47049-01",null,null,null,null,null,null,"Martin Marietta - North Bend, OH","47049-01"]
["Martin Marietta - Petersburg, KY (47082-01)","47082-01",null,null,null,null,null,null,"Martin Marietta - Petersburg, KY","47082-01"]
["Martin Marietta - Petroleum, WV (49054-01)","49054-01",null,null,null,null,null,null,"Martin Marietta - Petroleum, WV","49054-01"]
["Martin Marietta - Racine, OH (49015-01)","49015-01",null,null,null,null,null,null,"Martin Marietta - Racine, OH","49015-01"]
["Martin Marietta - Spring Valley, OH (47084-01)","47084-01",null,null,null,null,null,null,"Martin Marietta - Spring Valley, OH","47084-01"]
["Martin Marietta - Trenton, OH (47026-01)","47026-01",null,null,null,null,null,null,"Martin Marietta - Trenton, OH","47026-01"]
["Martin Marietta - Troy, OH (46007-01)","46007-01",null,null,null,null,null,null,"Martin Marietta - Troy, OH","46007-01"]
["Martin Marietta - Xenia, OH (47011-01)","47011-01",null,null,null,null,null,null,"Martin Marietta - Xenia, OH","47011-01"]
["Mar-Zane Materials - Chillicothe, OH (48007-01)","48007-01",null,null,null,null,null,null,"Mar-Zane Materials - Chillicothe, OH","48007-01"]
["Mar-Zane Materials - Haydenville, OH (49003-01)","49003-01",null,null,null,null,null,null,"Mar-Zane Materials - Haydenville, OH","49003-01"]
["Mar-Zane Materials - Logan, OH (49059A-01)","49059A-01",null,null,null,null,null,null,"Mar-Zane Materials - Logan, OH","49059A-01"]
["Mar-Zane Materials - Perrysville, OH (42012A-01)","42012A-01",null,null,null,null,null,null,"Mar-Zane Materials - Perrysville, OH","42012A-01"]
["Mar-Zane Materials - Ravenna, OH (43073A-01)","43073A-01",null,null,null,null,null,null,"Mar-Zane Materials - Ravenna, OH","43073A-01"]
["Mar-Zane Materials - Zanesville, OH (44016-01)","44016-01",null,null,null,null,null,null,"Mar-Zane Materials - Zanesville, OH","44016-01"]
["Massillon Materials - Bolivar, OH (50079-01)","50079-01",null,null,null,null,null,null,"Massillon Materials - Bolivar, OH","50079-01"]
["Massillon Materials - Massillon, OH (43052-01)","43052-01",null,null,null,null,null,null,"Massillon Materials - Massillon, OH","43052-01"]
["Mechanicsburg S & G - Mechanicsburg, OH (46037-01)","46037-01",null,null,null,null,null,null,"Mechanicsburg S & G - Mechanicsburg, OH","46037-01"]
["Melvin Stone - Circleville, OH (45026-01)","45026-01",null,null,null,null,null,null,"Melvin Stone - Circleville, OH","45026-01"]
["Melvin Stone - Corning, OH (44036-01)","44036-01",null,null,null,null,null,null,"Melvin Stone - Corning, OH","44036-01"]
["Melvin Stone - Middletown, OH (47007-01)","47007-01",null,null,null,null,null,null,"Melvin Stone - Middletown, OH","47007-01"]
["Melvin Stone - New Holland, OH (45011-01)","45011-01",null,null,null,null,null,null,"Melvin Stone - New Holland, OH","45011-01"]
["Melvin Stone - Sabina, OH (47077-01)","47077-01",null,null,null,null,null,null,"Melvin Stone - Sabina, OH","47077-01"]
["Melvin Stone - Washington Court House, OH (48036-01)","48036-01",null,null,null,null,null,null,"Melvin Stone - Washington Court House, OH","48036-01"]
["Melvin Stone - Wellston, OH (49007-01)","49007-01",null,null,null,null,null,null,"Melvin Stone - Wellston, OH","49007-01"]
["Melvin Stone Company - Wilmington, OH (47021-01)","47021-01",null,null,null,null,null,null,"Melvin Stone Company - Wilmington, OH","47021-01"]
["Miami View Mining - Morrow, OH (47023-01)","47023-01",null,null,null,null,null,null,"Miami View Mining - Morrow, OH","47023-01"]
["Milton Materials - Ludlow Falls, OH (46012-01)","46012-01",null,null,null,null,null,null,"Milton Materials - Ludlow Falls, OH","46012-01"]
["Mountain Materials (Brushy Creek) - Olive Hill, KY (48051-01)","48051-01",null,null,null,null,null,null,"Mountain Materials (Brushy Creek) - Olive Hill, KY","48051-01"]
["Mulzer Crushed Stone - Cape Sandy, IN (49032-01)","49032-01",null,null,null,null,null,null,"Mulzer Crushed Stone - Cape Sandy, IN","49032-01"]
["Mulzer Crushed Stone - Charlestown, IN (49033-01)","49033-01",null,null,null,null,null,null,"Mulzer Crushed Stone - Charlestown, IN","49033-01"]
["Mulzer Crushed Stone - Charlestown, IN (49033A-01)","49033A-01",null,null,null,null,null,null,"Mulzer Crushed Stone - Charlestown, IN","49033A-01"]
["Mulzer Crushed Stone - Mauckport, IN (47069-01)","47069-01",null,null,null,null,null,null,"Mulzer Crushed Stone - Mauckport, IN","47069-01"]
["National L&S - Bucyrus, OH (42002-01)","42002-01",null,null,null,null,null,null,"National L&S - Bucyrus, OH","42002-01"]
["National L&S - Delaware, OH (45005-01)","45005-01",null,null,null,null,null,null,"National L&S - Delaware, OH","45005-01"]
["National L&S - Lima, OH (40008B-01)","40008B-01",null,null,null,null,null,null,"National L&S - Lima, OH","40008B-01"]
["National L&S - Marion, OH (45012-01)","45012-01",null,null,null,null,null,null,"National L&S - Marion, OH","45012-01"]
["National L&S - Marion, OH (45012A-01)","45012A-01",null,null,null,null,null,null,"National L&S - Marion, OH","45012A-01"]
["National L&S - Ottawa, OH (40011-01)","40011-01",null,null,null,null,null,null,"National L&S - Ottawa, OH","40011-01"]
["National L&S - Rimer, OH (40027-01)","40027-01",null,null,null,null,null,null,"National L&S - Rimer, OH","40027-01"]
["National Lime & Stone - Carey, OH (40030-01)","40030-01",null,null,null,null,null,null,"National Lime & Stone - Carey, OH","40030-01"]
[{"$f":"I129&\" (\"&J129&\")\"","v":"National Lime & Stone - Chesterville, OH (45021-01)"},{"$f":"J129","v":"45021-01"},null,null,null,null,null,null,"National Lime & Stone - Chesterville, OH","45021-01"]
["National Lime & Stone - Findlay, OH (40007-01)","40007-01",null,null,null,null,null,null,"National Lime & Stone - Findlay, OH","40007-01"]
["National Lime & Stone - Lockbourne, OH (45041-01)","45041-01",null,null,null,null,null,null,"National Lime & Stone - Lockbourne, OH","45041-01"]
["National Lime & Stone - Upper Sandusky, OH (40019-01)","40019-01",null,null,null,null,null,null,"National Lime & Stone - Upper Sandusky, OH","40019-01"]
["National Lime & Stone - Wapakoneta, OH (46036B-01)","46036B-01",null,null,null,null,null,null,"National Lime & Stone - Wapakoneta, OH","46036B-01"]
["Neers S & G - Bellefontaine, OH (46029-01)","46029-01",null,null,null,null,null,null,"Neers S & G - Bellefontaine, OH","46029-01"]
["Northern Kentucky Aggregates - Petersburg, KY (47045-01)","47045-01",null,null,null,null,null,null,"Northern Kentucky Aggregates - Petersburg, KY","47045-01"]
["Northern Kentucky Aggregates - Petersburg, KY (47045A-01)","47045A-01",null,null,null,null,null,null,"Northern Kentucky Aggregates - Petersburg, KY","47045A-01"]
["Oeder & Sons S & G - Lebanon, OH (47024-01)","47024-01",null,null,null,null,null,null,"Oeder & Sons S & G - Lebanon, OH","47024-01"]
["Olen Corp - Columbus, OH (45009-01)","45009-01",null,null,null,null,null,null,"Olen Corp - Columbus, OH","45009-01"]
["Olen Corp - Columbus, OH (45009A-01)","45009A-01",null,null,null,null,null,null,"Olen Corp - Columbus, OH","45009A-01"]
["Olen Corp - Columbus, OH (45038-01)","45038-01",null,null,null,null,null,null,"Olen Corp - Columbus, OH","45038-01"]
["Olen Corp - Fredericktown, OH (44020-01)","44020-01",null,null,null,null,null,null,"Olen Corp - Fredericktown, OH","44020-01"]
["Olen Corp - Fredericktown, OH (44020A-01)","44020A-01",null,null,null,null,null,null,"Olen Corp - Fredericktown, OH","44020A-01"]
["Olen Corp - St. Louisville, OH (44010-01)","44010-01",null,null,null,null,null,null,"Olen Corp - St. Louisville, OH","44010-01"]
["Olen Corp - Upper Sandusky, OH (40004B-01)","40004B-01",null,null,null,null,null,null,"Olen Corp - Upper Sandusky, OH","40004B-01"]
["Olen Corp - Wooster, OH (42015-01)","42015-01",null,null,null,null,null,null,"Olen Corp - Wooster, OH","42015-01"]
["Ontario Trap Rock - Ontario, Canada (41044-01)","41044-01",null,null,null,null,null,null,"Ontario Trap Rock - Ontario, Canada","41044-01"]
["Oscar Brugmann Sand & Gravel - Mantua, OH (43006-01)","43006-01",null,null,null,null,null,null,"Oscar Brugmann Sand & Gravel - Mantua, OH","43006-01"]
["Oster S & G - Massillon, OH (43025-01)","43025-01",null,null,null,null,null,null,"Oster S & G - Massillon, OH","43025-01"]
["Phillips Companies - Vandalia, OH (46014-01)","46014-01",null,null,null,null,null,null,"Phillips Companies - Vandalia, OH","46014-01"]
["Phillips Companies - Xenia, OH (47025-01)","47025-01",null,null,null,null,null,null,"Phillips Companies - Xenia, OH","47025-01"]
["Phoenix Asphalt - Magnolia, OH (50064-01)","50064-01",null,null,null,null,null,null,"Phoenix Asphalt - Magnolia, OH","50064-01"]
["Piqua Materials - Piqua, OH (46015-01)","46015-01",null,null,null,null,null,null,"Piqua Materials - Piqua, OH","46015-01"]
["Precision Agg - Portage, OH (41033-01)","41033-01",null,null,null,null,null,null,"Precision Agg - Portage, OH","41033-01"]
["Riverside - Battletown, KY (49037-01)","49037-01",null,null,null,null,null,null,"Riverside - Battletown, KY","49037-01"]
["Rootstown S & G - Ravenna, OH (43077-01)","43077-01",null,null,null,null,null,null,"Rootstown S & G - Ravenna, OH","43077-01"]
["Rupp Construction - Marshallville, OH (42014-01)","42014-01",null,null,null,null,null,null,"Rupp Construction - Marshallville, OH","42014-01"]
["Shelly Materials - Belle Center, OH (46026-01)","46026-01",null,null,null,null,null,null,"Shelly Materials - Belle Center, OH","46026-01"]
["Shelly Materials - Chillicothe, OH (48004-01)","48004-01",null,null,null,null,null,null,"Shelly Materials - Chillicothe, OH","48004-01"]
["Shelly Materials - Coshocton, OH (44003-01)","44003-01",null,null,null,null,null,null,"Shelly Materials - Coshocton, OH","44003-01"]
["Shelly Materials - Dresden, OH (44002-01)","44002-01",null,null,null,null,null,null,"Shelly Materials - Dresden, OH","44002-01"]
["Shelly Materials - East Fultonham, OH (44013A-01)","44013A-01",null,null,null,null,null,null,"Shelly Materials - East Fultonham, OH","44013A-01"]
["Shelly Materials - Forest, OH (40020-01)","40020-01",null,null,null,null,null,null,"Shelly Materials - Forest, OH","40020-01"]
["Shelly Materials - Grove City, OH (45003-01)","45003-01",null,null,null,null,null,null,"Shelly Materials - Grove City, OH","45003-01"]
["Shelly Materials - Hilliard, OH (45004-01)","45004-01",null,null,null,null,null,null,"Shelly Materials - Hilliard, OH","45004-01"]
["Shelly Materials - Hilliard, OH (45004A-01)","45004A-01",null,null,null,null,null,null,"Shelly Materials - Hilliard, OH","45004A-01"]
["Shelly Materials - Lockbourne, OH (45043-01)","45043-01",null,null,null,null,null,null,"Shelly Materials - Lockbourne, OH","45043-01"]
["Shelly Materials - Marietta, OH (49048-01)","49048-01",null,null,null,null,null,null,"Shelly Materials - Marietta, OH","49048-01"]
["Shelly Materials - Mechanicsburg, OH (46053-01)","46053-01",null,null,null,null,null,null,"Shelly Materials - Mechanicsburg, OH","46053-01"]
["Shelly Materials - Ostrander, OH (45019-01)","45019-01",null,null,null,null,null,null,"Shelly Materials - Ostrander, OH","45019-01"]
["Shelly Materials - Portland, OH (49058-01)","49058-01",null,null,null,null,null,null,"Shelly Materials - Portland, OH","49058-01"]
["Shelly Materials - Reedsville, OH (49045-01)","49045-01",null,null,null,null,null,null,"Shelly Materials - Reedsville, OH","49045-01"]
["Shelly Materials - St. Louisville, OH (44007-01)","44007-01",null,null,null,null,null,null,"Shelly Materials - St. Louisville, OH","44007-01"]
["Shelly Materials - Streetsboro, OH (43016-01)","43016-01",null,null,null,null,null,null,"Shelly Materials - Streetsboro, OH","43016-01"]
["Shelly Materials - West Mansfield, OH (45013-01)","45013-01",null,null,null,null,null,null,"Shelly Materials - West Mansfield, OH","45013-01"]
["Shelly Materials- Grove City, OH (45002-01)","45002-01",null,null,null,null,null,null,"Shelly Materials- Grove City, OH","45002-01"]
["Sidwell Materials - New Philadelphia, OH (50029-01)","50029-01",null,null,null,null,null,null,"Sidwell Materials - New Philadelphia, OH","50029-01"]
["Simak Trucking & Excavating - North Kingsville, OH (43080-01)","43080-01",null,null,null,null,null,null,"Simak Trucking & Excavating - North Kingsville, OH","43080-01"]
["Smalls S & G - Gambier, OH (44019-01)","44019-01",null,null,null,null,null,null,"Smalls S & G - Gambier, OH","44019-01"]
["Smelter Bay Sand - Marysville, MI (41026-01)","41026-01",null,null,null,null,null,null,"Smelter Bay Sand - Marysville, MI","41026-01"]
["Soehnlen Brothers Sand & Gravel - Beach City, OH (50069-01)","50069-01",null,null,null,null,null,null,"Soehnlen Brothers Sand & Gravel - Beach City, OH","50069-01"]
["SRM Materials - Germantown, OH (46050-01)","46050-01",null,null,null,null,null,null,"SRM Materials - Germantown, OH","46050-01"]
["Stafford Gravel - Butler, IN (41035-01)","41035-01",null,null,null,null,null,null,"Stafford Gravel - Butler, IN","41035-01"]
["Stocker Sand & Gravel - Gnadenhutten, OH (50038-01)","50038-01",null,null,null,null,null,null,"Stocker Sand & Gravel - Gnadenhutten, OH","50038-01"]
["Stocker Sand & Gravel - Gnadenhutten, OH (50075-01)","50075-01",null,null,null,null,null,null,"Stocker Sand & Gravel - Gnadenhutten, OH","50075-01"]
["Stone Street Quarries - Hoagland, IN (40036-01)","40036-01",null,null,null,null,null,null,"Stone Street Quarries - Hoagland, IN","40036-01"]
["Stoneco - Canton, OH (43007-01)","43007-01",null,null,null,null,null,null,"Stoneco - Canton, OH","43007-01"]
["Stoneco - Carey, OH (40017-01)","40017-01",null,null,null,null,null,null,"Stoneco - Carey, OH","40017-01"]
["Stoneco - Celina, OH (46022B-01)","46022B-01",null,null,null,null,null,null,"Stoneco - Celina, OH","46022B-01"]
["Stoneco - Clay Center, OH (41016-01)","41016-01",null,null,null,null,null,null,"Stoneco - Clay Center, OH","41016-01"]
["Stoneco - Convoy, OH (40013-01)","40013-01",null,null,null,null,null,null,"Stoneco - Convoy, OH","40013-01"]
["Stoneco - Maumee, OH (41023-01)","41023-01",null,null,null,null,null,null,"Stoneco - Maumee, OH","41023-01"]
["Stoneco - Maumee, OH (41023B-01)","41023B-01",null,null,null,null,null,null,"Stoneco - Maumee, OH","41023B-01"]
[{"$f":"I193&\" (\"&J193&\")\"","v":"Stoneco - Oakwood, OH (40012-01)"},{"$f":"J193","v":"40012-01"},null,null,null,null,null,null,"Stoneco - Oakwood, OH","40012-01"]
["Stoneco - Portage, OH (41003-01)","41003-01",null,null,null,null,null,null,"Stoneco - Portage, OH","41003-01"]
["Stoneco / Allied Corp - Petersburg, OH (43072-01)","43072-01",null,null,null,null,null,null,"Stoneco / Allied Corp - Petersburg, OH","43072-01"]
["Stoneco of Michigan - Ann Arbor (41060-01)","41060-01",null,null,null,null,null,null,"Stoneco of Michigan - Ann Arbor","41060-01"]
["Stoneco of Michigan - Horton, MI (41031-01)","41031-01",null,null,null,null,null,null,"Stoneco of Michigan - Horton, MI","41031-01"]
["Stoneco of Michigan - Ottawa Lake, MI (41032-01)","41032-01",null,null,null,null,null,null,"Stoneco of Michigan - Ottawa Lake, MI","41032-01"]
["Subtropolis Mining - Petersburg, OH (43094-01)","43094-01",null,null,null,null,null,null,"Subtropolis Mining - Petersburg, OH","43094-01"]
["Three Rivers Aggregates - Slippery Rock, PA (43075-01)","43075-01",null,null,null,null,null,null,"Three Rivers Aggregates - Slippery Rock, PA","43075-01"]
["Three Rivers Aggregates - Slippery Rock, PA (43095-01)","43095-01",null,null,null,null,null,null,"Three Rivers Aggregates - Slippery Rock, PA","43095-01"]
["Three Rivers Aggregates - Wampum, PA (43088-01)","43088-01",null,null,null,null,null,null,"Three Rivers Aggregates - Wampum, PA","43088-01"]
["Tiger S & G - Massillon, OH (43044-01)","43044-01",null,null,null,null,null,null,"Tiger S & G - Massillon, OH","43044-01"]
["TMS International / Stein LLC - Cleveland, OH (51047-01)","51047-01",null,null,null,null,null,null,"TMS International / Stein LLC - Cleveland, OH","51047-01"]
["Tow Path Materials - Chillicothe, OH (48050-01)","48050-01",null,null,null,null,null,null,"Tow Path Materials - Chillicothe, OH","48050-01"]
["Tow Path Materials - Lucasville, OH (48038-01)","48038-01",null,null,null,null,null,null,"Tow Path Materials - Lucasville, OH","48038-01"]
["U.S. Aggregates - Decatur, IN (40005-01)","40005-01",null,null,null,null,null,null,"U.S. Aggregates - Decatur, IN","40005-01"]
["U.S. Aggregates - Portland, IN (40032-01)","40032-01",null,null,null,null,null,null,"U.S. Aggregates - Portland, IN","40032-01"]
["U.S. Aggregates - Richmond, IN (47009-01)","47009-01",null,null,null,null,null,null,"U.S. Aggregates - Richmond, IN","47009-01"]
["United Agg - Danville, OH (44005-01)","44005-01",null,null,null,null,null,null,"United Agg - Danville, OH","44005-01"]
["United Agg - Mt. Vernon, OH (44009-01)","44009-01",null,null,null,null,null,null,"United Agg - Mt. Vernon, OH","44009-01"]
["Urbana Materials - Urbana, OH (46028-01)","46028-01",null,null,null,null,null,null,"Urbana Materials - Urbana, OH","46028-01"]
["Watson Gravel - Cleves, OH (47087-01)","47087-01",null,null,null,null,null,null,"Watson Gravel - Cleves, OH","47087-01"]
["Watson Gravel - Hamilton, OH (47029-01)","47029-01",null,null,null,null,null,null,"Watson Gravel - Hamilton, OH","47029-01"]
["Watson Gravel - Harrison, OH (47079-01)","47079-01",null,null,null,null,null,null,"Watson Gravel - Harrison, OH","47079-01"]
["Watson Gravel - Middletown, OH (47044-01)","47044-01",null,null,null,null,null,null,"Watson Gravel - Middletown, OH","47044-01"]
["Weber Materials - St. Mary's, OH (46032-01)","46032-01",null,null,null,null,null,null,"Weber Materials - St. Mary's, OH","46032-01"]
["Weber Sand & Gravel - Edgerton, OH (41017-01)","41017-01",null,null,null,null,null,null,"Weber Sand & Gravel - Edgerton, OH","41017-01"]
["Welch Sand & Gravel - Harrison, OH (47033-01)","47033-01",null,null,null,null,null,null,"Welch Sand & Gravel - Harrison, OH","47033-01"]
["Westfall Agg & Materials - Circleville, OH (45035-01)","45035-01",null,null,null,null,null,null,"Westfall Agg & Materials - Circleville, OH","45035-01"]
["William Albert - Coshocton, OH (44032-01)","44032-01",null,null,null,null,null,null,"William Albert - Coshocton, OH","44032-01"]
["Wylie & Sons Landscaping - Perrysburg, OH (41066-01)","41066-01",null,null,null,null,null,null,"Wylie & Sons Landscaping - Perrysburg, OH","41066-01"]
["Wysong Gravel - Camden, OH (47034-01)","47034-01",null,null,null,null,null,null,"Wysong Gravel - Camden, OH","47034-01"]
["Wysong Gravel - West Alexandria, OH (47036-01)","47036-01",null,null,null,null,null,null,"Wysong Gravel - West Alexandria, OH","47036-01"]
["XL S & G - Negley, OH (50039-01)","50039-01",null,null,null,null,null,null,"XL S & G - Negley, OH","50039-01"]
["Youngs S & G - Loudonville, OH (42001-01)","42001-01",null,null,null,null,null,null,"Youngs S & G - Loudonville, OH","42001-01"]

{"sheet":"AGG MATL LIST","index":15,"n_rows":838,"n_cols":16,"rows_kept":838,"cut":false,"hidden":true,"merged":[[4,6,9,9]]}
[{"$f":"L1&\" (\"&M1&\")\"","v":"Allegheny Mineral - Harrisville, PA (43085-01)"},{"$f":"M1","v":"43085-01"},{"$f":"N1","v":20081},{"$f":"IF(ISNUMBER(SEARCH(\"MicroSilica\",O1)),REPLACE(O1,19,11,\", SS847/848\"),O1)&\" \"&IF(ISNUMBER(SEARCH(\"Sand\",O1)),\"\",IF(ISNUMBER(SEARCH(\"Limestone\",P1)),\"(Limestone)\",IF(ISNUMBER(SEARCH(\"Dolostone\",P1)),\"(Dolostone)\",IF(ISNUMBER(SEARCH(\"Gravel (Crushed)\",P1)),\"(Gravel (Crushed))\",IF(ISNUMBER(SEARCH(\"Gravel (100% Crushed)\",P1)),\"(Gravel (100% Crushed))\",IF(ISNUMBER(SEARCH(\"Slag\",P1)),\"(Slag (ACBF))\",IF(ISNUMBER(SEARCH(\"Gravel (Blended W/ Olen-Columbus Limestone)\",P1)),\"(Gravel (Blended W/ Limestone))\",IF(ISNUMBER(SEARCH(\"Gravel (Benefited: 40% Crushed)\",P1)),\"(Gravel (40% Crushed))\",IF(ISNUMBER(SEARCH(\"Sand & Gravel\",P1)),\"(Gravel)\",IF(ISNUMBER(SEARCH(\"Trap Rock\",P1)),\"(Trap Rock)\"))))))))))","v":"No. 8 Agg, 703.02 Concrete Overlay (Limestone)"},{"$f":"P1","v":"Limestone"},null,null,null,null,null,null,"Allegheny Mineral - Harrisville, PA","43085-01",20081,"No. 8 Agg, 703.02 Concrete Overlay","Limestone"]
["Allegheny Mineral - Harrisville, PA (43085-01)","43085-01",2008,{"$f":"IF(ISNUMBER(SEARCH(\"MicroSilica\",O2)),REPLACE(O2,19,11,\", SS847/848\"),O2)&\" \"&IF(ISNUMBER(SEARCH(\"Sand\",O2)),\"\",IF(ISNUMBER(SEARCH(\"Limestone\",P2)),\"(Limestone)\",IF(ISNUMBER(SEARCH(\"Dolostone\",P2)),\"(Dolostone)\",IF(ISNUMBER(SEARCH(\"Gravel (Crushed)\",P2)),\"(Gravel (Crushed))\",IF(ISNUMBER(SEARCH(\"Gravel (100% Crushed)\",P2)),\"(Gravel (100% Crushed))\",IF(ISNUMBER(SEARCH(\"Slag\",P2)),\"(Slag (ACBF))\",IF(ISNUMBER(SEARCH(\"Gravel (Blended W/ Olen-Columbus Limestone)\",P2)),\"(Gravel (Blended W/ Limestone))\",IF(ISNUMBER(SEARCH(\"Gravel (Benefited: 40% Crushed)\",P2)),\"(Gravel (40% Crushed))\",IF(ISNUMBER(SEARCH(\"Sand & Gravel\",P2)),\"(Gravel)\",IF(ISNUMBER(SEARCH(\"Trap Rock\",P2)),\"(Trap Rock)\"))))))))))","v":"No. 8 Agg, 703.02 Concrete (Limestone)"},{"$f":"P2","v":"Limestone"},null,null,null,null,null,null,"Allegheny Mineral - Harrisville, PA","43085-01",2008,"No. 8 Agg, 703.02 Concrete","Limestone"]
["Allegheny Mineral - Harrisville, PA (43085-01)","43085-01",20080,"No. 8 Agg, 703.02 Super-Structure (Limestone)","Limestone",null,null,null,null,null,null,"Allegheny Mineral - Harrisville, PA","43085-01",20080,"No. 8 Agg, 703.02 Super-Structure","Limestone"]
["Allegheny Mineral - Harrisville, PA (43085-01)","43085-01",2057,"No. 57 Agg, 703.02 Concrete (Limestone)","Limestone",null,null,null,null,null,null,"Allegheny Mineral - Harrisville, PA","43085-01",2057,"No. 57 Agg, 703.02 Concrete","Limestone"]
["Allegheny Mineral - Harrisville, PA (43085-01)","43085-01",20570,"No. 57 Agg, 703.02 Super-Structure (Limestone)","Limestone",null,"INSERT QUERY OVERTOP VALUES ON THE RIGHT\n->>>",null,null,null,null,"Allegheny Mineral - Harrisville, PA","43085-01",20570,"No. 57 Agg, 703.02 Super-Structure","Limestone"]
["Allegheny Mineral - Harrisville, PA (43085-01)","43085-01",20572,"No. 57 Agg, 703.13 Freeze-Thaw (Limestone)","Limestone",null,null,null,null,null,null,"Allegheny Mineral - Harrisville, PA","43085-01",20572,"No. 57 Agg, 703.13 Freeze-Thaw","Limestone"]
["Allegheny Mineral - Slippery Rock, PA (43076-01)","43076-01",2008,"No. 8 Agg, 703.02 Concrete (Limestone)","Limestone",null,null,null,null,null,null,"Allegheny Mineral - Slippery Rock, PA","43076-01",2008,"No. 8 Agg, 703.02 Concrete","Limestone"]
["Allegheny Mineral - Slippery Rock, PA (43076-01)","43076-01",2057,"No. 57 Agg, 703.02 Concrete (Limestone)","Limestone",null,null,null,null,null,null,"Allegheny Mineral - Slippery Rock, PA","43076-01",2057,"No. 57 Agg, 703.02 Concrete","Limestone"]
["Allegheny Mineral - Slippery Rock, PA (43076-01)","43076-01",20572,"No. 57 Agg, 703.13 Freeze-Thaw (Limestone)","Limestone",null,null,null,null,null,null,"Allegheny Mineral - Slippery Rock, PA","43076-01",20572,"No. 57 Agg, 703.13 Freeze-Thaw","Limestone"]
["Allied Corp. - Massillon, OH (43039-01)","43039-01","02SD2","Sand, 703.02 Concrete ","Sand & Gravel",null,null,null,null,null,null,"Allied Corp. - Massillon, OH","43039-01","02SD2","Sand, 703.02 Concrete","Sand & Gravel"]
["Allied Corp. - Massillon, OH (43039-01)","43039-01","02SD23","Sand, 703.02 Concrete, Acid Insoluble ","Sand & Gravel",null,null,null,null,null,null,"Allied Corp. - Massillon, OH","43039-01","02SD23","Sand, 703.02 Concrete, Acid Insoluble","Sand & Gravel"]
["Allied Corp. - Massillon, OH (43039-01)","43039-01",2008,"No. 8 Agg, 703.02 Concrete (Gravel)","Sand & Gravel",null,null,null,null,null,null,"Allied Corp. - Massillon, OH","43039-01",2008,"No. 8 Agg, 703.02 Concrete","Sand & Gravel"]
["American S&G - Massillon, OH (43003-01)","43003-01","02SD2","Sand, 703.02 Concrete ","Sand & Gravel",null,null,null,null,null,null,"American S&G - Massillon, OH","43003-01","02SD2","Sand, 703.02 Concrete","Sand & Gravel"]
["American S&G - Massillon, OH (43003-01)","43003-01","02SD23","Sand, 703.02 Concrete, Acid Insoluble ","Sand & Gravel",null,null,null,null,null,null,"American S&G - Massillon, OH","43003-01","02SD23","Sand, 703.02 Concrete, Acid Insoluble","Sand & Gravel"]
["American S&G - Massillon, OH (43003-01)","43003-01",2008,"No. 8 Agg, 703.02 Concrete (Gravel)","Sand & Gravel",null,null,null,null,null,null,"American S&G - Massillon, OH","43003-01",2008,"No. 8 Agg, 703.02 Concrete","Sand & Gravel"]
["Arch Materials - Batavia, OH (47091-01)","47091-01",2008,"No. 8 Agg, 703.02 Concrete (Limestone)","Limestone",null,null,null,null,null,null,"Arch Materials - Batavia, OH","47091-01",2008,"No. 8 Agg, 703.02 Concrete","Limestone"]
["Arch Materials - Batavia, OH (47091-01)","47091-01",2057,"No. 57 Agg, 703.02 Concrete (Limestone)","Limestone",null,null,null,null,null,null,"Arch Materials - Batavia, OH","47091-01",2057,"No. 57 Agg, 703.02 Concrete","Limestone"]
["Arch Materials - Batavia, OH (47091-01)","47091-01",2067,"No. 67 Agg, 703.02 Concrete (Limestone)","Limestone",null,null,null,null,null,null,"Arch Materials - Batavia, OH","47091-01",2067,"No. 67 Agg, 703.02 Concrete","Limestone"]
["Arch Materials - Batavia, OH (47091-01)","47091-01",20570,"No. 57 Agg, 703.02 Super-Structure (Limestone)","Limestone",null,null,null,null,null,null,"Arch Materials - Batavia, OH","47091-01",20570,"No. 57 Agg, 703.02 Super-Structure","Limestone"]
["Arch Materials - Batavia, OH (47091-01)","47091-01",20572,"No. 57 Agg, 703.13 Freeze-Thaw (Limestone)","Limestone",null,null,null,null,null,null,"Arch Materials - Batavia, OH","47091-01",20572,"No. 57 Agg, 703.13 Freeze-Thaw","Limestone"]
["Area Aggregates - Woodville, OH (41063-01)","41063-01",2008,"No. 8 Agg, 703.02 Concrete (Dolostone)","Dolostone",null,null,null,null,null,null,"Area Aggregates - Woodville, OH","41063-01",2008,"No. 8 Agg, 703.02 Concrete","Dolostone"]
["Area Aggregates - Woodville, OH (41063-01)","41063-01",20080,"No. 8 Agg, 703.02 Super-Structure (Dolostone)","Dolostone",null,null,null,null,null,null,"Area Aggregates - Woodville, OH","41063-01",20080,"No. 8 Agg, 703.02 Super-Structure","Dolostone"]
["Area Aggregates - Woodville, OH (41063-01)","41063-01",20081,"No. 8 Agg, 703.02 Concrete Overlay (Dolostone)","Dolostone",null,null,null,null,null,null,"Area Aggregates - Woodville, OH","41063-01",20081,"No. 8 Agg, 703.02 Concrete Overlay","Dolostone"]
["Area Aggregates - Woodville, OH (41063-01)","41063-01",20570,"No. 57 Agg, 703.02 Super-Structure (Dolostone)","Dolostone",null,null,null,null,null,null,"Area Aggregates - Woodville, OH","41063-01",20570,"No. 57 Agg, 703.02 Super-Structure","Dolostone"]
["Area Aggregates - Woodville, OH (41063-01)","41063-01",2057,"No. 57 Agg, 703.02 Concrete (Dolostone)","Dolostone",null,null,null,null,null,null,"Area Aggregates - Woodville, OH","41063-01",2057,"No. 57 Agg, 703.02 Concrete","Dolostone"]
["Area Aggregates - Woodville, OH (41063-01)","41063-01",20572,"No. 57 Agg, 703.13 Freeze-Thaw (Dolostone)","Dolostone",null,null,null,null,null,null,"Area Aggregates - Woodville, OH","41063-01",20572,"No. 57 Agg, 703.13 Freeze-Thaw","Dolostone"]
["Area Aggregates - Woodville, OH (41063-01)","41063-01","02SD2","Sand, 703.02 Concrete ","Dolostone",null,null,null,null,null,null,"Area Aggregates - Woodville, OH","41063-01","02SD2","Sand, 703.02 Concrete","Dolostone"]
["Ballentine Sand & Gravel - Ravenna, OH (43078-01)","43078-01","02SD2","Sand, 703.02 Concrete ","Sand & Gravel",null,null,null,null,null,null,"Ballentine Sand & Gravel - Ravenna, OH","43078-01","02SD2","Sand, 703.02 Concrete","Sand & Gravel"]
["Barrett Paving - Fairborn, OH (46008-01)","46008-01",20080,"No. 8 Agg, 703.02 Super-Structure (Gravel)","Sand & Gravel",null,null,null,null,null,null,"Barrett Paving - Fairborn, OH","46008-01",20080,"No. 8 Agg, 703.02 Super-Structure","Sand & Gravel"]
["Barrett Paving - Fairborn, OH (46008-01)","46008-01",20081,"No. 8 Agg, 703.02 Concrete Overlay (Gravel)","Sand & Gravel",null,null,null,null,null,null,"Barrett Paving - Fairborn, OH","46008-01",20081,"No. 8 Agg, 703.02 Concrete Overlay","Sand & Gravel"]
["Barrett Paving - Fairborn, OH (46008-01)","46008-01",2057,"No. 57 Agg, 703.02 Concrete (Gravel)","Sand & Gravel",null,null,null,null,null,null,"Barrett Paving - Fairborn, OH","46008-01",2057,"No. 57 Agg, 703.02 Concrete","Sand & Gravel"]
["Barrett Paving - Fairborn, OH (46008-01)","46008-01","02SD2","Sand, 703.02 Concrete ","Sand & Gravel",null,null,null,null,null,null,"Barrett Paving - Fairborn, OH","46008-01","02SD2","Sand, 703.02 Concrete","Sand & Gravel"]
["Barrett Paving - Fairborn, OH (46008-01)","46008-01","02SD23","Sand, 703.02 Concrete, Acid Insoluble ","Sand & Gravel",null,null,null,null,null,null,"Barrett Paving - Fairborn, OH","46008-01","02SD23","Sand, 703.02 Concrete, Acid Insoluble","Sand & Gravel"]
["Barrett Paving - Fairborn, OH (46008-01)","46008-01",2008,"No. 8 Agg, 703.02 Concrete (Gravel)","Sand & Gravel",null,null,null,null,null,null,"Barrett Paving - Fairborn, OH","46008-01",2008,"No. 8 Agg, 703.02 Concrete","Sand & Gravel"]
["Barrett Paving - Fairborn, OH (46008-01)","46008-01",20570,"No. 57 Agg, 703.02 Super-Structure (Gravel)","Sand & Gravel",null,null,null,null,null,null,"Barrett Paving - Fairborn, OH","46008-01",20570,"No. 57 Agg, 703.02 Super-Structure","Sand & Gravel"]
["Barrett Paving - Fairborn, OH (46008-01)","46008-01",20572,"No. 57 Agg, 703.13 Freeze-Thaw (Gravel)","Sand & Gravel",null,null,null,null,null,null,"Barrett Paving - Fairborn, OH","46008-01",20572,"No. 57 Agg, 703.13 Freeze-Thaw","Sand & Gravel"]
["Barrett Paving - Richmond, IN (47047-01)","47047-01",20570,"No. 57 Agg, 703.02 Super-Structure (Limestone)","Limestone",null,null,null,null,null,null,"Barrett Paving - Richmond, IN","47047-01",20570,"No. 57 Agg, 703.02 Super-Structure","Limestone"]
["Barrett Paving - Richmond, IN (47047-01)","47047-01",20080,"No. 8 Agg, 703.02 Super-Structure (Limestone)","Limestone",null,null,null,null,null,null,"Barrett Paving - Richmond, IN","47047-01",20080,"No. 8 Agg, 703.02 Super-Structure","Limestone"]
["Barrett Paving - Richmond, IN (47047-01)","47047-01",2008,"No. 8 Agg, 703.02 Concrete (Limestone)","Limestone",null,null,null,null,null,null,"Barrett Paving - Richmond, IN","47047-01",2008,"No. 8 Agg, 703.02 Concrete","Limestone"]
["Barrett Paving - Richmond, IN (47047-01)","47047-01",2057,"No. 57 Agg, 703.02 Concrete (Limestone)","Limestone",null,null,null,null,null,null,"Barrett Paving - Richmond, IN","47047-01",2057,"No. 57 Agg, 703.02 Concrete","Limestone"]
["Barrett Paving - Richmond, IN (47047-01)","47047-01",20572,"No. 57 Agg, 703.13 Freeze-Thaw (Limestone)","Limestone",null,null,null,null,null,null,"Barrett Paving - Richmond, IN","47047-01",20572,"No. 57 Agg, 703.13 Freeze-Thaw","Limestone"]
["Barrett Paving Materials - Miamisburg, OH (46013-01)","46013-01",20080,"No. 8 Agg, 703.02 Super-Structure (Gravel)","Sand & Gravel",null,null,null,null,null,null,"Barrett Paving Materials - Miamisburg, OH","46013-01",20080,"No. 8 Agg, 703.02 Super-Structure","Sand & Gravel"]
["Barrett Paving Materials - Miamisburg, OH (46013-01)","46013-01",2057,"No. 57 Agg, 703.02 Concrete (Gravel)","Sand & Gravel",null,null,null,null,null,null,"Barrett Paving Materials - Miamisburg, OH","46013-01",2057,"No. 57 Agg, 703.02 Concrete","Sand & Gravel"]
["Barrett Paving Materials - Miamisburg, OH (46013-01)","46013-01","02SD2","Sand, 703.02 Concrete ","Sand & Gravel",null,null,null,null,null,null,"Barrett Paving Materials - Miamisburg, OH","46013-01","02SD2","Sand, 703.02 Concrete","Sand & Gravel"]
["Barrett Paving Materials - Miamisburg, OH (46013-01)","46013-01","02SD23","Sand, 703.02 Concrete, Acid Insoluble ","Sand & Gravel",null,null,null,null,null,null,"Barrett Paving Materials - Miamisburg, OH","46013-01","02SD23","Sand, 703.02 Concrete, Acid Insoluble","Sand & Gravel"]
["Barrett Paving Materials - Miamisburg, OH (46013-01)","46013-01",2008,"No. 8 Agg, 703.02 Concrete (Gravel)","Sand & Gravel",null,null,null,null,null,null,"Barrett Paving Materials - Miamisburg, OH","46013-01",2008,"No. 8 Agg, 703.02 Concrete","Sand & Gravel"]
["Barrett Paving Materials - Miamisburg, OH (46013-01)","46013-01",20570,"No. 57 Agg, 703.02 Super-Structure (Gravel)","Sand & Gravel",null,null,null,null,null,null,"Barrett Paving Materials - Miamisburg, OH","46013-01",20570,"No. 57 Agg, 703.02 Super-Structure","Sand & Gravel"]
["Barrett Paving Materials - Miamisburg, OH (46013-01)","46013-01",20572,"No. 57 Agg, 703.13 Freeze-Thaw (Gravel)","Sand & Gravel",null,null,null,null,null,null,"Barrett Paving Materials - Miamisburg, OH","46013-01",20572,"No. 57 Agg, 703.13 Freeze-Thaw","Sand & Gravel"]
["Barrett Paving Materials - Sidney, OH (46024-01)","46024-01",20572,"No. 57 Agg, 703.13 Freeze-Thaw (Gravel)","Sand & Gravel",null,null,null,null,null,null,"Barrett Paving Materials - Sidney, OH","46024-01",20572,"No. 57 Agg, 703.13 Freeze-Thaw","Sand & Gravel"]
["Barrett Paving Materials - Sidney, OH (46023B-01)","46023B-01",2008,"No. 8 Agg, 703.02 Concrete (Limestone)","Limestone",null,null,null,null,null,null,"Barrett Paving Materials - Sidney, OH","46023B-01",2008,"No. 8 Agg, 703.02 Concrete","Limestone"]
["Barrett Paving Materials - Sidney, OH (46023B-01)","46023B-01",2057,"No. 57 Agg, 703.02 Concrete (Limestone)","Limestone",null,null,null,null,null,null,"Barrett Paving Materials - Sidney, OH","46023B-01",2057,"No. 57 Agg, 703.02 Concrete","Limestone"]
["Barrett Paving Materials - Sidney, OH (46023B-01)","46023B-01","02SD2","Sand, 703.02 Concrete ","Limestone",null,null,null,null,null,null,"Barrett Paving Materials - Sidney, OH","46023B-01","02SD2","Sand, 703.02 Concrete","Limestone"]
["Barrett Paving Materials - Sidney, OH (46023B-01)","46023B-01",20572,"No. 57 Agg, 703.13 Freeze-Thaw (Limestone)","Limestone",null,null,null,null,null,null,"Barrett Paving Materials - Sidney, OH","46023B-01",20572,"No. 57 Agg, 703.13 Freeze-Thaw","Limestone"]
["Barrett Paving Materials - Sidney, OH (46023B-01)","46023B-01",20081,"No. 8 Agg, 703.02 Concrete Overlay (Limestone)","Limestone",null,null,null,null,null,null,"Barrett Paving Materials - Sidney, OH","46023B-01",20081,"No. 8 Agg, 703.02 Concrete Overlay","Limestone"]
["Barrett Paving Materials - Sidney, OH (46023B-01)","46023B-01",20570,"No. 57 Agg, 703.02 Super-Structure (Limestone)","Limestone",null,null,null,null,null,null,"Barrett Paving Materials - Sidney, OH","46023B-01",20570,"No. 57 Agg, 703.02 Super-Structure","Limestone"]
["Barrett Paving Materials - Sidney, OH (46023B-01)","46023B-01",20080,"No. 8 Agg, 703.02 Super-Structure (Limestone)","Limestone",null,null,null,null,null,null,"Barrett Paving Materials - Sidney, OH","46023B-01",20080,"No. 8 Agg, 703.02 Super-Structure","Limestone"]
["Barrett Paving Materials - Sidney, OH (46024-01)","46024-01","02SD2","Sand, 703.02 Concrete ","Sand & Gravel",null,null,null,null,null,null,"Barrett Paving Materials - Sidney, OH","46024-01","02SD2","Sand, 703.02 Concrete","Sand & Gravel"]
["Barrett Paving Materials - Sidney, OH (46024-01)","46024-01","02SD23","Sand, 703.02 Concrete, Acid Insoluble ","Sand & Gravel",null,null,null,null,null,null,"Barrett Paving Materials - Sidney, OH","46024-01","02SD23","Sand, 703.02 Concrete, Acid Insoluble","Sand & Gravel"]
["BCE Materials - Wheelersburg, OH (48003-01)","48003-01","02SD23","Sand, 703.02 Concrete, Acid Insoluble ","Sand & Gravel",null,null,null,null,null,null,"BCE Materials - Wheelersburg, OH","48003-01","02SD23","Sand, 703.02 Concrete, Acid Insoluble","Sand & Gravel"]
["BCE Materials - Wheelersburg, OH (48003-01)","48003-01","02SD2","Sand, 703.02 Concrete ","Sand & Gravel",null,null,null,null,null,null,"BCE Materials - Wheelersburg, OH","48003-01","02SD2","Sand, 703.02 Concrete","Sand & Gravel"]
["Beck Sand & Gravel - Ravenna, OH (43005-01)","43005-01","02SD2","Sand, 703.02 Concrete ","Sand & Gravel",null,null,null,null,null,null,"Beck Sand & Gravel - Ravenna, OH","43005-01","02SD2","Sand, 703.02 Concrete","Sand & Gravel"]
["Beck Sand & Gravel - Ravenna, OH (43005-01)","43005-01","02SD23","Sand, 703.02 Concrete, Acid Insoluble ","Sand & Gravel",null,null,null,null,null,null,"Beck Sand & Gravel - Ravenna, OH","43005-01","02SD23","Sand, 703.02 Concrete, Acid Insoluble","Sand & Gravel"]
["Belpre S&G - Little Hocking, OH (49050-01)","49050-01",2008,"No. 8 Agg, 703.02 Concrete (Gravel)","Sand & Gravel",null,null,null,null,null,null,"Belpre S&G - Little Hocking, OH","49050-01",2008,"No. 8 Agg, 703.02 Concrete","Sand & Gravel"]
["Belpre S&G - Little Hocking, OH (49050-01)","49050-01","02SD2","Sand, 703.02 Concrete ","Sand & Gravel",null,null,null,null,null,null,"Belpre S&G - Little Hocking, OH","49050-01","02SD2","Sand, 703.02 Concrete","Sand & Gravel"]
[{"$f":"L65&\" (\"&M65&\")\"","v":"Belpre S&G - Little Hocking, OH (49050-01)"},{"$f":"M65","v":"49050-01"},{"$f":"N65","v":20570},"No. 57 Agg, 703.02 Super-Structure (Gravel)","Sand & Gravel",null,null,null,null,null,null,"Belpre S&G - Little Hocking, OH","49050-01",20570,"No. 57 Agg, 703.02 Super-Structure","Sand & Gravel"]
["Belpre S&G - Little Hocking, OH (49050-01)","49050-01",2057,{"$f":"IF(ISNUMBER(SEARCH(\"MicroSilica\",O66)),REPLACE(O66,19,11,\", SS847/848\"),O66)&\" \"&IF(ISNUMBER(SEARCH(\"Sand\",O66)),\"\",IF(ISNUMBER(SEARCH(\"Limestone\",P66)),\"(Limestone)\",IF(ISNUMBER(SEARCH(\"Dolostone\",P66)),\"(Dolostone)\",IF(ISNUMBER(SEARCH(\"Gravel (Crushed)\",P66)),\"(Gravel (Crushed))\",IF(ISNUMBER(SEARCH(\"Gravel (100% Crushed)\",P66)),\"(Gravel (100% Crushed))\",IF(ISNUMBER(SEARCH(\"Slag\",P66)),\"(Slag (ACBF))\",IF(ISNUMBER(SEARCH(\"Gravel (Blended W/ Olen-Columbus Limestone)\",P66)),\"(Gravel (Blended W/ Limestone))\",IF(ISNUMBER(SEARCH(\"Gravel (Benefited: 40% Crushed)\",P66)),\"(Gravel (40% Crushed))\",IF(ISNUMBER(SEARCH(\"Sand & Gravel\",P66)),\"(Gravel)\",IF(ISNUMBER(SEARCH(\"Trap Rock\",P66)),\"(Trap Rock)\"))))))))))","v":"No. 57 Agg, 703.02 Concrete (Gravel)"},{"$f":"P66","v":"Sand & Gravel"},null,null,null,null,null,null,"Belpre S&G - Little Hocking, OH","49050-01",2057,"No. 57 Agg, 703.02 Concrete","Sand & Gravel"]
["Belpre S&G - Little Hocking, OH (49050-01)","49050-01","02SD23","Sand, 703.02 Concrete, Acid Insoluble ","Sand & Gravel",null,null,null,null,null,null,"Belpre S&G - Little Hocking, OH","49050-01","02SD23","Sand, 703.02 Concrete, Acid Insoluble","Sand & Gravel"]
["C.F. Poeppelman - Bradford, OH (46031-01)","46031-01",20080,"No. 8 Agg, 703.02 Super-Structure (Limestone)","Limestone",null,null,null,null,null,null,"C.F. Poeppelman - Bradford, OH","46031-01",20080,"No. 8 Agg, 703.02 Super-Structure","Limestone"]
["C.F. Poeppelman - Bradford, OH (46031-01)","46031-01",20081,"No. 8 Agg, 703.02 Concrete Overlay (Limestone)","Limestone",null,null,null,null,null,null,"C.F. Poeppelman - Bradford, OH","46031-01",20081,"No. 8 Agg, 703.02 Concrete Overlay","Limestone"]
["C.F. Poeppelman - Bradford, OH (46031-01)","46031-01",2008,"No. 8 Agg, 703.02 Concrete (Limestone)","Limestone",null,null,null,null,null,null,"C.F. Poeppelman - Bradford, OH","46031-01",2008,"No. 8 Agg, 703.02 Concrete","Limestone"]
["C.F. Poeppelman - Bradford, OH (46031-01)","46031-01",20570,"No. 57 Agg, 703.02 Super-Structure (Limestone)","Limestone",null,null,null,null,null,null,"C.F. Poeppelman - Bradford, OH","46031-01",20570,"No. 57 Agg, 703.02 Super-Structure","Limestone"]
["C.F. Poeppelman - Bradford, OH (46031-01)","46031-01",2057,"No. 57 Agg, 703.02 Concrete (Limestone)","Limestone",null,null,null,null,null,null,"C.F. Poeppelman - Bradford, OH","46031-01",2057,"No. 57 Agg, 703.02 Concrete","Limestone"]
["C.F. Poeppelman - Bradford, OH (46031-01)","46031-01",20572,"No. 57 Agg, 703.13 Freeze-Thaw (Limestone)","Limestone",null,null,null,null,null,null,"C.F. Poeppelman - Bradford, OH","46031-01",20572,"No. 57 Agg, 703.13 Freeze-Thaw","Limestone"]
["Cardinal Agg - Perrysburg, OH (41058-01)","41058-01",20081,"No. 8 Agg, 703.02 Concrete Overlay (Limestone)","Limestone",null,null,null,null,null,null,"Cardinal Agg - Perrysburg, OH","41058-01",20081,"No. 8 Agg, 703.02 Concrete Overlay","Limestone"]
["Cardinal Agg - Perrysburg, OH (41058-01)","41058-01",2008,"No. 8 Agg, 703.02 Concrete (Limestone)","Limestone",null,null,null,null,null,null,"Cardinal Agg - Perrysburg, OH","41058-01",2008,"No. 8 Agg, 703.02 Concrete","Limestone"]
["Cardinal Agg - Perrysburg, OH (41058-01)","41058-01",20080,"No. 8 Agg, 703.02 Super-Structure (Limestone)","Limestone",null,null,null,null,null,null,"Cardinal Agg - Perrysburg, OH","41058-01",20080,"No. 8 Agg, 703.02 Super-Structure","Limestone"]
["Cardinal Agg - Perrysburg, OH (41058-01)","41058-01",2057,"No. 57 Agg, 703.02 Concrete (Limestone)","Limestone",null,null,null,null,null,null,"Cardinal Agg - Perrysburg, OH","41058-01",2057,"No. 57 Agg, 703.02 Concrete","Limestone"]
["Cardinal Agg - Perrysburg, OH (41058-01)","41058-01",20570,"No. 57 Agg, 703.02 Super-Structure (Limestone)","Limestone",null,null,null,null,null,null,"Cardinal Agg - Perrysburg, OH","41058-01",20570,"No. 57 Agg, 703.02 Super-Structure","Limestone"]
["Cardinal Agg - Perrysburg, OH (41058-01)","41058-01",20572,"No. 57 Agg, 703.13 Freeze-Thaw (Limestone)","Limestone",null,null,null,null,null,null,"Cardinal Agg - Perrysburg, OH","41058-01",20572,"No. 57 Agg, 703.13 Freeze-Thaw","Limestone"]
["Carmeuse - Butler, KY (47041-01)","47041-01",20080,"No. 8 Agg, 703.02 Super-Structure (Limestone)","Indirect-Out-of-State / Limestone",null,null,null,null,null,null,"Carmeuse - Butler, KY","47041-01",20080,"No. 8 Agg, 703.02 Super-Structure","Indirect-Out-of-State / Limestone"]
["Carmeuse - Butler, KY (47041-01)","47041-01",20081,"No. 8 Agg, 703.02 Concrete Overlay (Limestone)","Indirect-Out-of-State / Limestone",null,null,null,null,null,null,"Carmeuse - Butler, KY","47041-01",20081,"No. 8 Agg, 703.02 Concrete Overlay","Indirect-Out-of-State / Limestone"]
["Carmeuse - Butler, KY (47041-01)","47041-01",2008,"No. 8 Agg, 703.02 Concrete (Limestone)","Indirect-Out-of-State / Limestone",null,null,null,null,null,null,"Carmeuse - Butler, KY","47041-01",2008,"No. 8 Agg, 703.02 Concrete","Indirect-Out-of-State / Limestone"]
["Carmeuse - Cedarville, MI (51015-01)","51015-01",20570,"No. 57 Agg, 703.02 Super-Structure (Limestone)","Indirect-Out-of-State / Limestone",null,null,null,null,null,null,"Carmeuse - Cedarville, MI","51015-01",20570,"No. 57 Agg, 703.02 Super-Structure","Indirect-Out-of-State / Limestone"]
["Carmeuse - Cedarville, MI (51015-01)","51015-01",2067,"No. 67 Agg, 703.02 Concrete (Limestone)","Indirect-Out-of-State / Limestone",null,null,null,null,null,null,"Carmeuse - Cedarville, MI","51015-01",2067,"No. 67 Agg, 703.02 Concrete","Indirect-Out-of-State / Limestone"]
["Carmeuse - Cedarville, MI (51015-01)","51015-01",20670,"No. 67 Agg, 703.02 Super-Structure (Limestone)","Indirect-Out-of-State / Limestone",null,null,null,null,null,null,"Carmeuse - Cedarville, MI","51015-01",20670,"No. 67 Agg, 703.02 Super-Structure","Indirect-Out-of-State / Limestone"]
["Carmeuse - Cedarville, MI (51015-01)","51015-01",2057,"No. 57 Agg, 703.02 Concrete (Limestone)","Indirect-Out-of-State / Limestone",null,null,null,null,null,null,"Carmeuse - Cedarville, MI","51015-01",2057,"No. 57 Agg, 703.02 Concrete","Indirect-Out-of-State / Limestone"]
["Carmeuse - Cedarville, MI (51015-01)","51015-01","02008M1","No. 8 Agg, 703.02 Concrete Overlay, Mod Grading (Limestone)","Indirect-Out-of-State / Limestone",null,null,null,null,null,null,"Carmeuse - Cedarville, MI","51015-01","02008M1","No. 8 Agg, 703.02 Concrete Overlay, Mod Grading","Indirect-Out-of-State / Limestone"]
["Carmeuse - Cedarville, MI (51015-01)","51015-01","02008M0","No. 8 Agg, 703.02 Super-Structure, Mod Grading (Limestone)","Indirect-Out-of-State / Limestone",null,null,null,null,null,null,"Carmeuse - Cedarville, MI","51015-01","02008M0","No. 8 Agg, 703.02 Super-Structure, Mod Grading","Indirect-Out-of-State / Limestone"]
["Carmeuse - Cedarville, MI (51015-01)","51015-01","02008M","No. 8 Agg, 703.02 Concrete, Mod Grading (Limestone)","Indirect-Out-of-State / Limestone",null,null,null,null,null,null,"Carmeuse - Cedarville, MI","51015-01","02008M","No. 8 Agg, 703.02 Concrete, Mod Grading","Indirect-Out-of-State / Limestone"]
["Carmeuse - Gulliver, MI (51006-01)","51006-01","02008M","No. 8 Agg, 703.02 Concrete, Mod Grading (Limestone)","Indirect-Out-of-State / Limestone",null,null,null,null,null,null,"Carmeuse - Gulliver, MI","51006-01","02008M","No. 8 Agg, 703.02 Concrete, Mod Grading","Indirect-Out-of-State / Limestone"]
["Carmeuse - Gulliver, MI (51006-01)","51006-01",20080,"No. 8 Agg, 703.02 Super-Structure (Limestone)","Indirect-Out-of-State / Limestone",null,null,null,null,null,null,"Carmeuse - Gulliver, MI","51006-01",20080,"No. 8 Agg, 703.02 Super-Structure","Indirect-Out-of-State / Limestone"]
["Carmeuse - Gulliver, MI (51006-01)","51006-01",20081,"No. 8 Agg, 703.02 Concrete Overlay (Limestone)","Indirect-Out-of-State / Limestone",null,null,null,null,null,null,"Carmeuse - Gulliver, MI","51006-01",20081,"No. 8 Agg, 703.02 Concrete Overlay","Indirect-Out-of-State / Limestone"]
["Carmeuse - Gulliver, MI (51006-01)","51006-01",2008,"No. 8 Agg, 703.02 Concrete (Limestone)","Indirect-Out-of-State / Limestone",null,null,null,null,null,null,"Carmeuse - Gulliver, MI","51006-01",2008,"No. 8 Agg, 703.02 Concrete","Indirect-Out-of-State / Limestone"]
["Carmeuse - Gulliver, MI (51006-01)","51006-01",20570,"No. 57 Agg, 703.02 Super-Structure (Limestone)","Indirect-Out-of-State / Limestone",null,null,null,null,null,null,"Carmeuse - Gulliver, MI","51006-01",20570,"No. 57 Agg, 703.02 Super-Structure","Indirect-Out-of-State / Limestone"]
["Carmeuse - Gulliver, MI (51006-01)","51006-01",2057,"No. 57 Agg, 703.02 Concrete (Limestone)","Indirect-Out-of-State / Limestone",null,null,null,null,null,null,"Carmeuse - Gulliver, MI","51006-01",2057,"No. 57 Agg, 703.02 Concrete","Indirect-Out-of-State / Limestone"]
["Carmeuse - Maysville, KY (48028-01)","48028-01",20080,"No. 8 Agg, 703.02 Super-Structure (Limestone)","Indirect-Out-of-State / Limestone",null,null,null,null,null,null,"Carmeuse - Maysville, KY","48028-01",20080,"No. 8 Agg, 703.02 Super-Structure","Indirect-Out-of-State / Limestone"]
["Carmeuse - Maysville, KY (48028-01)","48028-01",20081,"No. 8 Agg, 703.02 Concrete Overlay (Limestone)","Indirect-Out-of-State / Limestone",null,null,null,null,null,null,"Carmeuse - Maysville, KY","48028-01",20081,"No. 8 Agg, 703.02 Concrete Overlay","Indirect-Out-of-State / Limestone"]
["Carmeuse - Maysville, KY (48028-01)","48028-01",2008,"No. 8 Agg, 703.02 Concrete (Limestone)","Indirect-Out-of-State / Limestone",null,null,null,null,null,null,"Carmeuse - Maysville, KY","48028-01",2008,"No. 8 Agg, 703.02 Concrete","Indirect-Out-of-State / Limestone"]
["Carmeuse - Rogers City, MI (51016-01)","51016-01",20572,"No. 57 Agg, 703.13 Freeze-Thaw (Limestone)","Indirect-Out-of-State / Limestone",null,null,null,null,null,null,"Carmeuse - Rogers City, MI","51016-01",20572,"No. 57 Agg, 703.13 Freeze-Thaw","Indirect-Out-of-State / Limestone"]
["Carmeuse - Rogers City, MI (51016-01)","51016-01",20080,"No. 8 Agg, 703.02 Super-Structure (Limestone)","Indirect-Out-of-State / Limestone",null,null,null,null,null,null,"Carmeuse - Rogers City, MI","51016-01",20080,"No. 8 Agg, 703.02 Super-Structure","Indirect-Out-of-State / Limestone"]
["Carmeuse - Rogers City, MI (51016-01)","51016-01",2008,"No. 8 Agg, 703.02 Concrete (Limestone)","Indirect-Out-of-State / Limestone",null,null,null,null,null,null,"Carmeuse - Rogers City, MI","51016-01",2008,"No. 8 Agg, 703.02 Concrete","Indirect-Out-of-State / Limestone"]
["Carmeuse - Rogers City, MI (51016-01)","51016-01",20570,"No. 57 Agg, 703.02 Super-Structure (Limestone)","Indirect-Out-of-State / Limestone",null,null,null,null,null,null,"Carmeuse - Rogers City, MI","51016-01",20570,"No. 57 Agg, 703.02 Super-Structure","Indirect-Out-of-State / Limestone"]
["Carmeuse - Rogers City, MI (51016-01)","51016-01",20081,"No. 8 Agg, 703.02 Concrete Overlay (Limestone)","Indirect-Out-of-State / Limestone",null,null,null,null,null,null,"Carmeuse - Rogers City, MI","51016-01",20081,"No. 8 Agg, 703.02 Concrete Overlay","Indirect-Out-of-State / Limestone"]
["Carmeuse - Rogers City, MI (51016-01)","51016-01",2057,"No. 57 Agg, 703.02 Concrete (Limestone)","Indirect-Out-of-State / Limestone",null,null,null,null,null,null,"Carmeuse - Rogers City, MI","51016-01",2057,"No. 57 Agg, 703.02 Concrete","Indirect-Out-of-State / Limestone"]
["Clark Clay - Newcomerstown, OH (44038-01)","44038-01","02SD2","Sand, 703.02 Concrete ","Sand & Gravel",null,null,null,null,null,null,"Clark Clay - Newcomerstown, OH","44038-01","02SD2","Sand, 703.02 Concrete","Sand & Gravel"]
["Clark Clay - Newcomerstown, OH (44038-01)","44038-01",2008,"No. 8 Agg, 703.02 Concrete (Gravel)","Sand & Gravel",null,null,null,null,null,null,"Clark Clay - Newcomerstown, OH","44038-01",2008,"No. 8 Agg, 703.02 Concrete","Sand & Gravel"]
["Clark Clay - Newcomerstown, OH (44038-01)","44038-01",2057,"No. 57 Agg, 703.02 Concrete (Gravel)","Sand & Gravel",null,null,null,null,null,null,"Clark Clay - Newcomerstown, OH","44038-01",2057,"No. 57 Agg, 703.02 Concrete","Sand & Gravel"]
["Clark Clay - Newcomerstown, OH (44038-01)","44038-01",20570,"No. 57 Agg, 703.02 Super-Structure (Gravel)","Sand & Gravel",null,null,null,null,null,null,"Clark Clay - Newcomerstown, OH","44038-01",20570,"No. 57 Agg, 703.02 Super-Structure","Sand & Gravel"]
["Clark Clay - Newcomerstown, OH (44038-01)","44038-01",20080,"No. 8 Agg, 703.02 Super-Structure (Gravel)","Sand & Gravel",null,null,null,null,null,null,"Clark Clay - Newcomerstown, OH","44038-01",20080,"No. 8 Agg, 703.02 Super-Structure","Sand & Gravel"]
["Clark Clay - Newcomerstown, OH (44038-01)","44038-01","02SD23","Sand, 703.02 Concrete, Acid Insoluble ","Sand & Gravel",null,null,null,null,null,null,"Clark Clay - Newcomerstown, OH","44038-01","02SD23","Sand, 703.02 Concrete, Acid Insoluble","Sand & Gravel"]
["Clark Clay - Newcomerstown, OH (44038-01)","44038-01",20572,"No. 57 Agg, 703.13 Freeze-Thaw (Gravel)","Sand & Gravel",null,null,null,null,null,null,"Clark Clay - Newcomerstown, OH","44038-01",20572,"No. 57 Agg, 703.13 Freeze-Thaw","Sand & Gravel"]
["Clifford Aggregate - Angola, IN (41061-01)","41061-01","02SD2","Sand, 703.02 Concrete ","Sand & Gravel",null,null,null,null,null,null,"Clifford Aggregate - Angola, IN","41061-01","02SD2","Sand, 703.02 Concrete","Sand & Gravel"]
["Clifford Aggregate - Angola, IN (41061-01)","41061-01","02SD23","Sand, 703.02 Concrete, Acid Insoluble ","Sand & Gravel",null,null,null,null,null,null,"Clifford Aggregate - Angola, IN","41061-01","02SD23","Sand, 703.02 Concrete, Acid Insoluble","Sand & Gravel"]
["Clifford Aggregate - Wolcottville, IN (41062-01)","41062-01","02SD23","Sand, 703.02 Concrete, Acid Insoluble ","Sand & Gravel",null,null,null,null,null,null,"Clifford Aggregate - Wolcottville, IN","41062-01","02SD23","Sand, 703.02 Concrete, Acid Insoluble","Sand & Gravel"]
["Clifford Aggregate - Wolcottville, IN (41062-01)","41062-01","02SD2","Sand, 703.02 Concrete ","Sand & Gravel",null,null,null,null,null,null,"Clifford Aggregate - Wolcottville, IN","41062-01","02SD2","Sand, 703.02 Concrete","Sand & Gravel"]
["Coshocton Materials - Coshocton, OH (44039-01)","44039-01","02SD23","Sand, 703.02 Concrete, Acid Insoluble ","Sand & Gravel",null,null,null,null,null,null,"Coshocton Materials - Coshocton, OH","44039-01","02SD23","Sand, 703.02 Concrete, Acid Insoluble","Sand & Gravel"]
["Coshocton Materials - Coshocton, OH (44039-01)","44039-01","02SD2","Sand, 703.02 Concrete ","Sand & Gravel",null,null,null,null,null,null,"Coshocton Materials - Coshocton, OH","44039-01","02SD2","Sand, 703.02 Concrete","Sand & Gravel"]
["D & K Materials - Mogadore, OH (43097-01)","43097-01","02SD2","Sand, 703.02 Concrete ","Sand & Gravel",null,null,null,null,null,null,"D & K Materials - Mogadore, OH","43097-01","02SD2","Sand, 703.02 Concrete","Sand & Gravel"]
["D & K Materials - Mogadore, OH (43097-01)","43097-01","02SD23","Sand, 703.02 Concrete, Acid Insoluble ","Sand & Gravel",null,null,null,null,null,null,"D & K Materials - Mogadore, OH","43097-01","02SD23","Sand, 703.02 Concrete, Acid Insoluble","Sand & Gravel"]
["Drummond Isle Stone - Drummond, MI (51011-01)","51011-01",2008,"No. 8 Agg, 703.02 Concrete (Limestone)","Indirect-Out-of-State / Limestone",null,null,null,null,null,null,"Drummond Isle Stone - Drummond, MI","51011-01",2008,"No. 8 Agg, 703.02 Concrete","Indirect-Out-of-State / Limestone"]
["Drummond Isle Stone - Drummond, MI (51011-01)","51011-01",20570,"No. 57 Agg, 703.02 Super-Structure (Limestone)","Indirect-Out-of-State / Limestone",null,null,null,null,null,null,"Drummond Isle Stone - Drummond, MI","51011-01",20570,"No. 57 Agg, 703.02 Super-Structure","Indirect-Out-of-State / Limestone"]
["Drummond Isle Stone - Drummond, MI (51011-01)","51011-01",2057,"No. 57 Agg, 703.02 Concrete (Limestone)","Indirect-Out-of-State / Limestone",null,null,null,null,null,null,"Drummond Isle Stone - Drummond, MI","51011-01",2057,"No. 57 Agg, 703.02 Concrete","Indirect-Out-of-State / Limestone"]
["Duff Quarry - Huntsville, OH (46038-01)","46038-01",20080,"No. 8 Agg, 703.02 Super-Structure (Limestone)","Limestone",null,null,null,null,null,null,"Duff Quarry - Huntsville, OH","46038-01",20080,"No. 8 Agg, 703.02 Super-Structure","Limestone"]
["Duff Quarry - Huntsville, OH (46038-01)","46038-01",2008,"No. 8 Agg, 703.02 Concrete (Limestone)","Limestone",null,null,null,null,null,null,"Duff Quarry - Huntsville, OH","46038-01",2008,"No. 8 Agg, 703.02 Concrete","Limestone"]
["Duff Quarry - Huntsville, OH (46038-01)","46038-01",20570,"No. 57 Agg, 703.02 Super-Structure (Limestone)","Limestone",null,null,null,null,null,null,"Duff Quarry - Huntsville, OH","46038-01",20570,"No. 57 Agg, 703.02 Super-Structure","Limestone"]
["Duff Quarry - Huntsville, OH (46038-01)","46038-01",2057,"No. 57 Agg, 703.02 Concrete (Limestone)","Limestone",null,null,null,null,null,null,"Duff Quarry - Huntsville, OH","46038-01",2057,"No. 57 Agg, 703.02 Concrete","Limestone"]
["Duff Quarry - Huntsville, OH (46038-01)","46038-01",20572,"No. 57 Agg, 703.13 Freeze-Thaw (Limestone)","Limestone",null,null,null,null,null,null,"Duff Quarry - Huntsville, OH","46038-01",20572,"No. 57 Agg, 703.13 Freeze-Thaw","Limestone"]
["Eagle Materials - Germantown, OH (47030-01)","47030-01","02SD2","Sand, 703.02 Concrete ","Sand & Gravel",null,null,null,null,null,null,"Eagle Materials - Germantown, OH","47030-01","02SD2","Sand, 703.02 Concrete","Sand & Gravel"]
[{"$f":"L129&\" (\"&M129&\")\"","v":"Eagle Materials - Germantown, OH (47030-01)"},{"$f":"M129","v":"47030-01"},{"$f":"N129","v":2008},"No. 8 Agg, 703.02 Concrete (Gravel)","Sand & Gravel",null,null,null,null,null,null,"Eagle Materials - Germantown, OH","47030-01",2008,"No. 8 Agg, 703.02 Concrete","Sand & Gravel"]
["Eagle Materials - Germantown, OH (47030-01)","47030-01",2057,{"$f":"IF(ISNUMBER(SEARCH(\"MicroSilica\",O130)),REPLACE(O130,19,11,\", SS847/848\"),O130)&\" \"&IF(ISNUMBER(SEARCH(\"Sand\",O130)),\"\",IF(ISNUMBER(SEARCH(\"Limestone\",P130)),\"(Limestone)\",IF(ISNUMBER(SEARCH(\"Dolostone\",P130)),\"(Dolostone)\",IF(ISNUMBER(SEARCH(\"Gravel (Crushed)\",P130)),\"(Gravel (Crushed))\",IF(ISNUMBER(SEARCH(\"Gravel (100% Crushed)\",P130)),\"(Gravel (100% Crushed))\",IF(ISNUMBER(SEARCH(\"Slag\",P130)),\"(Slag (ACBF))\",IF(ISNUMBER(SEARCH(\"Gravel (Blended W/ Olen-Columbus Limestone)\",P130)),\"(Gravel (Blended W/ Limestone))\",IF(ISNUMBER(SEARCH(\"Gravel (Benefited: 40% Crushed)\",P130)),\"(Gravel (40% Crushed))\",IF(ISNUMBER(SEARCH(\"Sand & Gravel\",P130)),\"(Gravel)\",IF(ISNUMBER(SEARCH(\"Trap Rock\",P130)),\"(Trap Rock)\"))))))))))","v":"No. 57 Agg, 703.02 Concrete (Gravel)"},{"$f":"P130","v":"Sand & Gravel"},null,null,null,null,null,null,"Eagle Materials - Germantown, OH","47030-01",2057,"No. 57 Agg, 703.02 Concrete","Sand & Gravel"]
["Eagle Materials - Germantown, OH (47030-01)","47030-01",20572,"No. 57 Agg, 703.13 Freeze-Thaw (Gravel)","Sand & Gravel",null,null,null,null,null,null,"Eagle Materials - Germantown, OH","47030-01",20572,"No. 57 Agg, 703.13 Freeze-Thaw","Sand & Gravel"]
["Eagle Materials - Germantown, OH (47030-01)","47030-01","02SD23","Sand, 703.02 Concrete, Acid Insoluble ","Sand & Gravel",null,null,null,null,null,null,"Eagle Materials - Germantown, OH","47030-01","02SD23","Sand, 703.02 Concrete, Acid Insoluble","Sand & Gravel"]
["Enon S & G - Springfield, OH (46011-01)","46011-01",2057,"No. 57 Agg, 703.02 Concrete (Gravel)","Sand & Gravel",null,null,null,null,null,null,"Enon S & G - Springfield, OH","46011-01",2057,"No. 57 Agg, 703.02 Concrete","Sand & Gravel"]
["Enon S & G - Springfield, OH (46011-01)","46011-01","02SD2","Sand, 703.02 Concrete ","Sand & Gravel",null,null,null,null,null,null,"Enon S & G - Springfield, OH","46011-01","02SD2","Sand, 703.02 Concrete","Sand & Gravel"]
["Enon S & G - Springfield, OH (46011-01)","46011-01",2008,"No. 8 Agg, 703.02 Concrete (Gravel)","Sand & Gravel",null,null,null,null,null,null,"Enon S & G - Springfield, OH","46011-01",2008,"No. 8 Agg, 703.02 Concrete","Sand & Gravel"]
["Enon S & G - Springfield, OH (46011-01)","46011-01",20570,"No. 57 Agg, 703.02 Super-Structure (Gravel)","Sand & Gravel",null,null,null,null,null,null,"Enon S & G - Springfield, OH","46011-01",20570,"No. 57 Agg, 703.02 Super-Structure","Sand & Gravel"]
["Enon S & G - Springfield, OH (46011-01)","46011-01",20572,"No. 57 Agg, 703.13 Freeze-Thaw (Gravel)","Sand & Gravel",null,null,null,null,null,null,"Enon S & G - Springfield, OH","46011-01",20572,"No. 57 Agg, 703.13 Freeze-Thaw","Sand & Gravel"]
["Enon S & G - Springfield, OH (46011-01)","46011-01","02SD23","Sand, 703.02 Concrete, Acid Insoluble ","Sand & Gravel",null,null,null,null,null,null,"Enon S & G - Springfield, OH","46011-01","02SD23","Sand, 703.02 Concrete, Acid Insoluble","Sand & Gravel"]
["Erie Materials - Sandusky, OH (42006-01)","42006-01",20081,"No. 8 Agg, 703.02 Concrete Overlay (Limestone)","Limestone",null,null,null,null,null,null,"Erie Materials - Sandusky, OH","42006-01",20081,"No. 8 Agg, 703.02 Concrete Overlay","Limestone"]
["Erie Materials - Sandusky, OH (42006-01)","42006-01",2008,"No. 8 Agg, 703.02 Concrete (Limestone)","Limestone",null,null,null,null,null,null,"Erie Materials - Sandusky, OH","42006-01",2008,"No. 8 Agg, 703.02 Concrete","Limestone"]
["Erie Materials - Sandusky, OH (42006-01)","42006-01",20080,"No. 8 Agg, 703.02 Super-Structure (Limestone)","Limestone",null,null,null,null,null,null,"Erie Materials - Sandusky, OH","42006-01",20080,"No. 8 Agg, 703.02 Super-Structure","Limestone"]
["Erie Materials - Sandusky, OH (42006-01)","42006-01",2057,"No. 57 Agg, 703.02 Concrete (Limestone)","Limestone",null,null,null,null,null,null,"Erie Materials - Sandusky, OH","42006-01",2057,"No. 57 Agg, 703.02 Concrete","Limestone"]
["Erie Materials - Sandusky, OH (42006-01)","42006-01",20570,"No. 57 Agg, 703.02 Super-Structure (Limestone)","Limestone",null,null,null,null,null,null,"Erie Materials - Sandusky, OH","42006-01",20570,"No. 57 Agg, 703.02 Super-Structure","Limestone"]
["Erie Materials - Sandusky, OH (42006-01)","42006-01",2067,"No. 67 Agg, 703.02 Concrete (Limestone)","Limestone",null,null,null,null,null,null,"Erie Materials - Sandusky, OH","42006-01",2067,"No. 67 Agg, 703.02 Concrete","Limestone"]
["Erie Materials - Sandusky, OH (42006-01)","42006-01",20670,"No. 67 Agg, 703.02 Super-Structure (Limestone)","Limestone",null,null,null,null,null,null,"Erie Materials - Sandusky, OH","42006-01",20670,"No. 67 Agg, 703.02 Super-Structure","Limestone"]
["Ervin Hill - Hillsboro, OH (48039-01)","48039-01","02SD2","Sand, 703.02 Concrete ","Sand & Gravel",null,null,null,null,null,null,"Ervin Hill - Hillsboro, OH","48039-01","02SD2","Sand, 703.02 Concrete","Sand & Gravel"]
["Ervin Hill - Hillsboro, OH (48039-01)","48039-01",2008,"No. 8 Agg, 703.02 Concrete (Gravel)","Sand & Gravel",null,null,null,null,null,null,"Ervin Hill - Hillsboro, OH","48039-01",2008,"No. 8 Agg, 703.02 Concrete","Sand & Gravel"]
["Ervin Hill - Hillsboro, OH (48039-01)","48039-01",20080,"No. 8 Agg, 703.02 Super-Structure (Gravel)","Sand & Gravel",null,null,null,null,null,null,"Ervin Hill - Hillsboro, OH","48039-01",20080,"No. 8 Agg, 703.02 Super-Structure","Sand & Gravel"]
["Ervin Hill - Hillsboro, OH (48039-01)","48039-01","02SD23","Sand, 703.02 Concrete, Acid Insoluble ","Sand & Gravel",null,null,null,null,null,null,"Ervin Hill - Hillsboro, OH","48039-01","02SD23","Sand, 703.02 Concrete, Acid Insoluble","Sand & Gravel"]
["Evans S & G - Cincinnati, OH (47088-01)","47088-01",2008,"No. 8 Agg, 703.02 Concrete (Gravel)","Sand & Gravel",null,null,null,null,null,null,"Evans S & G - Cincinnati, OH","47088-01",2008,"No. 8 Agg, 703.02 Concrete","Sand & Gravel"]
["Evans S & G - Cincinnati, OH (47088-01)","47088-01",2057,"No. 57 Agg, 703.02 Concrete (Gravel)","Sand & Gravel",null,null,null,null,null,null,"Evans S & G - Cincinnati, OH","47088-01",2057,"No. 57 Agg, 703.02 Concrete","Sand & Gravel"]
["Evans S & G - Cincinnati, OH (47088-01)","47088-01","02SD2","Sand, 703.02 Concrete ","Sand & Gravel",null,null,null,null,null,null,"Evans S & G - Cincinnati, OH","47088-01","02SD2","Sand, 703.02 Concrete","Sand & Gravel"]
["Feikert S & G - Fredericksburg, OH (50009-01)","50009-01","02SD2","Sand, 703.02 Concrete ","Sand & Gravel",null,null,null,null,null,null,"Feikert S & G - Fredericksburg, OH","50009-01","02SD2","Sand, 703.02 Concrete","Sand & Gravel"]
["Gerken - Addison, MI (41022-01)","41022-01","02SD2","Sand, 703.02 Concrete ","Sand & Gravel",null,null,null,null,null,null,"Gerken - Addison, MI","41022-01","02SD2","Sand, 703.02 Concrete","Sand & Gravel"]
["Gerken - Addison, MI (41022-01)","41022-01","02SD23","Sand, 703.02 Concrete, Acid Insoluble ","Sand & Gravel",null,null,null,null,null,null,"Gerken - Addison, MI","41022-01","02SD23","Sand, 703.02 Concrete, Acid Insoluble","Sand & Gravel"]
["Gerken - Bluffton, OH (40001-01)","40001-01",20570,"No. 57 Agg, 703.02 Super-Structure (Limestone)","Limestone",null,null,null,null,null,null,"Gerken - Bluffton, OH","40001-01",20570,"No. 57 Agg, 703.02 Super-Structure","Limestone"]
["Gerken - Bluffton, OH (40001-01)","40001-01",2008,"No. 8 Agg, 703.02 Concrete (Limestone)","Limestone",null,null,null,null,null,null,"Gerken - Bluffton, OH","40001-01",2008,"No. 8 Agg, 703.02 Concrete","Limestone"]
["Gerken - Bluffton, OH (40001-01)","40001-01",2057,"No. 57 Agg, 703.02 Concrete (Limestone)","Limestone",null,null,null,null,null,null,"Gerken - Bluffton, OH","40001-01",2057,"No. 57 Agg, 703.02 Concrete","Limestone"]
["Gerken - Bluffton, OH (40001-01)","40001-01",20080,"No. 8 Agg, 703.02 Super-Structure (Limestone)","Limestone",null,null,null,null,null,null,"Gerken - Bluffton, OH","40001-01",20080,"No. 8 Agg, 703.02 Super-Structure","Limestone"]
["Gerken - Bluffton, OH (40001-01)","40001-01",20572,"No. 57 Agg, 703.13 Freeze-Thaw (Limestone)","Limestone",null,null,null,null,null,null,"Gerken - Bluffton, OH","40001-01",20572,"No. 57 Agg, 703.13 Freeze-Thaw","Limestone"]
["Gerken - Clinton, MI (41028-01)","41028-01","02SD2","Sand, 703.02 Concrete ","Sand & Gravel",null,null,null,null,null,null,"Gerken - Clinton, MI","41028-01","02SD2","Sand, 703.02 Concrete","Sand & Gravel"]
["Gerken - Clinton, MI (41028-01)","41028-01","02SD23","Sand, 703.02 Concrete, Acid Insoluble ","Sand & Gravel",null,null,null,null,null,null,"Gerken - Clinton, MI","41028-01","02SD23","Sand, 703.02 Concrete, Acid Insoluble","Sand & Gravel"]
["Gerken - Custar, OH (41013A-01)","41013A-01","02SD2","Sand, 703.02 Concrete ","Limestone (Upper Bench)",null,null,null,null,null,null,"Gerken - Custar, OH","41013A-01","02SD2","Sand, 703.02 Concrete","Limestone (Upper Bench)"]
["Gerken - Custar, OH (41013A-01)","41013A-01",20080,"No. 8 Agg, 703.02 Super-Structure (Limestone)","Limestone (Upper Bench)",null,null,null,null,null,null,"Gerken - Custar, OH","41013A-01",20080,"No. 8 Agg, 703.02 Super-Structure","Limestone (Upper Bench)"]
["Gerken - Custar, OH (41013A-01)","41013A-01",2008,"No. 8 Agg, 703.02 Concrete (Limestone)","Limestone (Upper Bench)",null,null,null,null,null,null,"Gerken - Custar, OH","41013A-01",2008,"No. 8 Agg, 703.02 Concrete","Limestone (Upper Bench)"]
["Gerken - Custar, OH (41013A-01)","41013A-01",20570,"No. 57 Agg, 703.02 Super-Structure (Limestone)","Limestone (Upper Bench)",null,null,null,null,null,null,"Gerken - Custar, OH","41013A-01",20570,"No. 57 Agg, 703.02 Super-Structure","Limestone (Upper Bench)"]
["Gerken - Custar, OH (41013A-01)","41013A-01",20081,"No. 8 Agg, 703.02 Concrete Overlay (Limestone)","Limestone (Upper Bench)",null,null,null,null,null,null,"Gerken - Custar, OH","41013A-01",20081,"No. 8 Agg, 703.02 Concrete Overlay","Limestone (Upper Bench)"]
["Gerken - Custar, OH (41013A-01)","41013A-01",2057,"No. 57 Agg, 703.02 Concrete (Limestone)","Limestone (Upper Bench)",null,null,null,null,null,null,"Gerken - Custar, OH","41013A-01",2057,"No. 57 Agg, 703.02 Concrete","Limestone (Upper Bench)"]
["Gerken - Custar, OH (41013A-01)","41013A-01",20572,"No. 57 Agg, 703.13 Freeze-Thaw (Limestone)","Limestone (Upper Bench)",null,null,null,null,null,null,"Gerken - Custar, OH","41013A-01",20572,"No. 57 Agg, 703.13 Freeze-Thaw","Limestone (Upper Bench)"]
["Gerken - Genoa, OH (41018-01)","41018-01",20081,"No. 8 Agg, 703.02 Concrete Overlay (Dolostone)","Dolostone",null,null,null,null,null,null,"Gerken - Genoa, OH","41018-01",20081,"No. 8 Agg, 703.02 Concrete Overlay","Dolostone"]
["Gerken - Genoa, OH (41018-01)","41018-01",2008,"No. 8 Agg, 703.02 Concrete (Dolostone)","Dolostone",null,null,null,null,null,null,"Gerken - Genoa, OH","41018-01",2008,"No. 8 Agg, 703.02 Concrete","Dolostone"]
["Gerken - Genoa, OH (41018-01)","41018-01",20080,"No. 8 Agg, 703.02 Super-Structure (Dolostone)","Dolostone",null,null,null,null,null,null,"Gerken - Genoa, OH","41018-01",20080,"No. 8 Agg, 703.02 Super-Structure","Dolostone"]
["Gerken - Genoa, OH (41018-01)","41018-01",2067,"No. 67 Agg, 703.02 Concrete (Dolostone)","Dolostone",null,null,null,null,null,null,"Gerken - Genoa, OH","41018-01",2067,"No. 67 Agg, 703.02 Concrete","Dolostone"]
["Gerken - Genoa, OH (41018-01)","41018-01",20670,"No. 67 Agg, 703.02 Super-Structure (Dolostone)","Dolostone",null,null,null,null,null,null,"Gerken - Genoa, OH","41018-01",20670,"No. 67 Agg, 703.02 Super-Structure","Dolostone"]
["Gerken - Genoa, OH (41018-01)","41018-01",2057,"No. 57 Agg, 703.02 Concrete (Dolostone)","Dolostone",null,null,null,null,null,null,"Gerken - Genoa, OH","41018-01",2057,"No. 57 Agg, 703.02 Concrete","Dolostone"]
["Gerken - Genoa, OH (41018-01)","41018-01",20570,"No. 57 Agg, 703.02 Super-Structure (Dolostone)","Dolostone",null,null,null,null,null,null,"Gerken - Genoa, OH","41018-01",20570,"No. 57 Agg, 703.02 Super-Structure","Dolostone"]
["Gerken - Genoa, OH (41018-01)","41018-01",20572,"No. 57 Agg, 703.13 Freeze-Thaw (Dolostone)","Dolostone",null,null,null,null,null,null,"Gerken - Genoa, OH","41018-01",20572,"No. 57 Agg, 703.13 Freeze-Thaw","Dolostone"]
["Gerken - Glacial S&G, MI (41056-01)","41056-01","02SD2","Sand, 703.02 Concrete ","Sand & Gravel",null,null,null,null,null,null,"Gerken - Glacial S&G, MI","41056-01","02SD2","Sand, 703.02 Concrete","Sand & Gravel"]
["Gerken - Paulding, OH (40002-01)","40002-01",20572,"No. 57 Agg, 703.13 Freeze-Thaw (Dolostone)","Dolostone",null,null,null,null,null,null,"Gerken - Paulding, OH","40002-01",20572,"No. 57 Agg, 703.13 Freeze-Thaw","Dolostone"]
["Gerken - Paulding, OH (40002-01)","40002-01",2057,"No. 57 Agg, 703.02 Concrete (Dolostone)","Dolostone",null,null,null,null,null,null,"Gerken - Paulding, OH","40002-01",2057,"No. 57 Agg, 703.02 Concrete","Dolostone"]
["Gerken - Paulding, OH (40002-01)","40002-01",20570,"No. 57 Agg, 703.02 Super-Structure (Dolostone)","Dolostone",null,null,null,null,null,null,"Gerken - Paulding, OH","40002-01",20570,"No. 57 Agg, 703.02 Super-Structure","Dolostone"]
["Gerken - Tecumseh, MI (41059-01)","41059-01","02SD2","Sand, 703.02 Concrete ","Sand & Gravel",null,null,null,null,null,null,"Gerken - Tecumseh, MI","41059-01","02SD2","Sand, 703.02 Concrete","Sand & Gravel"]
["Gerken - Waldron, OH (41020-01)","41020-01","02SD2","Sand, 703.02 Concrete ","Sand and Gravel",null,null,null,null,null,null,"Gerken - Waldron, OH","41020-01","02SD2","Sand, 703.02 Concrete","Sand and Gravel"]
["Gerken - Waldron, OH (41020-01)","41020-01","02SD23","Sand, 703.02 Concrete, Acid Insoluble ","Sand and Gravel",null,null,null,null,null,null,"Gerken - Waldron, OH","41020-01","02SD23","Sand, 703.02 Concrete, Acid Insoluble","Sand and Gravel"]
["Gerken - Waldron, OH (41020A-01)","41020A-01",2057,"No. 57 Agg, 703.02 Concrete (Gravel (Crushed))","Sand & Gravel (Crushed)",null,null,null,null,null,null,"Gerken - Waldron, OH","41020A-01",2057,"No. 57 Agg, 703.02 Concrete","Sand & Gravel (Crushed)"]
["Gerken - West Millgrove, OH (41008-01)","41008-01",2008,"No. 8 Agg, 703.02 Concrete (Limestone)","Limestone",null,null,null,null,null,null,"Gerken - West Millgrove, OH","41008-01",2008,"No. 8 Agg, 703.02 Concrete","Limestone"]
["Gerken - West Millgrove, OH (41008-01)","41008-01",20081,"No. 8 Agg, 703.02 Concrete Overlay (Limestone)","Limestone",null,null,null,null,null,null,"Gerken - West Millgrove, OH","41008-01",20081,"No. 8 Agg, 703.02 Concrete Overlay","Limestone"]
["Gerken - West Millgrove, OH (41008-01)","41008-01",20080,"No. 8 Agg, 703.02 Super-Structure (Limestone)","Limestone",null,null,null,null,null,null,"Gerken - West Millgrove, OH","41008-01",20080,"No. 8 Agg, 703.02 Super-Structure","Limestone"]
["Gerken - West Millgrove, OH (41008-01)","41008-01",20572,"No. 57 Agg, 703.13 Freeze-Thaw (Limestone)","Limestone",null,null,null,null,null,null,"Gerken - West Millgrove, OH","41008-01",20572,"No. 57 Agg, 703.13 Freeze-Thaw","Limestone"]
["Gerken - West Millgrove, OH (41008-01)","41008-01",2057,"No. 57 Agg, 703.02 Concrete (Limestone)","Limestone",null,null,null,null,null,null,"Gerken - West Millgrove, OH","41008-01",2057,"No. 57 Agg, 703.02 Concrete","Limestone"]
[{"$f":"L191&\" (\"&M191&\")\"","v":"Gerken - West Millgrove, OH (41008-01)"},{"$f":"M191","v":"41008-01"},{"$f":"N191","v":20570},"No. 57 Agg, 703.02 Super-Structure (Limestone)","Limestone",null,null,null,null,null,null,"Gerken - West Millgrove, OH","41008-01",20570,"No. 57 Agg, 703.02 Super-Structure","Limestone"]
["Gerken - West Millgrove, OH (41008-01)","41008-01",2067,{"$f":"IF(ISNUMBER(SEARCH(\"MicroSilica\",O192)),REPLACE(O192,19,11,\", SS847/848\"),O192)&\" \"&IF(ISNUMBER(SEARCH(\"Sand\",O192)),\"\",IF(ISNUMBER(SEARCH(\"Limestone\",P192)),\"(Limestone)\",IF(ISNUMBER(SEARCH(\"Dolostone\",P192)),\"(Dolostone)\",IF(ISNUMBER(SEARCH(\"Gravel (Crushed)\",P192)),\"(Gravel (Crushed))\",IF(ISNUMBER(SEARCH(\"Gravel (100% Crushed)\",P192)),\"(Gravel (100% Crushed))\",IF(ISNUMBER(SEARCH(\"Slag\",P192)),\"(Slag (ACBF))\",IF(ISNUMBER(SEARCH(\"Gravel (Blended W/ Olen-Columbus Limestone)\",P192)),\"(Gravel (Blended W/ Limestone))\",IF(ISNUMBER(SEARCH(\"Gravel (Benefited: 40% Crushed)\",P192)),\"(Gravel (40% Crushed))\",IF(ISNUMBER(SEARCH(\"Sand & Gravel\",P192)),\"(Gravel)\",IF(ISNUMBER(SEARCH(\"Trap Rock\",P192)),\"(Trap Rock)\"))))))))))","v":"No. 67 Agg, 703.02 Concrete (Limestone)"},{"$f":"P192","v":"Limestone"},null,null,null,null,null,null,"Gerken - West Millgrove, OH","41008-01",2067,"No. 67 Agg, 703.02 Concrete","Limestone"]
["Gerken - West Millgrove, OH (41008-01)","41008-01","02SD2","Sand, 703.02 Concrete ","Limestone",null,null,null,null,null,null,"Gerken - West Millgrove, OH","41008-01","02SD2","Sand, 703.02 Concrete","Limestone"]
["Heidelberg Material Midwest Agg. - Cleves, OH (47072-01)","47072-01",2008,"No. 8 Agg, 703.02 Concrete (Gravel)","Sand & Gravel",null,null,null,null,null,null,"Heidelberg Material Midwest Agg. - Cleves, OH","47072-01",2008,"No. 8 Agg, 703.02 Concrete","Sand & Gravel"]
["Heidelberg Material Midwest Agg. - Cleves, OH (47072-01)","47072-01","02SD2","Sand, 703.02 Concrete ","Sand & Gravel",null,null,null,null,null,null,"Heidelberg Material Midwest Agg. - Cleves, OH","47072-01","02SD2","Sand, 703.02 Concrete","Sand & Gravel"]
["Heidelberg Material Midwest Agg. - Cleves, OH (47072-01)","47072-01",2057,"No. 57 Agg, 703.02 Concrete (Gravel)","Sand & Gravel",null,null,null,null,null,null,"Heidelberg Material Midwest Agg. - Cleves, OH","47072-01",2057,"No. 57 Agg, 703.02 Concrete","Sand & Gravel"]
["Heidelberg Materials - Bessemer, PA (43011-01)","43011-01",2008,"No. 8 Agg, 703.02 Concrete (Limestone)","Limestone",null,null,null,null,null,null,"Heidelberg Materials - Bessemer, PA","43011-01",2008,"No. 8 Agg, 703.02 Concrete","Limestone"]
["Heidelberg Materials - Bessemer, PA (43011-01)","43011-01",2057,"No. 57 Agg, 703.02 Concrete (Limestone)","Limestone",null,null,null,null,null,null,"Heidelberg Materials - Bessemer, PA","43011-01",2057,"No. 57 Agg, 703.02 Concrete","Limestone"]
["Heidelberg Materials - Bessemer, PA (43011-01)","43011-01",20572,"No. 57 Agg, 703.13 Freeze-Thaw (Limestone)","Limestone",null,null,null,null,null,null,"Heidelberg Materials - Bessemer, PA","43011-01",20572,"No. 57 Agg, 703.13 Freeze-Thaw","Limestone"]
["Heidelberg Materials - Bloomville, OH (41014-01)","41014-01",20081,"No. 8 Agg, 703.02 Concrete Overlay (Limestone)","Limestone",null,null,null,null,null,null,"Heidelberg Materials - Bloomville, OH","41014-01",20081,"No. 8 Agg, 703.02 Concrete Overlay","Limestone"]
["Heidelberg Materials - Bloomville, OH (41014-01)","41014-01",2008,"No. 8 Agg, 703.02 Concrete (Limestone)","Limestone",null,null,null,null,null,null,"Heidelberg Materials - Bloomville, OH","41014-01",2008,"No. 8 Agg, 703.02 Concrete","Limestone"]
["Heidelberg Materials - Bloomville, OH (41014-01)","41014-01",20080,"No. 8 Agg, 703.02 Super-Structure (Limestone)","Limestone",null,null,null,null,null,null,"Heidelberg Materials - Bloomville, OH","41014-01",20080,"No. 8 Agg, 703.02 Super-Structure","Limestone"]
["Heidelberg Materials - Bloomville, OH (41014-01)","41014-01",2067,"No. 67 Agg, 703.02 Concrete (Limestone)","Limestone",null,null,null,null,null,null,"Heidelberg Materials - Bloomville, OH","41014-01",2067,"No. 67 Agg, 703.02 Concrete","Limestone"]
["Heidelberg Materials - Bloomville, OH (41014-01)","41014-01",20670,"No. 67 Agg, 703.02 Super-Structure (Limestone)","Limestone",null,null,null,null,null,null,"Heidelberg Materials - Bloomville, OH","41014-01",20670,"No. 67 Agg, 703.02 Super-Structure","Limestone"]
["Heidelberg Materials - Bloomville, OH (41014-01)","41014-01",2057,"No. 57 Agg, 703.02 Concrete (Limestone)","Limestone",null,null,null,null,null,null,"Heidelberg Materials - Bloomville, OH","41014-01",2057,"No. 57 Agg, 703.02 Concrete","Limestone"]
["Heidelberg Materials - Bloomville, OH (41014-01)","41014-01",20570,"No. 57 Agg, 703.02 Super-Structure (Limestone)","Limestone",null,null,null,null,null,null,"Heidelberg Materials - Bloomville, OH","41014-01",20570,"No. 57 Agg, 703.02 Super-Structure","Limestone"]
["Heidelberg Materials - Castalia, OH (42005C-01)","42005C-01",2004,"No. 4 Agg, 703.02 Concrete (Limestone)","Limestone (Bench 3 & 5 Blend)",null,null,null,null,null,null,"Heidelberg Materials - Castalia, OH","42005C-01",2004,"No. 4 Agg, 703.02 Concrete","Limestone (Bench 3 & 5 Blend)"]
["Heidelberg Materials - Castalia, OH (42005C-01)","42005C-01",20080,"No. 8 Agg, 703.02 Super-Structure (Limestone)","Limestone (Bench 3 & 5 Blend)",null,null,null,null,null,null,"Heidelberg Materials - Castalia, OH","42005C-01",20080,"No. 8 Agg, 703.02 Super-Structure","Limestone (Bench 3 & 5 Blend)"]
["Heidelberg Materials - Castalia, OH (42005C-01)","42005C-01",2008,"No. 8 Agg, 703.02 Concrete (Limestone)","Limestone (Bench 3 & 5 Blend)",null,null,null,null,null,null,"Heidelberg Materials - Castalia, OH","42005C-01",2008,"No. 8 Agg, 703.02 Concrete","Limestone (Bench 3 & 5 Blend)"]
["Heidelberg Materials - Castalia, OH (42005C-01)","42005C-01",20081,"No. 8 Agg, 703.02 Concrete Overlay (Limestone)","Limestone (Bench 3 & 5 Blend)",null,null,null,null,null,null,"Heidelberg Materials - Castalia, OH","42005C-01",20081,"No. 8 Agg, 703.02 Concrete Overlay","Limestone (Bench 3 & 5 Blend)"]
["Heidelberg Materials - Castalia, OH (42005D-01)","42005D-01",20570,"No. 57 Agg, 703.02 Super-Structure (Limestone)","Limestone (Bench 5)",null,null,null,null,null,null,"Heidelberg Materials - Castalia, OH","42005D-01",20570,"No. 57 Agg, 703.02 Super-Structure","Limestone (Bench 5)"]
["Heidelberg Materials - Castalia, OH (42005D-01)","42005D-01",2057,"No. 57 Agg, 703.02 Concrete (Limestone)","Limestone (Bench 5)",null,null,null,null,null,null,"Heidelberg Materials - Castalia, OH","42005D-01",2057,"No. 57 Agg, 703.02 Concrete","Limestone (Bench 5)"]
["Heidelberg Materials - Castalia, OH (42005D-01)","42005D-01",20572,"No. 57 Agg, 703.13 Freeze-Thaw (Limestone)","Limestone (Bench 5)",null,null,null,null,null,null,"Heidelberg Materials - Castalia, OH","42005D-01",20572,"No. 57 Agg, 703.13 Freeze-Thaw","Limestone (Bench 5)"]
["Heidelberg Materials - Connellsville, PA (50076-01)","50076-01",20570,"No. 57 Agg, 703.02 Super-Structure (Limestone)","Limestone",null,null,null,null,null,null,"Heidelberg Materials - Connellsville, PA","50076-01",20570,"No. 57 Agg, 703.02 Super-Structure","Limestone"]
["Heidelberg Materials - Connellsville, PA (50076-01)","50076-01",20080,"No. 8 Agg, 703.02 Super-Structure (Limestone)","Limestone",null,null,null,null,null,null,"Heidelberg Materials - Connellsville, PA","50076-01",20080,"No. 8 Agg, 703.02 Super-Structure","Limestone"]
["Heidelberg Materials - Connellsville, PA (50076-01)","50076-01",20081,"No. 8 Agg, 703.02 Concrete Overlay (Limestone)","Limestone",null,null,null,null,null,null,"Heidelberg Materials - Connellsville, PA","50076-01",20081,"No. 8 Agg, 703.02 Concrete Overlay","Limestone"]
["Heidelberg Materials - Connellsville, PA (50076-01)","50076-01",20572,"No. 57 Agg, 703.13 Freeze-Thaw (Limestone)","Limestone",null,null,null,null,null,null,"Heidelberg Materials - Connellsville, PA","50076-01",20572,"No. 57 Agg, 703.13 Freeze-Thaw","Limestone"]
["Heidelberg Materials - Connellsville, PA (50076-01)","50076-01",2008,"No. 8 Agg, 703.02 Concrete (Limestone)","Limestone",null,null,null,null,null,null,"Heidelberg Materials - Connellsville, PA","50076-01",2008,"No. 8 Agg, 703.02 Concrete","Limestone"]
["Heidelberg Materials - Connellsville, PA (50076-01)","50076-01",2057,"No. 57 Agg, 703.02 Concrete (Limestone)","Limestone",null,null,null,null,null,null,"Heidelberg Materials - Connellsville, PA","50076-01",2057,"No. 57 Agg, 703.02 Concrete","Limestone"]
["Heidelberg Materials - Grayson, KY (48037A-01)","48037A-01",2067,"No. 67 Agg, 703.02 Concrete (Limestone)","Limestone",null,null,null,null,null,null,"Heidelberg Materials - Grayson, KY","48037A-01",2067,"No. 67 Agg, 703.02 Concrete","Limestone"]
["Heidelberg Materials - Grayson, KY (48037A-01)","48037A-01",20672,"No. 67 Agg, 703.13 Freeze-Thaw (Limestone)","Limestone",null,null,null,null,null,null,"Heidelberg Materials - Grayson, KY","48037A-01",20672,"No. 67 Agg, 703.13 Freeze-Thaw","Limestone"]
["Heidelberg Materials - Peebles, OH (48020-01)","48020-01",20572,"No. 57 Agg, 703.13 Freeze-Thaw (Dolostone)","Dolostone",null,null,null,null,null,null,"Heidelberg Materials - Peebles, OH","48020-01",20572,"No. 57 Agg, 703.13 Freeze-Thaw","Dolostone"]
["Heidelberg Materials - Peebles, OH (48020-01)","48020-01",20672,"No. 67 Agg, 703.13 Freeze-Thaw (Dolostone)","Dolostone",null,null,null,null,null,null,"Heidelberg Materials - Peebles, OH","48020-01",20672,"No. 67 Agg, 703.13 Freeze-Thaw","Dolostone"]
["Heidelberg Materials - Peebles, OH (48020-01)","48020-01",20080,"No. 8 Agg, 703.02 Super-Structure (Dolostone)","Dolostone",null,null,null,null,null,null,"Heidelberg Materials - Peebles, OH","48020-01",20080,"No. 8 Agg, 703.02 Super-Structure","Dolostone"]
["Heidelberg Materials - Peebles, OH (48020-01)","48020-01",20081,"No. 8 Agg, 703.02 Concrete Overlay (Dolostone)","Dolostone",null,null,null,null,null,null,"Heidelberg Materials - Peebles, OH","48020-01",20081,"No. 8 Agg, 703.02 Concrete Overlay","Dolostone"]
["Heidelberg Materials - Peebles, OH (48020-01)","48020-01",2008,"No. 8 Agg, 703.02 Concrete (Dolostone)","Dolostone",null,null,null,null,null,null,"Heidelberg Materials - Peebles, OH","48020-01",2008,"No. 8 Agg, 703.02 Concrete","Dolostone"]
["Heidelberg Materials - Peebles, OH (48020-01)","48020-01",20570,"No. 57 Agg, 703.02 Super-Structure (Dolostone)","Dolostone",null,null,null,null,null,null,"Heidelberg Materials - Peebles, OH","48020-01",20570,"No. 57 Agg, 703.02 Super-Structure","Dolostone"]
["Heidelberg Materials - Peebles, OH (48020-01)","48020-01",2067,"No. 67 Agg, 703.02 Concrete (Dolostone)","Dolostone",null,null,null,null,null,null,"Heidelberg Materials - Peebles, OH","48020-01",2067,"No. 67 Agg, 703.02 Concrete","Dolostone"]
["Heidelberg Materials - Peebles, OH (48020-01)","48020-01",20670,"No. 67 Agg, 703.02 Super-Structure (Dolostone)","Dolostone",null,null,null,null,null,null,"Heidelberg Materials - Peebles, OH","48020-01",20670,"No. 67 Agg, 703.02 Super-Structure","Dolostone"]
["Heidelberg Materials - Peebles, OH (48020-01)","48020-01",2057,"No. 57 Agg, 703.02 Concrete (Dolostone)","Dolostone",null,null,null,null,null,null,"Heidelberg Materials - Peebles, OH","48020-01",2057,"No. 57 Agg, 703.02 Concrete","Dolostone"]
["Heidelberg Materials - Sandusky, OH (42004A-01)","42004A-01",20080,"No. 8 Agg, 703.02 Super-Structure (Limestone)","Limestone",null,null,null,null,null,null,"Heidelberg Materials - Sandusky, OH","42004A-01",20080,"No. 8 Agg, 703.02 Super-Structure","Limestone"]
["Heidelberg Materials - Sandusky, OH (42004A-01)","42004A-01",2008,"No. 8 Agg, 703.02 Concrete (Limestone)","Limestone",null,null,null,null,null,null,"Heidelberg Materials - Sandusky, OH","42004A-01",2008,"No. 8 Agg, 703.02 Concrete","Limestone"]
["Heidelberg Materials - Sandusky, OH (42004A-01)","42004A-01",20570,"No. 57 Agg, 703.02 Super-Structure (Limestone)","Limestone",null,null,null,null,null,null,"Heidelberg Materials - Sandusky, OH","42004A-01",20570,"No. 57 Agg, 703.02 Super-Structure","Limestone"]
["Heidelberg Materials - Sandusky, OH (42004A-01)","42004A-01",20081,"No. 8 Agg, 703.02 Concrete Overlay (Limestone)","Limestone",null,null,null,null,null,null,"Heidelberg Materials - Sandusky, OH","42004A-01",20081,"No. 8 Agg, 703.02 Concrete Overlay","Limestone"]
["Heidelberg Materials - Sandusky, OH (42004A-01)","42004A-01",2057,"No. 57 Agg, 703.02 Concrete (Limestone)","Limestone",null,null,null,null,null,null,"Heidelberg Materials - Sandusky, OH","42004A-01",2057,"No. 57 Agg, 703.02 Concrete","Limestone"]
["Heidelberg Materials - Sandusky, OH (42004A-01)","42004A-01",2004,"No. 4 Agg, 703.02 Concrete (Limestone)","Limestone",null,null,null,null,null,null,"Heidelberg Materials - Sandusky, OH","42004A-01",2004,"No. 4 Agg, 703.02 Concrete","Limestone"]
["Heidelberg Materials - Sylvania, OH (41011-01)","41011-01",20081,"No. 8 Agg, 703.02 Concrete Overlay (Limestone)","Limestone",null,null,null,null,null,null,"Heidelberg Materials - Sylvania, OH","41011-01",20081,"No. 8 Agg, 703.02 Concrete Overlay","Limestone"]
["Heidelberg Materials - Sylvania, OH (41011-01)","41011-01",2008,"No. 8 Agg, 703.02 Concrete (Limestone)","Limestone",null,null,null,null,null,null,"Heidelberg Materials - Sylvania, OH","41011-01",2008,"No. 8 Agg, 703.02 Concrete","Limestone"]
["Heidelberg Materials - Sylvania, OH (41011-01)","41011-01",20080,"No. 8 Agg, 703.02 Super-Structure (Limestone)","Limestone",null,null,null,null,null,null,"Heidelberg Materials - Sylvania, OH","41011-01",20080,"No. 8 Agg, 703.02 Super-Structure","Limestone"]
["Heidelberg Materials - Sylvania, OH (41011-01)","41011-01",2067,"No. 67 Agg, 703.02 Concrete (Limestone)","Limestone",null,null,null,null,null,null,"Heidelberg Materials - Sylvania, OH","41011-01",2067,"No. 67 Agg, 703.02 Concrete","Limestone"]
["Heidelberg Materials - Sylvania, OH (41011-01)","41011-01",20670,"No. 67 Agg, 703.02 Super-Structure (Limestone)","Limestone",null,null,null,null,null,null,"Heidelberg Materials - Sylvania, OH","41011-01",20670,"No. 67 Agg, 703.02 Super-Structure","Limestone"]
["Heidelberg Materials - Sylvania, OH (41011-01)","41011-01",2057,"No. 57 Agg, 703.02 Concrete (Limestone)","Limestone",null,null,null,null,null,null,"Heidelberg Materials - Sylvania, OH","41011-01",2057,"No. 57 Agg, 703.02 Concrete","Limestone"]
["Heidelberg Materials - Sylvania, OH (41011-01)","41011-01",20570,"No. 57 Agg, 703.02 Super-Structure (Limestone)","Limestone",null,null,null,null,null,null,"Heidelberg Materials - Sylvania, OH","41011-01",20570,"No. 57 Agg, 703.02 Super-Structure","Limestone"]
["Heidelberg Materials - Sylvania, OH (41011-01)","41011-01",20572,"No. 57 Agg, 703.13 Freeze-Thaw (Limestone)","Limestone",null,null,null,null,null,null,"Heidelberg Materials - Sylvania, OH","41011-01",20572,"No. 57 Agg, 703.13 Freeze-Thaw","Limestone"]
["Heidelberg Materials - Sylvania, OH (41011-01)","41011-01",20672,"No. 67 Agg, 703.13 Freeze-Thaw (Limestone)","Limestone",null,null,null,null,null,null,"Heidelberg Materials - Sylvania, OH","41011-01",20672,"No. 67 Agg, 703.13 Freeze-Thaw","Limestone"]
["Heidelberg Materials - Sylvania, OH (41011-01)","41011-01","02004M","No. 4 Agg, 703.02 Concrete, Mod Grading (Limestone)","Limestone",null,null,null,null,null,null,"Heidelberg Materials - Sylvania, OH","41011-01","02004M","No. 4 Agg, 703.02 Concrete, Mod Grading","Limestone"]
["Heidelberg Materials - Versailles, IN (47076-01)","47076-01",2057,"No. 57 Agg, 703.02 Concrete (Limestone)","Limestone",null,null,null,null,null,null,"Heidelberg Materials - Versailles, IN","47076-01",2057,"No. 57 Agg, 703.02 Concrete","Limestone"]
["Heidelberg Materials - Waterville, OH (41010-01)","41010-01",2008,"No. 8 Agg, 703.02 Concrete (Limestone)","Limestone",null,null,null,null,null,null,"Heidelberg Materials - Waterville, OH","41010-01",2008,"No. 8 Agg, 703.02 Concrete","Limestone"]
["Heidelberg Materials - Waterville, OH (41010-01)","41010-01",20081,"No. 8 Agg, 703.02 Concrete Overlay (Limestone)","Limestone",null,null,null,null,null,null,"Heidelberg Materials - Waterville, OH","41010-01",20081,"No. 8 Agg, 703.02 Concrete Overlay","Limestone"]
["Heidelberg Materials - Waterville, OH (41010-01)","41010-01",2057,"No. 57 Agg, 703.02 Concrete (Limestone)","Limestone",null,null,null,null,null,null,"Heidelberg Materials - Waterville, OH","41010-01",2057,"No. 57 Agg, 703.02 Concrete","Limestone"]
["Heidelberg Materials - Waterville, OH (41010-01)","41010-01",20570,"No. 57 Agg, 703.02 Super-Structure (Limestone)","Limestone",null,null,null,null,null,null,"Heidelberg Materials - Waterville, OH","41010-01",20570,"No. 57 Agg, 703.02 Super-Structure","Limestone"]
["Heidelberg Materials - Waterville, OH (41010-01)","41010-01",20572,"No. 57 Agg, 703.13 Freeze-Thaw (Limestone)","Limestone",null,null,null,null,null,null,"Heidelberg Materials - Waterville, OH","41010-01",20572,"No. 57 Agg, 703.13 Freeze-Thaw","Limestone"]
["Heidelberg Materials - Waterville, OH (41010-01)","41010-01",20080,"No. 8 Agg, 703.02 Super-Structure (Limestone)","Limestone",null,null,null,null,null,null,"Heidelberg Materials - Waterville, OH","41010-01",20080,"No. 8 Agg, 703.02 Super-Structure","Limestone"]
["Heidelberg Materials - Winchester, OH (48033-01)","48033-01",20080,"No. 8 Agg, 703.02 Super-Structure (Limestone)","Limestone",null,null,null,null,null,null,"Heidelberg Materials - Winchester, OH","48033-01",20080,"No. 8 Agg, 703.02 Super-Structure","Limestone"]
[{"$f":"L255&\" (\"&M255&\")\"","v":"Heidelberg Materials - Winchester, OH (48033-01)"},{"$f":"M255","v":"48033-01"},{"$f":"N255","v":2008},"No. 8 Agg, 703.02 Concrete (Limestone)","Limestone",null,null,null,null,null,null,"Heidelberg Materials - Winchester, OH","48033-01",2008,"No. 8 Agg, 703.02 Concrete","Limestone"]
["Heidelberg Materials - Winchester, OH (48033-01)","48033-01",20570,{"$f":"IF(ISNUMBER(SEARCH(\"MicroSilica\",O256)),REPLACE(O256,19,11,\", SS847/848\"),O256)&\" \"&IF(ISNUMBER(SEARCH(\"Sand\",O256)),\"\",IF(ISNUMBER(SEARCH(\"Limestone\",P256)),\"(Limestone)\",IF(ISNUMBER(SEARCH(\"Dolostone\",P256)),\"(Dolostone)\",IF(ISNUMBER(SEARCH(\"Gravel (Crushed)\",P256)),\"(Gravel (Crushed))\",IF(ISNUMBER(SEARCH(\"Gravel (100% Crushed)\",P256)),\"(Gravel (100% Crushed))\",IF(ISNUMBER(SEARCH(\"Slag\",P256)),\"(Slag (ACBF))\",IF(ISNUMBER(SEARCH(\"Gravel (Blended W/ Olen-Columbus Limestone)\",P256)),\"(Gravel (Blended W/ Limestone))\",IF(ISNUMBER(SEARCH(\"Gravel (Benefited: 40% Crushed)\",P256)),\"(Gravel (40% Crushed))\",IF(ISNUMBER(SEARCH(\"Sand & Gravel\",P256)),\"(Gravel)\",IF(ISNUMBER(SEARCH(\"Trap Rock\",P256)),\"(Trap Rock)\"))))))))))","v":"No. 57 Agg, 703.02 Super-Structure (Limestone)"},{"$f":"P256","v":"Limestone"},null,null,null,null,null,null,"Heidelberg Materials - Winchester, OH","48033-01",20570,"No. 57 Agg, 703.02 Super-Structure","Limestone"]
["Heidelberg Materials - Winchester, OH (48033-01)","48033-01",2057,"No. 57 Agg, 703.02 Concrete (Limestone)","Limestone",null,null,null,null,null,null,"Heidelberg Materials - Winchester, OH","48033-01",2057,"No. 57 Agg, 703.02 Concrete","Limestone"]
["Heidelberg Materials - Winchester, OH (48033-01)","48033-01",2067,"No. 67 Agg, 703.02 Concrete (Limestone)","Limestone",null,null,null,null,null,null,"Heidelberg Materials - Winchester, OH","48033-01",2067,"No. 67 Agg, 703.02 Concrete","Limestone"]
["Heidelberg Materials - Winchester, OH (48033-01)","48033-01",20081,"No. 8 Agg, 703.02 Concrete Overlay (Limestone)","Limestone",null,null,null,null,null,null,"Heidelberg Materials - Winchester, OH","48033-01",20081,"No. 8 Agg, 703.02 Concrete Overlay","Limestone"]
["Heidelberg Materials - Winchester, OH (48033-01)","48033-01",20572,"No. 57 Agg, 703.13 Freeze-Thaw (Limestone)","Limestone",null,null,null,null,null,null,"Heidelberg Materials - Winchester, OH","48033-01",20572,"No. 57 Agg, 703.13 Freeze-Thaw","Limestone"]
["Heidelberg Materials - Woodburn, IN (40025-01)","40025-01",20572,"No. 57 Agg, 703.13 Freeze-Thaw (Dolostone)","Dolostone",null,null,null,null,null,null,"Heidelberg Materials - Woodburn, IN","40025-01",20572,"No. 57 Agg, 703.13 Freeze-Thaw","Dolostone"]
["Heidelberg Materials - Woodburn, IN (40025-01)","40025-01",2057,"No. 57 Agg, 703.02 Concrete (Dolostone)","Dolostone",null,null,null,null,null,null,"Heidelberg Materials - Woodburn, IN","40025-01",2057,"No. 57 Agg, 703.02 Concrete","Dolostone"]
["Heidelberg Materials - Woodburn, IN (40025-01)","40025-01","02008M","No. 8 Agg, 703.02 Concrete, Mod Grading (Dolostone)","Dolostone",null,null,null,null,null,null,"Heidelberg Materials - Woodburn, IN","40025-01","02008M","No. 8 Agg, 703.02 Concrete, Mod Grading","Dolostone"]
["Heidelberg Materials Midwest Agg. - Angola, IN (41039-01)","41039-01","02SD2","Sand, 703.02 Concrete ","Sand & Gravel",null,null,null,null,null,null,"Heidelberg Materials Midwest Agg. - Angola, IN","41039-01","02SD2","Sand, 703.02 Concrete","Sand & Gravel"]
["Heidelberg Materials Midwest Agg. - Piketon, OH (48011-01)","48011-01","02SD2","Sand, 703.02 Concrete ","Sand & Gravel",null,null,null,null,null,null,"Heidelberg Materials Midwest Agg. - Piketon, OH","48011-01","02SD2","Sand, 703.02 Concrete","Sand & Gravel"]
["Heidelberg Materials Midwest Agg. - Piketon, OH (48011-01)","48011-01","02SD23","Sand, 703.02 Concrete, Acid Insoluble ","Sand & Gravel",null,null,null,null,null,null,"Heidelberg Materials Midwest Agg. - Piketon, OH","48011-01","02SD23","Sand, 703.02 Concrete, Acid Insoluble","Sand & Gravel"]
["Heidelberg Materials Midwest Agg. - Piketon, OH (48011-01)","48011-01",2057,"No. 57 Agg, 703.02 Concrete (Gravel)","Sand & Gravel",null,null,null,null,null,null,"Heidelberg Materials Midwest Agg. - Piketon, OH","48011-01",2057,"No. 57 Agg, 703.02 Concrete","Sand & Gravel"]
["Hilltop Basic - Battletown, KY (47071-01)","47071-01",2057,"No. 57 Agg, 703.02 Concrete (Limestone)","Indirect-Out-of-State / Limestone",null,null,null,null,null,null,"Hilltop Basic - Battletown, KY","47071-01",2057,"No. 57 Agg, 703.02 Concrete","Indirect-Out-of-State / Limestone"]
["Hilltop Basic - Butler, KY (47083-01)","47083-01",2008,"No. 8 Agg, 703.02 Concrete (Limestone)","Limestone",null,null,null,null,null,null,"Hilltop Basic - Butler, KY","47083-01",2008,"No. 8 Agg, 703.02 Concrete","Limestone"]
["Hilltop Basic - Butler, KY (47083-01)","47083-01",20570,"No. 57 Agg, 703.02 Super-Structure (Limestone)","Limestone",null,null,null,null,null,null,"Hilltop Basic - Butler, KY","47083-01",20570,"No. 57 Agg, 703.02 Super-Structure","Limestone"]
["Hilltop Basic - Butler, KY (47083-01)","47083-01",2057,"No. 57 Agg, 703.02 Concrete (Limestone)","Limestone",null,null,null,null,null,null,"Hilltop Basic - Butler, KY","47083-01",2057,"No. 57 Agg, 703.02 Concrete","Limestone"]
["Hilltop Basic - Patriot, IN (47019-01)","47019-01",2008,"No. 8 Agg, 703.02 Concrete (Gravel)","Indirect-Out-of-State / Sand & Gravel",null,null,null,null,null,null,"Hilltop Basic - Patriot, IN","47019-01",2008,"No. 8 Agg, 703.02 Concrete","Indirect-Out-of-State / Sand & Gravel"]
["Hilltop Basic - Patriot, IN (47019-01)","47019-01",20080,"No. 8 Agg, 703.02 Super-Structure (Gravel)","Indirect-Out-of-State / Sand & Gravel",null,null,null,null,null,null,"Hilltop Basic - Patriot, IN","47019-01",20080,"No. 8 Agg, 703.02 Super-Structure","Indirect-Out-of-State / Sand & Gravel"]
["Hilltop Basic - Patriot, IN (47019-01)","47019-01",20081,"No. 8 Agg, 703.02 Concrete Overlay (Gravel)","Indirect-Out-of-State / Sand & Gravel",null,null,null,null,null,null,"Hilltop Basic - Patriot, IN","47019-01",20081,"No. 8 Agg, 703.02 Concrete Overlay","Indirect-Out-of-State / Sand & Gravel"]
["Hilltop Basic - Patriot, IN (47019-01)","47019-01",2057,"No. 57 Agg, 703.02 Concrete (Gravel)","Indirect-Out-of-State / Sand & Gravel",null,null,null,null,null,null,"Hilltop Basic - Patriot, IN","47019-01",2057,"No. 57 Agg, 703.02 Concrete","Indirect-Out-of-State / Sand & Gravel"]
["Hilltop Basic - Patriot, IN (47019-01)","47019-01","02SD2","Sand, 703.02 Concrete ","Indirect-Out-of-State / Sand & Gravel",null,null,null,null,null,null,"Hilltop Basic - Patriot, IN","47019-01","02SD2","Sand, 703.02 Concrete","Indirect-Out-of-State / Sand & Gravel"]
["Hilltop Basic - Patriot, IN (47019-01)","47019-01",20570,"No. 57 Agg, 703.02 Super-Structure (Gravel)","Indirect-Out-of-State / Sand & Gravel",null,null,null,null,null,null,"Hilltop Basic - Patriot, IN","47019-01",20570,"No. 57 Agg, 703.02 Super-Structure","Indirect-Out-of-State / Sand & Gravel"]
["Hilltop Basic - Patriot, IN (47019-01)","47019-01","02009M","No. 9 Agg, 703.02 Concrete, Mod Grading (Gravel)","Indirect-Out-of-State / Sand & Gravel",null,null,null,null,null,null,"Hilltop Basic - Patriot, IN","47019-01","02009M","No. 9 Agg, 703.02 Concrete, Mod Grading","Indirect-Out-of-State / Sand & Gravel"]
["Hilltop Basic - Patriot, IN (47019A-01)","47019A-01",20080,"No. 8 Agg, 703.02 Super-Structure (Gravel)","Indirect-Out-of-State / Sand & Gravel",null,null,null,null,null,null,"Hilltop Basic - Patriot, IN","47019A-01",20080,"No. 8 Agg, 703.02 Super-Structure","Indirect-Out-of-State / Sand & Gravel"]
["Hilltop Basic - Patriot, IN (47019A-01)","47019A-01",20081,"No. 8 Agg, 703.02 Concrete Overlay (Gravel)","Indirect-Out-of-State / Sand & Gravel",null,null,null,null,null,null,"Hilltop Basic - Patriot, IN","47019A-01",20081,"No. 8 Agg, 703.02 Concrete Overlay","Indirect-Out-of-State / Sand & Gravel"]
["Hocking Valley Concrete - Logan, OH (49027-01)","49027-01","02SD2","Sand, 703.02 Concrete ","Sand & Gravel",null,null,null,null,null,null,"Hocking Valley Concrete - Logan, OH","49027-01","02SD2","Sand, 703.02 Concrete","Sand & Gravel"]
["Holcim - Manitoulin, ON (51014-01)","51014-01",20080,"No. 8 Agg, 703.02 Super-Structure (Limestone)","Indirect-Out-of-State / Limestone",null,null,null,null,null,null,"Holcim - Manitoulin, ON","51014-01",20080,"No. 8 Agg, 703.02 Super-Structure","Indirect-Out-of-State / Limestone"]
["Holcim - Manitoulin, ON (51014-01)","51014-01",20081,"No. 8 Agg, 703.02 Concrete Overlay (Limestone)","Indirect-Out-of-State / Limestone",null,null,null,null,null,null,"Holcim - Manitoulin, ON","51014-01",20081,"No. 8 Agg, 703.02 Concrete Overlay","Indirect-Out-of-State / Limestone"]
["Holcim - Manitoulin, ON (51014-01)","51014-01",2008,"No. 8 Agg, 703.02 Concrete (Limestone)","Indirect-Out-of-State / Limestone",null,null,null,null,null,null,"Holcim - Manitoulin, ON","51014-01",2008,"No. 8 Agg, 703.02 Concrete","Indirect-Out-of-State / Limestone"]
["Holcim - Manitoulin, ON (51014-01)","51014-01",20570,"No. 57 Agg, 703.02 Super-Structure (Limestone)","Indirect-Out-of-State / Limestone",null,null,null,null,null,null,"Holcim - Manitoulin, ON","51014-01",20570,"No. 57 Agg, 703.02 Super-Structure","Indirect-Out-of-State / Limestone"]
["Holcim - Manitoulin, ON (51014-01)","51014-01",2057,"No. 57 Agg, 703.02 Concrete (Limestone)","Indirect-Out-of-State / Limestone",null,null,null,null,null,null,"Holcim - Manitoulin, ON","51014-01",2057,"No. 57 Agg, 703.02 Concrete","Indirect-Out-of-State / Limestone"]
["Holcim - Manitoulin, ON (51014-01)","51014-01",20572,"No. 57 Agg, 703.13 Freeze-Thaw (Limestone)","Indirect-Out-of-State / Limestone",null,null,null,null,null,null,"Holcim - Manitoulin, ON","51014-01",20572,"No. 57 Agg, 703.13 Freeze-Thaw","Indirect-Out-of-State / Limestone"]
["Holcim - Marblehead, OH (41005-01)","41005-01",2008,"No. 8 Agg, 703.02 Concrete (Limestone)","Limestone",null,null,null,null,null,null,"Holcim - Marblehead, OH","41005-01",2008,"No. 8 Agg, 703.02 Concrete","Limestone"]
["Holcim - Marblehead, OH (41005-01)","41005-01",20081,"No. 8 Agg, 703.02 Concrete Overlay (Limestone)","Limestone",null,null,null,null,null,null,"Holcim - Marblehead, OH","41005-01",20081,"No. 8 Agg, 703.02 Concrete Overlay","Limestone"]
["Holcim - Marblehead, OH (41005-01)","41005-01",20080,"No. 8 Agg, 703.02 Super-Structure (Limestone)","Limestone",null,null,null,null,null,null,"Holcim - Marblehead, OH","41005-01",20080,"No. 8 Agg, 703.02 Super-Structure","Limestone"]
["Holcim - Marblehead, OH (41005-01)","41005-01",2057,"No. 57 Agg, 703.02 Concrete (Limestone)","Limestone",null,null,null,null,null,null,"Holcim - Marblehead, OH","41005-01",2057,"No. 57 Agg, 703.02 Concrete","Limestone"]
["Holcim - Marblehead, OH (41005-01)","41005-01",20570,"No. 57 Agg, 703.02 Super-Structure (Limestone)","Limestone",null,null,null,null,null,null,"Holcim - Marblehead, OH","41005-01",20570,"No. 57 Agg, 703.02 Super-Structure","Limestone"]
["Holcim - Marblehead, OH (41005-01)","41005-01",20572,"No. 57 Agg, 703.13 Freeze-Thaw (Limestone)","Limestone",null,null,null,null,null,null,"Holcim - Marblehead, OH","41005-01",20572,"No. 57 Agg, 703.13 Freeze-Thaw","Limestone"]
["Holcim - Marblehead, OH (41005-01)","41005-01",20670,"No. 67 Agg, 703.02 Super-Structure (Limestone)","Limestone",null,null,null,null,null,null,"Holcim - Marblehead, OH","41005-01",20670,"No. 67 Agg, 703.02 Super-Structure","Limestone"]
["Holcim - Presque Isle, MI (51009-01)","51009-01",20080,"No. 8 Agg, 703.02 Super-Structure (Limestone)","Indirect-Out-of-State / Limestone",null,null,null,null,null,null,"Holcim - Presque Isle, MI","51009-01",20080,"No. 8 Agg, 703.02 Super-Structure","Indirect-Out-of-State / Limestone"]
["Holcim - Presque Isle, MI (51009-01)","51009-01",20081,"No. 8 Agg, 703.02 Concrete Overlay (Limestone)","Indirect-Out-of-State / Limestone",null,null,null,null,null,null,"Holcim - Presque Isle, MI","51009-01",20081,"No. 8 Agg, 703.02 Concrete Overlay","Indirect-Out-of-State / Limestone"]
["Holcim - Presque Isle, MI (51009-01)","51009-01",2008,"No. 8 Agg, 703.02 Concrete (Limestone)","Indirect-Out-of-State / Limestone",null,null,null,null,null,null,"Holcim - Presque Isle, MI","51009-01",2008,"No. 8 Agg, 703.02 Concrete","Indirect-Out-of-State / Limestone"]
["Holcim - Presque Isle, MI (51009-01)","51009-01",20570,"No. 57 Agg, 703.02 Super-Structure (Limestone)","Indirect-Out-of-State / Limestone",null,null,null,null,null,null,"Holcim - Presque Isle, MI","51009-01",20570,"No. 57 Agg, 703.02 Super-Structure","Indirect-Out-of-State / Limestone"]
["Holcim - Presque Isle, MI (51009-01)","51009-01",2057,"No. 57 Agg, 703.02 Concrete (Limestone)","Indirect-Out-of-State / Limestone",null,null,null,null,null,null,"Holcim - Presque Isle, MI","51009-01",2057,"No. 57 Agg, 703.02 Concrete","Indirect-Out-of-State / Limestone"]
["Holcim - West Mifflin, PA (43063-01)","43063-01",2008,"No. 8 Agg, 703.02 Concrete (Slag (ACBF))","Slag (ACBF)",null,null,null,null,null,null,"Holcim - West Mifflin, PA","43063-01",2008,"No. 8 Agg, 703.02 Concrete","Slag (ACBF)"]
["Holcim - West Mifflin, PA (43063-01)","43063-01",2057,"No. 57 Agg, 703.02 Concrete (Slag (ACBF))","Slag (ACBF)",null,null,null,null,null,null,"Holcim - West Mifflin, PA","43063-01",2057,"No. 57 Agg, 703.02 Concrete","Slag (ACBF)"]
["Holmes Redimix Concrete - Millersburg, OH (50017-01)","50017-01","02SD2","Sand, 703.02 Concrete ","Sand & Gravel",null,null,null,null,null,null,"Holmes Redimix Concrete - Millersburg, OH","50017-01","02SD2","Sand, 703.02 Concrete","Sand & Gravel"]
["Holmes Redimix Concrete - Millersburg, OH (50017C-01)","50017C-01","02SD2","Sand, 703.02 Concrete ","Sand & Gravel",null,null,null,null,null,null,"Holmes Redimix Concrete - Millersburg, OH","50017C-01","02SD2","Sand, 703.02 Concrete","Sand & Gravel"]
["Holmes Supply - Holmesville, OH (50057-01)","50057-01","02SD2","Sand, 703.02 Concrete ","Sand & Gravel",null,null,null,null,null,null,"Holmes Supply - Holmesville, OH","50057-01","02SD2","Sand, 703.02 Concrete","Sand & Gravel"]
["Hugo Sand Company - Kent, OH (43015-01)","43015-01","02SD2","Sand, 703.02 Concrete ","Sand & Gravel",null,null,null,null,null,null,"Hugo Sand Company - Kent, OH","43015-01","02SD2","Sand, 703.02 Concrete","Sand & Gravel"]
["Irving Materials - Cambridge City, IN (47092-01)","47092-01","02SD2","Sand, 703.02 Concrete ","Sand & Gravel",null,null,null,null,null,null,"Irving Materials - Cambridge City, IN","47092-01","02SD2","Sand, 703.02 Concrete","Sand & Gravel"]
["Irving Materials - Cambridge City, IN (47092-01)","47092-01","02008M","No. 8 Agg, 703.02 Concrete, Mod Grading (Gravel)","Sand & Gravel",null,null,null,null,null,null,"Irving Materials - Cambridge City, IN","47092-01","02008M","No. 8 Agg, 703.02 Concrete, Mod Grading","Sand & Gravel"]
["Irving Materials - Cambridge City, IN (47092-01)","47092-01","02008M0","No. 8 Agg, 703.02 Super-Structure, Mod Grading (Gravel)","Sand & Gravel",null,null,null,null,null,null,"Irving Materials - Cambridge City, IN","47092-01","02008M0","No. 8 Agg, 703.02 Super-Structure, Mod Grading","Sand & Gravel"]
["Irving Materials - Connersville, IN (47050-01)","47050-01","02SD2","Sand, 703.02 Concrete ","Sand & Gravel",null,null,null,null,null,null,"Irving Materials - Connersville, IN","47050-01","02SD2","Sand, 703.02 Concrete","Sand & Gravel"]
["Irving Materials - Connersville, IN (47050-01)","47050-01","02008M","No. 8 Agg, 703.02 Concrete, Mod Grading (Gravel)","Sand & Gravel",null,null,null,null,null,null,"Irving Materials - Connersville, IN","47050-01","02008M","No. 8 Agg, 703.02 Concrete, Mod Grading","Sand & Gravel"]
["Irving Materials - Connersville, IN (47050-01)","47050-01","02008M0","No. 8 Agg, 703.02 Super-Structure, Mod Grading (Gravel)","Sand & Gravel",null,null,null,null,null,null,"Irving Materials - Connersville, IN","47050-01","02008M0","No. 8 Agg, 703.02 Super-Structure, Mod Grading","Sand & Gravel"]
["Kirby S&G - Upper Sandusky, OH (40023-01)","40023-01","02SD2","Sand, 703.02 Concrete ","Sand & Gravel",null,null,null,null,null,null,"Kirby S&G - Upper Sandusky, OH","40023-01","02SD2","Sand, 703.02 Concrete","Sand & Gravel"]
["Kirby S&G - Upper Sandusky, OH (40023B-01)","40023B-01","02SD2","Sand, 703.02 Concrete ","Sand & Gravel",null,null,null,null,null,null,"Kirby S&G - Upper Sandusky, OH","40023B-01","02SD2","Sand, 703.02 Concrete","Sand & Gravel"]
["Lakeside Sand & Gravel - Mantua, OH (43020-01)","43020-01","02SD2","Sand, 703.02 Concrete ","Sand & Gravel",null,null,null,null,null,null,"Lakeside Sand & Gravel - Mantua, OH","43020-01","02SD2","Sand, 703.02 Concrete","Sand & Gravel"]
["Lakeside Sand & Gravel - Mantua, OH (43020-01)","43020-01",20080,"No. 8 Agg, 703.02 Super-Structure (Gravel)","Sand & Gravel",null,null,null,null,null,null,"Lakeside Sand & Gravel - Mantua, OH","43020-01",20080,"No. 8 Agg, 703.02 Super-Structure","Sand & Gravel"]
["Lakeside Sand & Gravel - Mantua, OH (43020-01)","43020-01","02SD23","Sand, 703.02 Concrete, Acid Insoluble ","Sand & Gravel",null,null,null,null,null,null,"Lakeside Sand & Gravel - Mantua, OH","43020-01","02SD23","Sand, 703.02 Concrete, Acid Insoluble","Sand & Gravel"]
["Lakeside Sand & Gravel - Mantua, OH (43020-01)","43020-01",2008,"No. 8 Agg, 703.02 Concrete (Gravel)","Sand & Gravel",null,null,null,null,null,null,"Lakeside Sand & Gravel - Mantua, OH","43020-01",2008,"No. 8 Agg, 703.02 Concrete","Sand & Gravel"]
["Latham Limestone - Latham, OH (48018-01)","48018-01",20080,"No. 8 Agg, 703.02 Super-Structure (Dolostone)","Dolostone",null,null,null,null,null,null,"Latham Limestone - Latham, OH","48018-01",20080,"No. 8 Agg, 703.02 Super-Structure","Dolostone"]
[{"$f":"L319&\" (\"&M319&\")\"","v":"Latham Limestone - Latham, OH (48018-01)"},{"$f":"M319","v":"48018-01"},{"$f":"N319","v":20081},"No. 8 Agg, 703.02 Concrete Overlay (Dolostone)","Dolostone",null,null,null,null,null,null,"Latham Limestone - Latham, OH","48018-01",20081,"No. 8 Agg, 703.02 Concrete Overlay","Dolostone"]
["Latham Limestone - Latham, OH (48018-01)","48018-01",2008,{"$f":"IF(ISNUMBER(SEARCH(\"MicroSilica\",O320)),REPLACE(O320,19,11,\", SS847/848\"),O320)&\" \"&IF(ISNUMBER(SEARCH(\"Sand\",O320)),\"\",IF(ISNUMBER(SEARCH(\"Limestone\",P320)),\"(Limestone)\",IF(ISNUMBER(SEARCH(\"Dolostone\",P320)),\"(Dolostone)\",IF(ISNUMBER(SEARCH(\"Gravel (Crushed)\",P320)),\"(Gravel (Crushed))\",IF(ISNUMBER(SEARCH(\"Gravel (100% Crushed)\",P320)),\"(Gravel (100% Crushed))\",IF(ISNUMBER(SEARCH(\"Slag\",P320)),\"(Slag (ACBF))\",IF(ISNUMBER(SEARCH(\"Gravel (Blended W/ Olen-Columbus Limestone)\",P320)),\"(Gravel (Blended W/ Limestone))\",IF(ISNUMBER(SEARCH(\"Gravel (Benefited: 40% Crushed)\",P320)),\"(Gravel (40% Crushed))\",IF(ISNUMBER(SEARCH(\"Sand & Gravel\",P320)),\"(Gravel)\",IF(ISNUMBER(SEARCH(\"Trap Rock\",P320)),\"(Trap Rock)\"))))))))))","v":"No. 8 Agg, 703.02 Concrete (Dolostone)"},{"$f":"P320","v":"Dolostone"},null,null,null,null,null,null,"Latham Limestone - Latham, OH","48018-01",2008,"No. 8 Agg, 703.02 Concrete","Dolostone"]
["Latham Limestone - Latham, OH (48018-01)","48018-01",20570,"No. 57 Agg, 703.02 Super-Structure (Dolostone)","Dolostone",null,null,null,null,null,null,"Latham Limestone - Latham, OH","48018-01",20570,"No. 57 Agg, 703.02 Super-Structure","Dolostone"]
["Latham Limestone - Latham, OH (48018-01)","48018-01",2057,"No. 57 Agg, 703.02 Concrete (Dolostone)","Dolostone",null,null,null,null,null,null,"Latham Limestone - Latham, OH","48018-01",2057,"No. 57 Agg, 703.02 Concrete","Dolostone"]
["Latham Limestone - Latham, OH (48018-01)","48018-01","02SD2","Sand, 703.02 Concrete ","Dolostone",null,null,null,null,null,null,"Latham Limestone - Latham, OH","48018-01","02SD2","Sand, 703.02 Concrete","Dolostone"]
["Latham Limestone - Latham, OH (48018-01)","48018-01",20572,"No. 57 Agg, 703.13 Freeze-Thaw (Dolostone)","Dolostone",null,null,null,null,null,null,"Latham Limestone - Latham, OH","48018-01",20572,"No. 57 Agg, 703.13 Freeze-Thaw","Dolostone"]
["Letart - Gallipolis Ferry, WV (49012-01)","49012-01",20572,"No. 57 Agg, 703.13 Freeze-Thaw (Gravel)","Sand & Gravel",null,null,null,null,null,null,"Letart - Gallipolis Ferry, WV","49012-01",20572,"No. 57 Agg, 703.13 Freeze-Thaw","Sand & Gravel"]
["Letart - Gallipolis Ferry, WV (49012-01)","49012-01",2057,"No. 57 Agg, 703.02 Concrete (Gravel)","Sand & Gravel",null,null,null,null,null,null,"Letart - Gallipolis Ferry, WV","49012-01",2057,"No. 57 Agg, 703.02 Concrete","Sand & Gravel"]
["Letart - Gallipolis Ferry, WV (49012-01)","49012-01",20570,"No. 57 Agg, 703.02 Super-Structure (Gravel)","Sand & Gravel",null,null,null,null,null,null,"Letart - Gallipolis Ferry, WV","49012-01",20570,"No. 57 Agg, 703.02 Super-Structure","Sand & Gravel"]
["Letart - Gallipolis Ferry, WV (49012-01)","49012-01","02SD2","Sand, 703.02 Concrete ","Sand & Gravel",null,null,null,null,null,null,"Letart - Gallipolis Ferry, WV","49012-01","02SD2","Sand, 703.02 Concrete","Sand & Gravel"]
["Maple Grove Materials - Tiffin, OH (41007-01)","41007-01",2008,"No. 8 Agg, 703.02 Concrete (Dolostone)","Dolostone",null,null,null,null,null,null,"Maple Grove Materials - Tiffin, OH","41007-01",2008,"No. 8 Agg, 703.02 Concrete","Dolostone"]
["Maple Grove Materials - Tiffin, OH (41007-01)","41007-01",20081,"No. 8 Agg, 703.02 Concrete Overlay (Dolostone)","Dolostone",null,null,null,null,null,null,"Maple Grove Materials - Tiffin, OH","41007-01",20081,"No. 8 Agg, 703.02 Concrete Overlay","Dolostone"]
["Maple Grove Materials - Tiffin, OH (41007-01)","41007-01",20080,"No. 8 Agg, 703.02 Super-Structure (Dolostone)","Dolostone",null,null,null,null,null,null,"Maple Grove Materials - Tiffin, OH","41007-01",20080,"No. 8 Agg, 703.02 Super-Structure","Dolostone"]
["Maple Grove Materials - Tiffin, OH (41007-01)","41007-01",2057,"No. 57 Agg, 703.02 Concrete (Dolostone)","Dolostone",null,null,null,null,null,null,"Maple Grove Materials - Tiffin, OH","41007-01",2057,"No. 57 Agg, 703.02 Concrete","Dolostone"]
["Maple Grove Materials - Tiffin, OH (41007-01)","41007-01",20570,"No. 57 Agg, 703.02 Super-Structure (Dolostone)","Dolostone",null,null,null,null,null,null,"Maple Grove Materials - Tiffin, OH","41007-01",20570,"No. 57 Agg, 703.02 Super-Structure","Dolostone"]
["Maple Grove Materials - Tiffin, OH (41007-01)","41007-01",20572,"No. 57 Agg, 703.13 Freeze-Thaw (Dolostone)","Dolostone",null,null,null,null,null,null,"Maple Grove Materials - Tiffin, OH","41007-01",20572,"No. 57 Agg, 703.13 Freeze-Thaw","Dolostone"]
["Martin Marietta - Brookville, OH (46004-01)","46004-01",20672,"No. 67 Agg, 703.13 Freeze-Thaw (Limestone)","Limestone",null,null,null,null,null,null,"Martin Marietta - Brookville, OH","46004-01",20672,"No. 67 Agg, 703.13 Freeze-Thaw","Limestone"]
["Martin Marietta - Brookville, OH (46004-01)","46004-01",20572,"No. 57 Agg, 703.13 Freeze-Thaw (Limestone)","Limestone",null,null,null,null,null,null,"Martin Marietta - Brookville, OH","46004-01",20572,"No. 57 Agg, 703.13 Freeze-Thaw","Limestone"]
["Martin Marietta - Brookville, OH (46004-01)","46004-01",20670,"No. 67 Agg, 703.02 Super-Structure (Limestone)","Limestone",null,null,null,null,null,null,"Martin Marietta - Brookville, OH","46004-01",20670,"No. 67 Agg, 703.02 Super-Structure","Limestone"]
["Martin Marietta - Brookville, OH (46004-01)","46004-01",20080,"No. 8 Agg, 703.02 Super-Structure (Limestone)","Limestone",null,null,null,null,null,null,"Martin Marietta - Brookville, OH","46004-01",20080,"No. 8 Agg, 703.02 Super-Structure","Limestone"]
["Martin Marietta - Brookville, OH (46004-01)","46004-01",20081,"No. 8 Agg, 703.02 Concrete Overlay (Limestone)","Limestone",null,null,null,null,null,null,"Martin Marietta - Brookville, OH","46004-01",20081,"No. 8 Agg, 703.02 Concrete Overlay","Limestone"]
["Martin Marietta - Brookville, OH (46004-01)","46004-01",2008,"No. 8 Agg, 703.02 Concrete (Limestone)","Limestone",null,null,null,null,null,null,"Martin Marietta - Brookville, OH","46004-01",2008,"No. 8 Agg, 703.02 Concrete","Limestone"]
["Martin Marietta - Brookville, OH (46004-01)","46004-01",20570,"No. 57 Agg, 703.02 Super-Structure (Limestone)","Limestone",null,null,null,null,null,null,"Martin Marietta - Brookville, OH","46004-01",20570,"No. 57 Agg, 703.02 Super-Structure","Limestone"]
["Martin Marietta - Brookville, OH (46004-01)","46004-01",2057,"No. 57 Agg, 703.02 Concrete (Limestone)","Limestone",null,null,null,null,null,null,"Martin Marietta - Brookville, OH","46004-01",2057,"No. 57 Agg, 703.02 Concrete","Limestone"]
["Martin Marietta - Cedarville, OH (47037-01)","47037-01",20080,"No. 8 Agg, 703.02 Super-Structure (Limestone)","Limestone",null,null,null,null,null,null,"Martin Marietta - Cedarville, OH","47037-01",20080,"No. 8 Agg, 703.02 Super-Structure","Limestone"]
["Martin Marietta - Cedarville, OH (47037-01)","47037-01",20081,"No. 8 Agg, 703.02 Concrete Overlay (Limestone)","Limestone",null,null,null,null,null,null,"Martin Marietta - Cedarville, OH","47037-01",20081,"No. 8 Agg, 703.02 Concrete Overlay","Limestone"]
["Martin Marietta - Cedarville, OH (47037-01)","47037-01",2008,"No. 8 Agg, 703.02 Concrete (Limestone)","Limestone",null,null,null,null,null,null,"Martin Marietta - Cedarville, OH","47037-01",2008,"No. 8 Agg, 703.02 Concrete","Limestone"]
["Martin Marietta - Cedarville, OH (47037-01)","47037-01",20570,"No. 57 Agg, 703.02 Super-Structure (Limestone)","Limestone",null,null,null,null,null,null,"Martin Marietta - Cedarville, OH","47037-01",20570,"No. 57 Agg, 703.02 Super-Structure","Limestone"]
["Martin Marietta - Cedarville, OH (47037-01)","47037-01",20572,"No. 57 Agg, 703.13 Freeze-Thaw (Limestone)","Limestone",null,null,null,null,null,null,"Martin Marietta - Cedarville, OH","47037-01",20572,"No. 57 Agg, 703.13 Freeze-Thaw","Limestone"]
["Martin Marietta - Cedarville, OH (47037-01)","47037-01",2057,"No. 57 Agg, 703.02 Concrete (Limestone)","Limestone",null,null,null,null,null,null,"Martin Marietta - Cedarville, OH","47037-01",2057,"No. 57 Agg, 703.02 Concrete","Limestone"]
["Martin Marietta - Cedarville, OH (47037-01)","47037-01",2067,"No. 67 Agg, 703.02 Concrete (Limestone)","Limestone",null,null,null,null,null,null,"Martin Marietta - Cedarville, OH","47037-01",2067,"No. 67 Agg, 703.02 Concrete","Limestone"]
["Martin Marietta - Fairborn, OH (46001-01)","46001-01",20080,"No. 8 Agg, 703.02 Super-Structure (Gravel)","Sand & Gravel",null,null,null,null,null,null,"Martin Marietta - Fairborn, OH","46001-01",20080,"No. 8 Agg, 703.02 Super-Structure","Sand & Gravel"]
["Martin Marietta - Fairborn, OH (46001-01)","46001-01",20081,"No. 8 Agg, 703.02 Concrete Overlay (Gravel)","Sand & Gravel",null,null,null,null,null,null,"Martin Marietta - Fairborn, OH","46001-01",20081,"No. 8 Agg, 703.02 Concrete Overlay","Sand & Gravel"]
["Martin Marietta - Fairborn, OH (46001-01)","46001-01",2057,"No. 57 Agg, 703.02 Concrete (Gravel)","Sand & Gravel",null,null,null,null,null,null,"Martin Marietta - Fairborn, OH","46001-01",2057,"No. 57 Agg, 703.02 Concrete","Sand & Gravel"]
["Martin Marietta - Fairborn, OH (46001-01)","46001-01","02SD2","Sand, 703.02 Concrete ","Sand & Gravel",null,null,null,null,null,null,"Martin Marietta - Fairborn, OH","46001-01","02SD2","Sand, 703.02 Concrete","Sand & Gravel"]
["Martin Marietta - Fairborn, OH (46001-01)","46001-01","02SD23","Sand, 703.02 Concrete, Acid Insoluble ","Sand & Gravel",null,null,null,null,null,null,"Martin Marietta - Fairborn, OH","46001-01","02SD23","Sand, 703.02 Concrete, Acid Insoluble","Sand & Gravel"]
["Martin Marietta - Fairborn, OH (46001-01)","46001-01",2008,"No. 8 Agg, 703.02 Concrete (Gravel)","Sand & Gravel",null,null,null,null,null,null,"Martin Marietta - Fairborn, OH","46001-01",2008,"No. 8 Agg, 703.02 Concrete","Sand & Gravel"]
["Martin Marietta - Fairborn, OH (46001-01)","46001-01",20570,"No. 57 Agg, 703.02 Super-Structure (Gravel)","Sand & Gravel",null,null,null,null,null,null,"Martin Marietta - Fairborn, OH","46001-01",20570,"No. 57 Agg, 703.02 Super-Structure","Sand & Gravel"]
["Martin Marietta - Fairfield, OH (47003-01)","47003-01",20572,"No. 57 Agg, 703.13 Freeze-Thaw (Gravel)","Sand & Gravel",null,null,null,null,null,null,"Martin Marietta - Fairfield, OH","47003-01",20572,"No. 57 Agg, 703.13 Freeze-Thaw","Sand & Gravel"]
["Martin Marietta - Fairfield, OH (47003-01)","47003-01",2008,"No. 8 Agg, 703.02 Concrete (Gravel)","Sand & Gravel",null,null,null,null,null,null,"Martin Marietta - Fairfield, OH","47003-01",2008,"No. 8 Agg, 703.02 Concrete","Sand & Gravel"]
["Martin Marietta - Fairfield, OH (47003-01)","47003-01",20080,"No. 8 Agg, 703.02 Super-Structure (Gravel)","Sand & Gravel",null,null,null,null,null,null,"Martin Marietta - Fairfield, OH","47003-01",20080,"No. 8 Agg, 703.02 Super-Structure","Sand & Gravel"]
["Martin Marietta - Fairfield, OH (47003-01)","47003-01",20081,"No. 8 Agg, 703.02 Concrete Overlay (Gravel)","Sand & Gravel",null,null,null,null,null,null,"Martin Marietta - Fairfield, OH","47003-01",20081,"No. 8 Agg, 703.02 Concrete Overlay","Sand & Gravel"]
["Martin Marietta - Fairfield, OH (47003-01)","47003-01","02SD2","Sand, 703.02 Concrete ","Sand & Gravel",null,null,null,null,null,null,"Martin Marietta - Fairfield, OH","47003-01","02SD2","Sand, 703.02 Concrete","Sand & Gravel"]
["Martin Marietta - Fairfield, OH (47003-01)","47003-01",20570,"No. 57 Agg, 703.02 Super-Structure (Gravel)","Sand & Gravel",null,null,null,null,null,null,"Martin Marietta - Fairfield, OH","47003-01",20570,"No. 57 Agg, 703.02 Super-Structure","Sand & Gravel"]
["Martin Marietta - Fairfield, OH (47003-01)","47003-01",2057,"No. 57 Agg, 703.02 Concrete (Gravel)","Sand & Gravel",null,null,null,null,null,null,"Martin Marietta - Fairfield, OH","47003-01",2057,"No. 57 Agg, 703.02 Concrete","Sand & Gravel"]
["Martin Marietta - Hamilton, OH (47008-01)","47008-01",2008,"No. 8 Agg, 703.02 Concrete (Gravel)","Sand & Gravel",null,null,null,null,null,null,"Martin Marietta - Hamilton, OH","47008-01",2008,"No. 8 Agg, 703.02 Concrete","Sand & Gravel"]
["Martin Marietta - Hamilton, OH (47008-01)","47008-01","02SD2","Sand, 703.02 Concrete ","Sand & Gravel",null,null,null,null,null,null,"Martin Marietta - Hamilton, OH","47008-01","02SD2","Sand, 703.02 Concrete","Sand & Gravel"]
["Martin Marietta - Hamilton, OH (47008-01)","47008-01",20572,"No. 57 Agg, 703.13 Freeze-Thaw (Gravel)","Sand & Gravel",null,null,null,null,null,null,"Martin Marietta - Hamilton, OH","47008-01",20572,"No. 57 Agg, 703.13 Freeze-Thaw","Sand & Gravel"]
["Martin Marietta - Hamilton, OH (47008-01)","47008-01",2057,"No. 57 Agg, 703.02 Concrete (Gravel)","Sand & Gravel",null,null,null,null,null,null,"Martin Marietta - Hamilton, OH","47008-01",2057,"No. 57 Agg, 703.02 Concrete","Sand & Gravel"]
["Martin Marietta - North Bend, OH (47049-01)","47049-01",2057,"No. 57 Agg, 703.02 Concrete (Gravel)","Sand & Gravel",null,null,null,null,null,null,"Martin Marietta - North Bend, OH","47049-01",2057,"No. 57 Agg, 703.02 Concrete","Sand & Gravel"]
["Martin Marietta - North Bend, OH (47049-01)","47049-01","02009M","No. 9 Agg, 703.02 Concrete, Mod Grading (Gravel)","Sand & Gravel",null,null,null,null,null,null,"Martin Marietta - North Bend, OH","47049-01","02009M","No. 9 Agg, 703.02 Concrete, Mod Grading","Sand & Gravel"]
["Martin Marietta - North Bend, OH (47049-01)","47049-01",2008,"No. 8 Agg, 703.02 Concrete (Gravel)","Sand & Gravel",null,null,null,null,null,null,"Martin Marietta - North Bend, OH","47049-01",2008,"No. 8 Agg, 703.02 Concrete","Sand & Gravel"]
["Martin Marietta - North Bend, OH (47049-01)","47049-01",20080,"No. 8 Agg, 703.02 Super-Structure (Gravel)","Sand & Gravel",null,null,null,null,null,null,"Martin Marietta - North Bend, OH","47049-01",20080,"No. 8 Agg, 703.02 Super-Structure","Sand & Gravel"]
["Martin Marietta - North Bend, OH (47049-01)","47049-01","02SD2","Sand, 703.02 Concrete ","Sand & Gravel",null,null,null,null,null,null,"Martin Marietta - North Bend, OH","47049-01","02SD2","Sand, 703.02 Concrete","Sand & Gravel"]
["Martin Marietta - North Bend, OH (47049-01)","47049-01",20570,"No. 57 Agg, 703.02 Super-Structure (Gravel)","Sand & Gravel",null,null,null,null,null,null,"Martin Marietta - North Bend, OH","47049-01",20570,"No. 57 Agg, 703.02 Super-Structure","Sand & Gravel"]
["Martin Marietta - North Bend, OH (47049-01)","47049-01",20572,"No. 57 Agg, 703.13 Freeze-Thaw (Gravel)","Sand & Gravel",null,null,null,null,null,null,"Martin Marietta - North Bend, OH","47049-01",20572,"No. 57 Agg, 703.13 Freeze-Thaw","Sand & Gravel"]
["Martin Marietta - Petersburg, KY (47082-01)","47082-01",2008,"No. 8 Agg, 703.02 Concrete (Gravel)","Sand & Gravel",null,null,null,null,null,null,"Martin Marietta - Petersburg, KY","47082-01",2008,"No. 8 Agg, 703.02 Concrete","Sand & Gravel"]
["Martin Marietta - Petersburg, KY (47082-01)","47082-01",20080,"No. 8 Agg, 703.02 Super-Structure (Gravel)","Sand & Gravel",null,null,null,null,null,null,"Martin Marietta - Petersburg, KY","47082-01",20080,"No. 8 Agg, 703.02 Super-Structure","Sand & Gravel"]
["Martin Marietta - Petersburg, KY (47082-01)","47082-01",20081,"No. 8 Agg, 703.02 Concrete Overlay (Gravel)","Sand & Gravel",null,null,null,null,null,null,"Martin Marietta - Petersburg, KY","47082-01",20081,"No. 8 Agg, 703.02 Concrete Overlay","Sand & Gravel"]
["Martin Marietta - Petersburg, KY (47082-01)","47082-01",20570,"No. 57 Agg, 703.02 Super-Structure (Gravel)","Sand & Gravel",null,null,null,null,null,null,"Martin Marietta - Petersburg, KY","47082-01",20570,"No. 57 Agg, 703.02 Super-Structure","Sand & Gravel"]
["Martin Marietta - Petersburg, KY (47082-01)","47082-01",2057,"No. 57 Agg, 703.02 Concrete (Gravel)","Sand & Gravel",null,null,null,null,null,null,"Martin Marietta - Petersburg, KY","47082-01",2057,"No. 57 Agg, 703.02 Concrete","Sand & Gravel"]
["Martin Marietta - Petersburg, KY (47082-01)","47082-01","02SD2","Sand, 703.02 Concrete ","Sand & Gravel",null,null,null,null,null,null,"Martin Marietta - Petersburg, KY","47082-01","02SD2","Sand, 703.02 Concrete","Sand & Gravel"]
["Martin Marietta - Petroleum, WV (49054-01)","49054-01",2008,"No. 8 Agg, 703.02 Concrete (Limestone)","Limestone",null,null,null,null,null,null,"Martin Marietta - Petroleum, WV","49054-01",2008,"No. 8 Agg, 703.02 Concrete","Limestone"]
["Martin Marietta - Petroleum, WV (49054-01)","49054-01",2067,"No. 67 Agg, 703.02 Concrete (Limestone)","Limestone",null,null,null,null,null,null,"Martin Marietta - Petroleum, WV","49054-01",2067,"No. 67 Agg, 703.02 Concrete","Limestone"]
[{"$f":"L383&\" (\"&M383&\")\"","v":"Martin Marietta - Petroleum, WV (49054-01)"},{"$f":"M383","v":"49054-01"},{"$f":"N383","v":2057},"No. 57 Agg, 703.02 Concrete (Limestone)","Limestone",null,null,null,null,null,null,"Martin Marietta - Petroleum, WV","49054-01",2057,"No. 57 Agg, 703.02 Concrete","Limestone"]
["Martin Marietta - Petroleum, WV (49054-01)","49054-01",20572,{"$f":"IF(ISNUMBER(SEARCH(\"MicroSilica\",O384)),REPLACE(O384,19,11,\", SS847/848\"),O384)&\" \"&IF(ISNUMBER(SEARCH(\"Sand\",O384)),\"\",IF(ISNUMBER(SEARCH(\"Limestone\",P384)),\"(Limestone)\",IF(ISNUMBER(SEARCH(\"Dolostone\",P384)),\"(Dolostone)\",IF(ISNUMBER(SEARCH(\"Gravel (Crushed)\",P384)),\"(Gravel (Crushed))\",IF(ISNUMBER(SEARCH(\"Gravel (100% Crushed)\",P384)),\"(Gravel (100% Crushed))\",IF(ISNUMBER(SEARCH(\"Slag\",P384)),\"(Slag (ACBF))\",IF(ISNUMBER(SEARCH(\"Gravel (Blended W/ Olen-Columbus Limestone)\",P384)),\"(Gravel (Blended W/ Limestone))\",IF(ISNUMBER(SEARCH(\"Gravel (Benefited: 40% Crushed)\",P384)),\"(Gravel (40% Crushed))\",IF(ISNUMBER(SEARCH(\"Sand & Gravel\",P384)),\"(Gravel)\",IF(ISNUMBER(SEARCH(\"Trap Rock\",P384)),\"(Trap Rock)\"))))))))))","v":"No. 57 Agg, 703.13 Freeze-Thaw (Limestone)"},{"$f":"P384","v":"Limestone"},null,null,null,null,null,null,"Martin Marietta - Petroleum, WV","49054-01",20572,"No. 57 Agg, 703.13 Freeze-Thaw","Limestone"]
["Martin Marietta - Racine, OH (49015-01)","49015-01","02SD2","Sand, 703.02 Concrete ","Sand & Gravel",null,null,null,null,null,null,"Martin Marietta - Racine, OH","49015-01","02SD2","Sand, 703.02 Concrete","Sand & Gravel"]
["Martin Marietta - Racine, OH (49015-01)","49015-01","02SD23","Sand, 703.02 Concrete, Acid Insoluble ","Sand & Gravel",null,null,null,null,null,null,"Martin Marietta - Racine, OH","49015-01","02SD23","Sand, 703.02 Concrete, Acid Insoluble","Sand & Gravel"]
["Martin Marietta - Spring Valley, OH (47084-01)","47084-01",2008,"No. 8 Agg, 703.02 Concrete (Gravel)","Sand & Gravel",null,null,null,null,null,null,"Martin Marietta - Spring Valley, OH","47084-01",2008,"No. 8 Agg, 703.02 Concrete","Sand & Gravel"]
["Martin Marietta - Spring Valley, OH (47084-01)","47084-01",20080,"No. 8 Agg, 703.02 Super-Structure (Gravel)","Sand & Gravel",null,null,null,null,null,null,"Martin Marietta - Spring Valley, OH","47084-01",20080,"No. 8 Agg, 703.02 Super-Structure","Sand & Gravel"]
["Martin Marietta - Spring Valley, OH (47084-01)","47084-01","02SD2","Sand, 703.02 Concrete ","Sand & Gravel",null,null,null,null,null,null,"Martin Marietta - Spring Valley, OH","47084-01","02SD2","Sand, 703.02 Concrete","Sand & Gravel"]
["Martin Marietta - Spring Valley, OH (47084-01)","47084-01",20570,"No. 57 Agg, 703.02 Super-Structure (Gravel)","Sand & Gravel",null,null,null,null,null,null,"Martin Marietta - Spring Valley, OH","47084-01",20570,"No. 57 Agg, 703.02 Super-Structure","Sand & Gravel"]
["Martin Marietta - Spring Valley, OH (47084-01)","47084-01",20572,"No. 57 Agg, 703.13 Freeze-Thaw (Gravel)","Sand & Gravel",null,null,null,null,null,null,"Martin Marietta - Spring Valley, OH","47084-01",20572,"No. 57 Agg, 703.13 Freeze-Thaw","Sand & Gravel"]
["Martin Marietta - Spring Valley, OH (47084-01)","47084-01",2057,"No. 57 Agg, 703.02 Concrete (Gravel)","Sand & Gravel",null,null,null,null,null,null,"Martin Marietta - Spring Valley, OH","47084-01",2057,"No. 57 Agg, 703.02 Concrete","Sand & Gravel"]
["Martin Marietta - Spring Valley, OH (47084-01)","47084-01",20081,"No. 8 Agg, 703.02 Concrete Overlay (Gravel)","Sand & Gravel",null,null,null,null,null,null,"Martin Marietta - Spring Valley, OH","47084-01",20081,"No. 8 Agg, 703.02 Concrete Overlay","Sand & Gravel"]
["Martin Marietta - Trenton, OH (47026-01)","47026-01","02SD2","Sand, 703.02 Concrete ","Sand & Gravel",null,null,null,null,null,null,"Martin Marietta - Trenton, OH","47026-01","02SD2","Sand, 703.02 Concrete","Sand & Gravel"]
["Martin Marietta - Troy, OH (46007-01)","46007-01",20572,"No. 57 Agg, 703.13 Freeze-Thaw (Gravel)","Sand & Gravel",null,null,null,null,null,null,"Martin Marietta - Troy, OH","46007-01",20572,"No. 57 Agg, 703.13 Freeze-Thaw","Sand & Gravel"]
["Martin Marietta - Troy, OH (46007-01)","46007-01",2057,"No. 57 Agg, 703.02 Concrete (Gravel)","Sand & Gravel",null,null,null,null,null,null,"Martin Marietta - Troy, OH","46007-01",2057,"No. 57 Agg, 703.02 Concrete","Sand & Gravel"]
["Martin Marietta - Troy, OH (46007-01)","46007-01","02SD2","Sand, 703.02 Concrete ","Sand & Gravel",null,null,null,null,null,null,"Martin Marietta - Troy, OH","46007-01","02SD2","Sand, 703.02 Concrete","Sand & Gravel"]
["Martin Marietta - Troy, OH (46007-01)","46007-01","02SD23","Sand, 703.02 Concrete, Acid Insoluble ","Sand & Gravel",null,null,null,null,null,null,"Martin Marietta - Troy, OH","46007-01","02SD23","Sand, 703.02 Concrete, Acid Insoluble","Sand & Gravel"]
["Martin Marietta - Troy, OH (46007-01)","46007-01",2008,"No. 8 Agg, 703.02 Concrete (Gravel)","Sand & Gravel",null,null,null,null,null,null,"Martin Marietta - Troy, OH","46007-01",2008,"No. 8 Agg, 703.02 Concrete","Sand & Gravel"]
["Martin Marietta - Troy, OH (46007-01)","46007-01",20570,"No. 57 Agg, 703.02 Super-Structure (Gravel)","Sand & Gravel",null,null,null,null,null,null,"Martin Marietta - Troy, OH","46007-01",20570,"No. 57 Agg, 703.02 Super-Structure","Sand & Gravel"]
["Martin Marietta - Xenia, OH (47011-01)","47011-01",2057,"No. 57 Agg, 703.02 Concrete (Gravel)","Sand & Gravel",null,null,null,null,null,null,"Martin Marietta - Xenia, OH","47011-01",2057,"No. 57 Agg, 703.02 Concrete","Sand & Gravel"]
["Martin Marietta - Xenia, OH (47011-01)","47011-01","02SD2","Sand, 703.02 Concrete ","Sand & Gravel",null,null,null,null,null,null,"Martin Marietta - Xenia, OH","47011-01","02SD2","Sand, 703.02 Concrete","Sand & Gravel"]
["Martin Marietta - Xenia, OH (47011-01)","47011-01",20572,"No. 57 Agg, 703.13 Freeze-Thaw (Gravel)","Sand & Gravel",null,null,null,null,null,null,"Martin Marietta - Xenia, OH","47011-01",20572,"No. 57 Agg, 703.13 Freeze-Thaw","Sand & Gravel"]
["Mar-Zane Materials - Chillicothe, OH (48007-01)","48007-01","02SD2","Sand, 703.02 Concrete ","Sand & Gravel",null,null,null,null,null,null,"Mar-Zane Materials - Chillicothe, OH","48007-01","02SD2","Sand, 703.02 Concrete","Sand & Gravel"]
["Mar-Zane Materials - Chillicothe, OH (48007-01)","48007-01","02SD23","Sand, 703.02 Concrete, Acid Insoluble ","Sand & Gravel",null,null,null,null,null,null,"Mar-Zane Materials - Chillicothe, OH","48007-01","02SD23","Sand, 703.02 Concrete, Acid Insoluble","Sand & Gravel"]
["Mar-Zane Materials - Haydenville, OH (49003-01)","49003-01","02SD2","Sand, 703.02 Concrete ","Sand & Gravel",null,null,null,null,null,null,"Mar-Zane Materials - Haydenville, OH","49003-01","02SD2","Sand, 703.02 Concrete","Sand & Gravel"]
["Mar-Zane Materials - Haydenville, OH (49003-01)","49003-01","02SD23","Sand, 703.02 Concrete, Acid Insoluble ","Sand & Gravel",null,null,null,null,null,null,"Mar-Zane Materials - Haydenville, OH","49003-01","02SD23","Sand, 703.02 Concrete, Acid Insoluble","Sand & Gravel"]
["Mar-Zane Materials - Logan, OH (49059A-01)","49059A-01","02SD2","Sand, 703.02 Concrete ","Sand & Gravel (Crushed)",null,null,null,null,null,null,"Mar-Zane Materials - Logan, OH","49059A-01","02SD2","Sand, 703.02 Concrete","Sand & Gravel (Crushed)"]
["Mar-Zane Materials - Perrysville, OH (42012A-01)","42012A-01","02SD2","Sand, 703.02 Concrete ","Sand & Gravel (Crushed)",null,null,null,null,null,null,"Mar-Zane Materials - Perrysville, OH","42012A-01","02SD2","Sand, 703.02 Concrete","Sand & Gravel (Crushed)"]
["Mar-Zane Materials - Ravenna, OH (43073A-01)","43073A-01","02SD2","Sand, 703.02 Concrete ","Sand & Gravel",null,null,null,null,null,null,"Mar-Zane Materials - Ravenna, OH","43073A-01","02SD2","Sand, 703.02 Concrete","Sand & Gravel"]
["Mar-Zane Materials - Zanesville, OH (44016-01)","44016-01","02SD2","Sand, 703.02 Concrete ","Sand & Gravel (Crushed)",null,null,null,null,null,null,"Mar-Zane Materials - Zanesville, OH","44016-01","02SD2","Sand, 703.02 Concrete","Sand & Gravel (Crushed)"]
["Mar-Zane Materials - Zanesville, OH (44016-01)","44016-01","02SD23","Sand, 703.02 Concrete, Acid Insoluble ","Sand & Gravel (Crushed)",null,null,null,null,null,null,"Mar-Zane Materials - Zanesville, OH","44016-01","02SD23","Sand, 703.02 Concrete, Acid Insoluble","Sand & Gravel (Crushed)"]
["Massillon Materials - Bolivar, OH (50079-01)","50079-01",2008,"No. 8 Agg, 703.02 Concrete (Gravel)","Sand & Gravel",null,null,null,null,null,null,"Massillon Materials - Bolivar, OH","50079-01",2008,"No. 8 Agg, 703.02 Concrete","Sand & Gravel"]
["Massillon Materials - Bolivar, OH (50079-01)","50079-01",2057,"No. 57 Agg, 703.02 Concrete (Gravel)","Sand & Gravel",null,null,null,null,null,null,"Massillon Materials - Bolivar, OH","50079-01",2057,"No. 57 Agg, 703.02 Concrete","Sand & Gravel"]
["Massillon Materials - Bolivar, OH (50079-01)","50079-01","02SD2","Sand, 703.02 Concrete ","Sand & Gravel",null,null,null,null,null,null,"Massillon Materials - Bolivar, OH","50079-01","02SD2","Sand, 703.02 Concrete","Sand & Gravel"]
["Massillon Materials - Massillon, OH (43052-01)","43052-01","02SD2","Sand, 703.02 Concrete ","Sand & Gravel",null,null,null,null,null,null,"Massillon Materials - Massillon, OH","43052-01","02SD2","Sand, 703.02 Concrete","Sand & Gravel"]
["Massillon Materials - Massillon, OH (43052-01)","43052-01","02SD23","Sand, 703.02 Concrete, Acid Insoluble ","Sand & Gravel",null,null,null,null,null,null,"Massillon Materials - Massillon, OH","43052-01","02SD23","Sand, 703.02 Concrete, Acid Insoluble","Sand & Gravel"]
["Mechanicsburg S & G - Mechanicsburg, OH (46037-01)","46037-01",2057,"No. 57 Agg, 703.02 Concrete (Gravel)","Sand & Gravel",null,null,null,null,null,null,"Mechanicsburg S & G - Mechanicsburg, OH","46037-01",2057,"No. 57 Agg, 703.02 Concrete","Sand & Gravel"]
["Mechanicsburg S & G - Mechanicsburg, OH (46037-01)","46037-01","02SD2","Sand, 703.02 Concrete ","Sand & Gravel",null,null,null,null,null,null,"Mechanicsburg S & G - Mechanicsburg, OH","46037-01","02SD2","Sand, 703.02 Concrete","Sand & Gravel"]
["Mechanicsburg S & G - Mechanicsburg, OH (46037-01)","46037-01","02SD23","Sand, 703.02 Concrete, Acid Insoluble ","Sand & Gravel",null,null,null,null,null,null,"Mechanicsburg S & G - Mechanicsburg, OH","46037-01","02SD23","Sand, 703.02 Concrete, Acid Insoluble","Sand & Gravel"]
["Mechanicsburg S & G - Mechanicsburg, OH (46037-01)","46037-01",20572,"No. 57 Agg, 703.13 Freeze-Thaw (Gravel)","Sand & Gravel",null,null,null,null,null,null,"Mechanicsburg S & G - Mechanicsburg, OH","46037-01",20572,"No. 57 Agg, 703.13 Freeze-Thaw","Sand & Gravel"]
["Melvin Stone - Circleville, OH (45026-01)","45026-01","02SD2","Sand, 703.02 Concrete ","Sand & Gravel",null,null,null,null,null,null,"Melvin Stone - Circleville, OH","45026-01","02SD2","Sand, 703.02 Concrete","Sand & Gravel"]
["Melvin Stone - Corning, OH (44036-01)","44036-01",2057,"No. 57 Agg, 703.02 Concrete (Limestone)","Limestone",null,null,null,null,null,null,"Melvin Stone - Corning, OH","44036-01",2057,"No. 57 Agg, 703.02 Concrete","Limestone"]
["Melvin Stone - Middletown, OH (47007-01)","47007-01",2008,"No. 8 Agg, 703.02 Concrete (Slag (ACBF))","Slag (ACBF)",null,null,null,null,null,null,"Melvin Stone - Middletown, OH","47007-01",2008,"No. 8 Agg, 703.02 Concrete","Slag (ACBF)"]
["Melvin Stone - Middletown, OH (47007-01)","47007-01",2057,"No. 57 Agg, 703.02 Concrete (Slag (ACBF))","Slag (ACBF)",null,null,null,null,null,null,"Melvin Stone - Middletown, OH","47007-01",2057,"No. 57 Agg, 703.02 Concrete","Slag (ACBF)"]
["Melvin Stone - Middletown, OH (47007-01)","47007-01",20081,"No. 8 Agg, 703.02 Concrete Overlay (Slag (ACBF))","Slag (ACBF)",null,null,null,null,null,null,"Melvin Stone - Middletown, OH","47007-01",20081,"No. 8 Agg, 703.02 Concrete Overlay","Slag (ACBF)"]
["Melvin Stone - New Holland, OH (45011-01)","45011-01",20080,"No. 8 Agg, 703.02 Super-Structure (Limestone)","Limestone",null,null,null,null,null,null,"Melvin Stone - New Holland, OH","45011-01",20080,"No. 8 Agg, 703.02 Super-Structure","Limestone"]
["Melvin Stone - New Holland, OH (45011-01)","45011-01",2008,"No. 8 Agg, 703.02 Concrete (Limestone)","Limestone",null,null,null,null,null,null,"Melvin Stone - New Holland, OH","45011-01",2008,"No. 8 Agg, 703.02 Concrete","Limestone"]
["Melvin Stone - New Holland, OH (45011-01)","45011-01",2057,"No. 57 Agg, 703.02 Concrete (Limestone)","Limestone",null,null,null,null,null,null,"Melvin Stone - New Holland, OH","45011-01",2057,"No. 57 Agg, 703.02 Concrete","Limestone"]
["Melvin Stone - New Holland, OH (45011-01)","45011-01",20570,"No. 57 Agg, 703.02 Super-Structure (Limestone)","Limestone",null,null,null,null,null,null,"Melvin Stone - New Holland, OH","45011-01",20570,"No. 57 Agg, 703.02 Super-Structure","Limestone"]
["Melvin Stone - New Holland, OH (45011-01)","45011-01",20572,"No. 57 Agg, 703.13 Freeze-Thaw (Limestone)","Limestone",null,null,null,null,null,null,"Melvin Stone - New Holland, OH","45011-01",20572,"No. 57 Agg, 703.13 Freeze-Thaw","Limestone"]
["Melvin Stone - Sabina, OH (47077-01)","47077-01",2057,"No. 57 Agg, 703.02 Concrete (Dolostone)","Dolostone",null,null,null,null,null,null,"Melvin Stone - Sabina, OH","47077-01",2057,"No. 57 Agg, 703.02 Concrete","Dolostone"]
["Melvin Stone - Washington Court House, OH (48036-01)","48036-01",2057,"No. 57 Agg, 703.02 Concrete (Dolostone)","Dolostone",null,null,null,null,null,null,"Melvin Stone - Washington Court House, OH","48036-01",2057,"No. 57 Agg, 703.02 Concrete","Dolostone"]
["Melvin Stone - Washington Court House, OH (48036-01)","48036-01",2008,"No. 8 Agg, 703.02 Concrete (Dolostone)","Dolostone",null,null,null,null,null,null,"Melvin Stone - Washington Court House, OH","48036-01",2008,"No. 8 Agg, 703.02 Concrete","Dolostone"]
["Melvin Stone - Wellston, OH (49007-01)","49007-01",2008,"No. 8 Agg, 703.02 Concrete (Limestone)","Limestone",null,null,null,null,null,null,"Melvin Stone - Wellston, OH","49007-01",2008,"No. 8 Agg, 703.02 Concrete","Limestone"]
["Melvin Stone Company - Wilmington, OH (47021-01)","47021-01",20080,"No. 8 Agg, 703.02 Super-Structure (Dolostone)","Dolostone",null,null,null,null,null,null,"Melvin Stone Company - Wilmington, OH","47021-01",20080,"No. 8 Agg, 703.02 Super-Structure","Dolostone"]
["Melvin Stone Company - Wilmington, OH (47021-01)","47021-01",20081,"No. 8 Agg, 703.02 Concrete Overlay (Dolostone)","Dolostone",null,null,null,null,null,null,"Melvin Stone Company - Wilmington, OH","47021-01",20081,"No. 8 Agg, 703.02 Concrete Overlay","Dolostone"]
["Melvin Stone Company - Wilmington, OH (47021-01)","47021-01",2008,"No. 8 Agg, 703.02 Concrete (Dolostone)","Dolostone",null,null,null,null,null,null,"Melvin Stone Company - Wilmington, OH","47021-01",2008,"No. 8 Agg, 703.02 Concrete","Dolostone"]
["Melvin Stone Company - Wilmington, OH (47021-01)","47021-01",20570,"No. 57 Agg, 703.02 Super-Structure (Dolostone)","Dolostone",null,null,null,null,null,null,"Melvin Stone Company - Wilmington, OH","47021-01",20570,"No. 57 Agg, 703.02 Super-Structure","Dolostone"]
["Melvin Stone Company - Wilmington, OH (47021-01)","47021-01",2067,"No. 67 Agg, 703.02 Concrete (Dolostone)","Dolostone",null,null,null,null,null,null,"Melvin Stone Company - Wilmington, OH","47021-01",2067,"No. 67 Agg, 703.02 Concrete","Dolostone"]
["Melvin Stone Company - Wilmington, OH (47021-01)","47021-01",20670,"No. 67 Agg, 703.02 Super-Structure (Dolostone)","Dolostone",null,null,null,null,null,null,"Melvin Stone Company - Wilmington, OH","47021-01",20670,"No. 67 Agg, 703.02 Super-Structure","Dolostone"]
["Melvin Stone Company - Wilmington, OH (47021-01)","47021-01",2078,"No. 78 Agg, 703.02 Concrete (Dolostone)","Dolostone",null,null,null,null,null,null,"Melvin Stone Company - Wilmington, OH","47021-01",2078,"No. 78 Agg, 703.02 Concrete","Dolostone"]
["Melvin Stone Company - Wilmington, OH (47021-01)","47021-01",2057,"No. 57 Agg, 703.02 Concrete (Dolostone)","Dolostone",null,null,null,null,null,null,"Melvin Stone Company - Wilmington, OH","47021-01",2057,"No. 57 Agg, 703.02 Concrete","Dolostone"]
["Melvin Stone Company - Wilmington, OH (47021-01)","47021-01",20572,"No. 57 Agg, 703.13 Freeze-Thaw (Dolostone)","Dolostone",null,null,null,null,null,null,"Melvin Stone Company - Wilmington, OH","47021-01",20572,"No. 57 Agg, 703.13 Freeze-Thaw","Dolostone"]
["Melvin Stone Company - Wilmington, OH (47021-01)","47021-01",20672,"No. 67 Agg, 703.13 Freeze-Thaw (Dolostone)","Dolostone",null,null,null,null,null,null,"Melvin Stone Company - Wilmington, OH","47021-01",20672,"No. 67 Agg, 703.13 Freeze-Thaw","Dolostone"]
["Miami View Mining - Morrow, OH (47023-01)","47023-01","02SD2","Sand, 703.02 Concrete ","Sand & Gravel",null,null,null,null,null,null,"Miami View Mining - Morrow, OH","47023-01","02SD2","Sand, 703.02 Concrete","Sand & Gravel"]
[{"$f":"L447&\" (\"&M447&\")\"","v":"Milton Materials - Ludlow Falls, OH (46012-01)"},{"$f":"M447","v":"46012-01"},{"$f":"N447","v":"02SD2"},"Sand, 703.02 Concrete ","Sand & Gravel",null,null,null,null,null,null,"Milton Materials - Ludlow Falls, OH","46012-01","02SD2","Sand, 703.02 Concrete","Sand & Gravel"]
["Milton Materials - Ludlow Falls, OH (46012-01)","46012-01","02SD23",{"$f":"IF(ISNUMBER(SEARCH(\"MicroSilica\",O448)),REPLACE(O448,19,11,\", SS847/848\"),O448)&\" \"&IF(ISNUMBER(SEARCH(\"Sand\",O448)),\"\",IF(ISNUMBER(SEARCH(\"Limestone\",P448)),\"(Limestone)\",IF(ISNUMBER(SEARCH(\"Dolostone\",P448)),\"(Dolostone)\",IF(ISNUMBER(SEARCH(\"Gravel (Crushed)\",P448)),\"(Gravel (Crushed))\",IF(ISNUMBER(SEARCH(\"Gravel (100% Crushed)\",P448)),\"(Gravel (100% Crushed))\",IF(ISNUMBER(SEARCH(\"Slag\",P448)),\"(Slag (ACBF))\",IF(ISNUMBER(SEARCH(\"Gravel (Blended W/ Olen-Columbus Limestone)\",P448)),\"(Gravel (Blended W/ Limestone))\",IF(ISNUMBER(SEARCH(\"Gravel (Benefited: 40% Crushed)\",P448)),\"(Gravel (40% Crushed))\",IF(ISNUMBER(SEARCH(\"Sand & Gravel\",P448)),\"(Gravel)\",IF(ISNUMBER(SEARCH(\"Trap Rock\",P448)),\"(Trap Rock)\"))))))))))","v":"Sand, 703.02 Concrete, Acid Insoluble "},{"$f":"P448","v":"Sand & Gravel"},null,null,null,null,null,null,"Milton Materials - Ludlow Falls, OH","46012-01","02SD23","Sand, 703.02 Concrete, Acid Insoluble","Sand & Gravel"]
["Mountain Materials (Brushy Creek) - Olive Hill, KY (48051-01)","48051-01","02008M","No. 8 Agg, 703.02 Concrete, Mod Grading (Limestone)","Limestone",null,null,null,null,null,null,"Mountain Materials (Brushy Creek) - Olive Hill, KY","48051-01","02008M","No. 8 Agg, 703.02 Concrete, Mod Grading","Limestone"]
["Mountain Materials (Brushy Creek) - Olive Hill, KY (48051-01)","48051-01","02057M","No. 57 Agg, 703.02 Concrete, Mod Grading (Limestone)","Limestone",null,null,null,null,null,null,"Mountain Materials (Brushy Creek) - Olive Hill, KY","48051-01","02057M","No. 57 Agg, 703.02 Concrete, Mod Grading","Limestone"]
["Mulzer Crushed Stone - Cape Sandy, IN (49032-01)","49032-01",2057,"No. 57 Agg, 703.02 Concrete (Limestone)","Indirect-Out-of-State / Limestone",null,null,null,null,null,null,"Mulzer Crushed Stone - Cape Sandy, IN","49032-01",2057,"No. 57 Agg, 703.02 Concrete","Indirect-Out-of-State / Limestone"]
["Mulzer Crushed Stone - Cape Sandy, IN (49032-01)","49032-01",20570,"No. 57 Agg, 703.02 Super-Structure (Limestone)","Indirect-Out-of-State / Limestone",null,null,null,null,null,null,"Mulzer Crushed Stone - Cape Sandy, IN","49032-01",20570,"No. 57 Agg, 703.02 Super-Structure","Indirect-Out-of-State / Limestone"]
["Mulzer Crushed Stone - Cape Sandy, IN (49032-01)","49032-01",2067,"No. 67 Agg, 703.02 Concrete (Limestone)","Indirect-Out-of-State / Limestone",null,null,null,null,null,null,"Mulzer Crushed Stone - Cape Sandy, IN","49032-01",2067,"No. 67 Agg, 703.02 Concrete","Indirect-Out-of-State / Limestone"]
["Mulzer Crushed Stone - Cape Sandy, IN (49032-01)","49032-01",20670,"No. 67 Agg, 703.02 Super-Structure (Limestone)","Indirect-Out-of-State / Limestone",null,null,null,null,null,null,"Mulzer Crushed Stone - Cape Sandy, IN","49032-01",20670,"No. 67 Agg, 703.02 Super-Structure","Indirect-Out-of-State / Limestone"]
["Mulzer Crushed Stone - Cape Sandy, IN (49032-01)","49032-01",2008,"No. 8 Agg, 703.02 Concrete (Limestone)","Indirect-Out-of-State / Limestone",null,null,null,null,null,null,"Mulzer Crushed Stone - Cape Sandy, IN","49032-01",2008,"No. 8 Agg, 703.02 Concrete","Indirect-Out-of-State / Limestone"]
["Mulzer Crushed Stone - Cape Sandy, IN (49032-01)","49032-01",20080,"No. 8 Agg, 703.02 Super-Structure (Limestone)","Indirect-Out-of-State / Limestone",null,null,null,null,null,null,"Mulzer Crushed Stone - Cape Sandy, IN","49032-01",20080,"No. 8 Agg, 703.02 Super-Structure","Indirect-Out-of-State / Limestone"]
["Mulzer Crushed Stone - Cape Sandy, IN (49032-01)","49032-01",20081,"No. 8 Agg, 703.02 Concrete Overlay (Limestone)","Indirect-Out-of-State / Limestone",null,null,null,null,null,null,"Mulzer Crushed Stone - Cape Sandy, IN","49032-01",20081,"No. 8 Agg, 703.02 Concrete Overlay","Indirect-Out-of-State / Limestone"]
["Mulzer Crushed Stone - Charlestown, IN (49033-01)","49033-01",20572,"No. 57 Agg, 703.13 Freeze-Thaw (Limestone)","Indirect-Out-of-State / Limestone",null,null,null,null,null,null,"Mulzer Crushed Stone - Charlestown, IN","49033-01",20572,"No. 57 Agg, 703.13 Freeze-Thaw","Indirect-Out-of-State / Limestone"]
["Mulzer Crushed Stone - Charlestown, IN (49033-01)","49033-01",20080,"No. 8 Agg, 703.02 Super-Structure (Limestone)","Indirect-Out-of-State / Limestone",null,null,null,null,null,null,"Mulzer Crushed Stone - Charlestown, IN","49033-01",20080,"No. 8 Agg, 703.02 Super-Structure","Indirect-Out-of-State / Limestone"]
["Mulzer Crushed Stone - Charlestown, IN (49033-01)","49033-01",20081,"No. 8 Agg, 703.02 Concrete Overlay (Limestone)","Indirect-Out-of-State / Limestone",null,null,null,null,null,null,"Mulzer Crushed Stone - Charlestown, IN","49033-01",20081,"No. 8 Agg, 703.02 Concrete Overlay","Indirect-Out-of-State / Limestone"]
["Mulzer Crushed Stone - Charlestown, IN (49033-01)","49033-01",2008,"No. 8 Agg, 703.02 Concrete (Limestone)","Indirect-Out-of-State / Limestone",null,null,null,null,null,null,"Mulzer Crushed Stone - Charlestown, IN","49033-01",2008,"No. 8 Agg, 703.02 Concrete","Indirect-Out-of-State / Limestone"]
["Mulzer Crushed Stone - Charlestown, IN (49033-01)","49033-01",20570,"No. 57 Agg, 703.02 Super-Structure (Limestone)","Indirect-Out-of-State / Limestone",null,null,null,null,null,null,"Mulzer Crushed Stone - Charlestown, IN","49033-01",20570,"No. 57 Agg, 703.02 Super-Structure","Indirect-Out-of-State / Limestone"]
["Mulzer Crushed Stone - Charlestown, IN (49033-01)","49033-01",2057,"No. 57 Agg, 703.02 Concrete (Limestone)","Indirect-Out-of-State / Limestone",null,null,null,null,null,null,"Mulzer Crushed Stone - Charlestown, IN","49033-01",2057,"No. 57 Agg, 703.02 Concrete","Indirect-Out-of-State / Limestone"]
["Mulzer Crushed Stone - Charlestown, IN (49033-01)","49033-01",2067,"No. 67 Agg, 703.02 Concrete (Limestone)","Indirect-Out-of-State / Limestone",null,null,null,null,null,null,"Mulzer Crushed Stone - Charlestown, IN","49033-01",2067,"No. 67 Agg, 703.02 Concrete","Indirect-Out-of-State / Limestone"]
["Mulzer Crushed Stone - Charlestown, IN (49033A-01)","49033A-01",20572,"No. 57 Agg, 703.13 Freeze-Thaw (Limestone)","Indirect-Out-of-State / Limestone",null,null,null,null,null,null,"Mulzer Crushed Stone - Charlestown, IN","49033A-01",20572,"No. 57 Agg, 703.13 Freeze-Thaw","Indirect-Out-of-State / Limestone"]
["Mulzer Crushed Stone - Mauckport, IN (47069-01)","47069-01",20080,"No. 8 Agg, 703.02 Super-Structure (Limestone)","Indirect-Out-of-State / Limestone",null,null,null,null,null,null,"Mulzer Crushed Stone - Mauckport, IN","47069-01",20080,"No. 8 Agg, 703.02 Super-Structure","Indirect-Out-of-State / Limestone"]
["Mulzer Crushed Stone - Mauckport, IN (47069-01)","47069-01",20081,"No. 8 Agg, 703.02 Concrete Overlay (Limestone)","Indirect-Out-of-State / Limestone",null,null,null,null,null,null,"Mulzer Crushed Stone - Mauckport, IN","47069-01",20081,"No. 8 Agg, 703.02 Concrete Overlay","Indirect-Out-of-State / Limestone"]
["Mulzer Crushed Stone - Mauckport, IN (47069-01)","47069-01",2008,"No. 8 Agg, 703.02 Concrete (Limestone)","Indirect-Out-of-State / Limestone",null,null,null,null,null,null,"Mulzer Crushed Stone - Mauckport, IN","47069-01",2008,"No. 8 Agg, 703.02 Concrete","Indirect-Out-of-State / Limestone"]
["Mulzer Crushed Stone - Mauckport, IN (47069-01)","47069-01",20570,"No. 57 Agg, 703.02 Super-Structure (Limestone)","Indirect-Out-of-State / Limestone",null,null,null,null,null,null,"Mulzer Crushed Stone - Mauckport, IN","47069-01",20570,"No. 57 Agg, 703.02 Super-Structure","Indirect-Out-of-State / Limestone"]
["Mulzer Crushed Stone - Mauckport, IN (47069-01)","47069-01",2067,"No. 67 Agg, 703.02 Concrete (Limestone)","Indirect-Out-of-State / Limestone",null,null,null,null,null,null,"Mulzer Crushed Stone - Mauckport, IN","47069-01",2067,"No. 67 Agg, 703.02 Concrete","Indirect-Out-of-State / Limestone"]
["Mulzer Crushed Stone - Mauckport, IN (47069-01)","47069-01",20670,"No. 67 Agg, 703.02 Super-Structure (Limestone)","Indirect-Out-of-State / Limestone",null,null,null,null,null,null,"Mulzer Crushed Stone - Mauckport, IN","47069-01",20670,"No. 67 Agg, 703.02 Super-Structure","Indirect-Out-of-State / Limestone"]
["Mulzer Crushed Stone - Mauckport, IN (47069-01)","47069-01",2057,"No. 57 Agg, 703.02 Concrete (Limestone)","Indirect-Out-of-State / Limestone",null,null,null,null,null,null,"Mulzer Crushed Stone - Mauckport, IN","47069-01",2057,"No. 57 Agg, 703.02 Concrete","Indirect-Out-of-State / Limestone"]
["National L&S - Bucyrus, OH (42002-01)","42002-01",20081,"No. 8 Agg, 703.02 Concrete Overlay (Limestone)","Limestone",null,null,null,null,null,null,"National L&S - Bucyrus, OH","42002-01",20081,"No. 8 Agg, 703.02 Concrete Overlay","Limestone"]
["National L&S - Bucyrus, OH (42002-01)","42002-01",2008,"No. 8 Agg, 703.02 Concrete (Limestone)","Limestone",null,null,null,null,null,null,"National L&S - Bucyrus, OH","42002-01",2008,"No. 8 Agg, 703.02 Concrete","Limestone"]
["National L&S - Bucyrus, OH (42002-01)","42002-01",20080,"No. 8 Agg, 703.02 Super-Structure (Limestone)","Limestone",null,null,null,null,null,null,"National L&S - Bucyrus, OH","42002-01",20080,"No. 8 Agg, 703.02 Super-Structure","Limestone"]
["National L&S - Bucyrus, OH (42002-01)","42002-01",2057,"No. 57 Agg, 703.02 Concrete (Limestone)","Limestone",null,null,null,null,null,null,"National L&S - Bucyrus, OH","42002-01",2057,"No. 57 Agg, 703.02 Concrete","Limestone"]
["National L&S - Bucyrus, OH (42002-01)","42002-01",20570,"No. 57 Agg, 703.02 Super-Structure (Limestone)","Limestone",null,null,null,null,null,null,"National L&S - Bucyrus, OH","42002-01",20570,"No. 57 Agg, 703.02 Super-Structure","Limestone"]
["National L&S - Delaware, OH (45005-01)","45005-01",20081,"No. 8 Agg, 703.02 Concrete Overlay (Limestone)","Limestone",null,null,null,null,null,null,"National L&S - Delaware, OH","45005-01",20081,"No. 8 Agg, 703.02 Concrete Overlay","Limestone"]
["National L&S - Delaware, OH (45005-01)","45005-01",2008,"No. 8 Agg, 703.02 Concrete (Limestone)","Limestone",null,null,null,null,null,null,"National L&S - Delaware, OH","45005-01",2008,"No. 8 Agg, 703.02 Concrete","Limestone"]
["National L&S - Delaware, OH (45005-01)","45005-01",20080,"No. 8 Agg, 703.02 Super-Structure (Limestone)","Limestone",null,null,null,null,null,null,"National L&S - Delaware, OH","45005-01",20080,"No. 8 Agg, 703.02 Super-Structure","Limestone"]
["National L&S - Delaware, OH (45005-01)","45005-01",2057,"No. 57 Agg, 703.02 Concrete (Limestone)","Limestone",null,null,null,null,null,null,"National L&S - Delaware, OH","45005-01",2057,"No. 57 Agg, 703.02 Concrete","Limestone"]
["National L&S - Delaware, OH (45005-01)","45005-01",20570,"No. 57 Agg, 703.02 Super-Structure (Limestone)","Limestone",null,null,null,null,null,null,"National L&S - Delaware, OH","45005-01",20570,"No. 57 Agg, 703.02 Super-Structure","Limestone"]
["National L&S - Lima, OH (40008B-01)","40008B-01",2057,"No. 57 Agg, 703.02 Concrete (Dolostone)","Dolostone",null,null,null,null,null,null,"National L&S - Lima, OH","40008B-01",2057,"No. 57 Agg, 703.02 Concrete","Dolostone"]
["National L&S - Lima, OH (40008B-01)","40008B-01",2008,"No. 8 Agg, 703.02 Concrete (Dolostone)","Dolostone",null,null,null,null,null,null,"National L&S - Lima, OH","40008B-01",2008,"No. 8 Agg, 703.02 Concrete","Dolostone"]
["National L&S - Lima, OH (40008B-01)","40008B-01",20080,"No. 8 Agg, 703.02 Super-Structure (Dolostone)","Dolostone",null,null,null,null,null,null,"National L&S - Lima, OH","40008B-01",20080,"No. 8 Agg, 703.02 Super-Structure","Dolostone"]
["National L&S - Lima, OH (40008B-01)","40008B-01",20570,"No. 57 Agg, 703.02 Super-Structure (Dolostone)","Dolostone",null,null,null,null,null,null,"National L&S - Lima, OH","40008B-01",20570,"No. 57 Agg, 703.02 Super-Structure","Dolostone"]
["National L&S - Lima, OH (40008B-01)","40008B-01",20572,"No. 57 Agg, 703.13 Freeze-Thaw (Dolostone)","Dolostone",null,null,null,null,null,null,"National L&S - Lima, OH","40008B-01",20572,"No. 57 Agg, 703.13 Freeze-Thaw","Dolostone"]
["National L&S - Marion, OH (45012-01)","45012-01",2008,"No. 8 Agg, 703.02 Concrete (Limestone)","Limestone",null,null,null,null,null,null,"National L&S - Marion, OH","45012-01",2008,"No. 8 Agg, 703.02 Concrete","Limestone"]
["National L&S - Marion, OH (45012-01)","45012-01",2057,"No. 57 Agg, 703.02 Concrete (Limestone)","Limestone",null,null,null,null,null,null,"National L&S - Marion, OH","45012-01",2057,"No. 57 Agg, 703.02 Concrete","Limestone"]
["National L&S - Marion, OH (45012-01)","45012-01",20570,"No. 57 Agg, 703.02 Super-Structure (Limestone)","Limestone",null,null,null,null,null,null,"National L&S - Marion, OH","45012-01",20570,"No. 57 Agg, 703.02 Super-Structure","Limestone"]
["National L&S - Marion, OH (45012-01)","45012-01",20080,"No. 8 Agg, 703.02 Super-Structure (Limestone)","Limestone",null,null,null,null,null,null,"National L&S - Marion, OH","45012-01",20080,"No. 8 Agg, 703.02 Super-Structure","Limestone"]
["National L&S - Marion, OH (45012A-01)","45012A-01",2057,"No. 57 Agg, 703.02 Concrete (Limestone)","Limestone (Lower Bench)",null,null,null,null,null,null,"National L&S - Marion, OH","45012A-01",2057,"No. 57 Agg, 703.02 Concrete","Limestone (Lower Bench)"]
["National L&S - Marion, OH (45012A-01)","45012A-01",20572,"No. 57 Agg, 703.13 Freeze-Thaw (Limestone)","Limestone (Lower Bench)",null,null,null,null,null,null,"National L&S - Marion, OH","45012A-01",20572,"No. 57 Agg, 703.13 Freeze-Thaw","Limestone (Lower Bench)"]
["National L&S - Ottawa, OH (40011-01)","40011-01",2008,"No. 8 Agg, 703.02 Concrete (Limestone)","Limestone",null,null,null,null,null,null,"National L&S - Ottawa, OH","40011-01",2008,"No. 8 Agg, 703.02 Concrete","Limestone"]
["National L&S - Ottawa, OH (40011-01)","40011-01",20080,"No. 8 Agg, 703.02 Super-Structure (Limestone)","Limestone",null,null,null,null,null,null,"National L&S - Ottawa, OH","40011-01",20080,"No. 8 Agg, 703.02 Super-Structure","Limestone"]
["National L&S - Ottawa, OH (40011-01)","40011-01",2057,"No. 57 Agg, 703.02 Concrete (Limestone)","Limestone",null,null,null,null,null,null,"National L&S - Ottawa, OH","40011-01",2057,"No. 57 Agg, 703.02 Concrete","Limestone"]
["National L&S - Ottawa, OH (40011-01)","40011-01",20570,"No. 57 Agg, 703.02 Super-Structure (Limestone)","Limestone",null,null,null,null,null,null,"National L&S - Ottawa, OH","40011-01",20570,"No. 57 Agg, 703.02 Super-Structure","Limestone"]
["National L&S - Ottawa, OH (40011-01)","40011-01",20572,"No. 57 Agg, 703.13 Freeze-Thaw (Limestone)","Limestone",null,null,null,null,null,null,"National L&S - Ottawa, OH","40011-01",20572,"No. 57 Agg, 703.13 Freeze-Thaw","Limestone"]
["National L&S - Rimer, OH (40027-01)","40027-01",2008,"No. 8 Agg, 703.02 Concrete (Limestone)","Limestone",null,null,null,null,null,null,"National L&S - Rimer, OH","40027-01",2008,"No. 8 Agg, 703.02 Concrete","Limestone"]
["National L&S - Rimer, OH (40027-01)","40027-01",20080,"No. 8 Agg, 703.02 Super-Structure (Limestone)","Limestone",null,null,null,null,null,null,"National L&S - Rimer, OH","40027-01",20080,"No. 8 Agg, 703.02 Super-Structure","Limestone"]
["National L&S - Rimer, OH (40027-01)","40027-01",2057,"No. 57 Agg, 703.02 Concrete (Limestone)","Limestone",null,null,null,null,null,null,"National L&S - Rimer, OH","40027-01",2057,"No. 57 Agg, 703.02 Concrete","Limestone"]
["National L&S - Rimer, OH (40027-01)","40027-01",20570,"No. 57 Agg, 703.02 Super-Structure (Limestone)","Limestone",null,null,null,null,null,null,"National L&S - Rimer, OH","40027-01",20570,"No. 57 Agg, 703.02 Super-Structure","Limestone"]
["National L&S - Rimer, OH (40027-01)","40027-01",20572,"No. 57 Agg, 703.13 Freeze-Thaw (Limestone)","Limestone",null,null,null,null,null,null,"National L&S - Rimer, OH","40027-01",20572,"No. 57 Agg, 703.13 Freeze-Thaw","Limestone"]
["National Lime & Stone - Carey, OH (40030-01)","40030-01",2008,"No. 8 Agg, 703.02 Concrete (Limestone)","Limestone",null,null,null,null,null,null,"National Lime & Stone - Carey, OH","40030-01",2008,"No. 8 Agg, 703.02 Concrete","Limestone"]
["National Lime & Stone - Carey, OH (40030-01)","40030-01",20081,"No. 8 Agg, 703.02 Concrete Overlay (Limestone)","Limestone",null,null,null,null,null,null,"National Lime & Stone - Carey, OH","40030-01",20081,"No. 8 Agg, 703.02 Concrete Overlay","Limestone"]
["National Lime & Stone - Carey, OH (40030-01)","40030-01",20080,"No. 8 Agg, 703.02 Super-Structure (Limestone)","Limestone",null,null,null,null,null,null,"National Lime & Stone - Carey, OH","40030-01",20080,"No. 8 Agg, 703.02 Super-Structure","Limestone"]
["National Lime & Stone - Carey, OH (40030-01)","40030-01",2057,"No. 57 Agg, 703.02 Concrete (Limestone)","Limestone",null,null,null,null,null,null,"National Lime & Stone - Carey, OH","40030-01",2057,"No. 57 Agg, 703.02 Concrete","Limestone"]
["National Lime & Stone - Carey, OH (40030-01)","40030-01",20570,"No. 57 Agg, 703.02 Super-Structure (Limestone)","Limestone",null,null,null,null,null,null,"National Lime & Stone - Carey, OH","40030-01",20570,"No. 57 Agg, 703.02 Super-Structure","Limestone"]
["National Lime & Stone - Carey, OH (40030-01)","40030-01","02057M","No. 57 Agg, 703.02 Concrete, Mod Grading (Limestone)","Limestone",null,null,null,null,null,null,"National Lime & Stone - Carey, OH","40030-01","02057M","No. 57 Agg, 703.02 Concrete, Mod Grading","Limestone"]
["National Lime & Stone - Carey, OH (40030-01)","40030-01","02057M0","No. 57 Agg, 703.02 Super-Structure, Mod Grading (Limestone)","Limestone",null,null,null,null,null,null,"National Lime & Stone - Carey, OH","40030-01","02057M0","No. 57 Agg, 703.02 Super-Structure, Mod Grading","Limestone"]
[{"$f":"L511&\" (\"&M511&\")\"","v":"National Lime & Stone - Carey, OH (40030-01)"},{"$f":"M511","v":"40030-01"},{"$f":"N511","v":"02067M"},"No. 67 Agg, 703.02 Concrete, Mod Grading (Limestone)","Limestone",null,null,null,null,null,null,"National Lime & Stone - Carey, OH","40030-01","02067M","No. 67 Agg, 703.02 Concrete, Mod Grading","Limestone"]
["National Lime & Stone - Carey, OH (40030-01)","40030-01",20572,{"$f":"IF(ISNUMBER(SEARCH(\"MicroSilica\",O512)),REPLACE(O512,19,11,\", SS847/848\"),O512)&\" \"&IF(ISNUMBER(SEARCH(\"Sand\",O512)),\"\",IF(ISNUMBER(SEARCH(\"Limestone\",P512)),\"(Limestone)\",IF(ISNUMBER(SEARCH(\"Dolostone\",P512)),\"(Dolostone)\",IF(ISNUMBER(SEARCH(\"Gravel (Crushed)\",P512)),\"(Gravel (Crushed))\",IF(ISNUMBER(SEARCH(\"Gravel (100% Crushed)\",P512)),\"(Gravel (100% Crushed))\",IF(ISNUMBER(SEARCH(\"Slag\",P512)),\"(Slag (ACBF))\",IF(ISNUMBER(SEARCH(\"Gravel (Blended W/ Olen-Columbus Limestone)\",P512)),\"(Gravel (Blended W/ Limestone))\",IF(ISNUMBER(SEARCH(\"Gravel (Benefited: 40% Crushed)\",P512)),\"(Gravel (40% Crushed))\",IF(ISNUMBER(SEARCH(\"Sand & Gravel\",P512)),\"(Gravel)\",IF(ISNUMBER(SEARCH(\"Trap Rock\",P512)),\"(Trap Rock)\"))))))))))","v":"No. 57 Agg, 703.13 Freeze-Thaw (Limestone)"},{"$f":"P512","v":"Limestone"},null,null,null,null,null,null,"National Lime & Stone - Carey, OH","40030-01",20572,"No. 57 Agg, 703.13 Freeze-Thaw","Limestone"]
["National Lime & Stone - Carey, OH (40030-01)","40030-01","02057M2","No. 57 Agg, 703.13 Freeze-Thaw, Mod Grading (Limestone)","Limestone",null,null,null,null,null,null,"National Lime & Stone - Carey, OH","40030-01","02057M2","No. 57 Agg, 703.13 Freeze-Thaw, Mod Grading","Limestone"]
["National Lime & Stone - Carey, OH (40030-01)","40030-01","02067M2","No. 67 Agg, 703.13 Freeze-Thaw, Mod Grading (Limestone)","Limestone",null,null,null,null,null,null,"National Lime & Stone - Carey, OH","40030-01","02067M2","No. 67 Agg, 703.13 Freeze-Thaw, Mod Grading","Limestone"]
["National Lime & Stone - Chesterville, OH (45021-01)","45021-01","02SD2","Sand, 703.02 Concrete ","Sand & Gravel",null,null,null,null,null,null,"National Lime & Stone - Chesterville, OH","45021-01","02SD2","Sand, 703.02 Concrete","Sand & Gravel"]
["National Lime & Stone - Findlay, OH (40007-01)","40007-01",2008,"No. 8 Agg, 703.02 Concrete (Limestone)","Limestone",null,null,null,null,null,null,"National Lime & Stone - Findlay, OH","40007-01",2008,"No. 8 Agg, 703.02 Concrete","Limestone"]
["National Lime & Stone - Findlay, OH (40007-01)","40007-01",20572,"No. 57 Agg, 703.13 Freeze-Thaw (Limestone)","Limestone",null,null,null,null,null,null,"National Lime & Stone - Findlay, OH","40007-01",20572,"No. 57 Agg, 703.13 Freeze-Thaw","Limestone"]
["National Lime & Stone - Findlay, OH (40007-01)","40007-01",2067,"No. 67 Agg, 703.02 Concrete (Limestone)","Limestone",null,null,null,null,null,null,"National Lime & Stone - Findlay, OH","40007-01",2067,"No. 67 Agg, 703.02 Concrete","Limestone"]
["National Lime & Stone - Findlay, OH (40007-01)","40007-01",2057,"No. 57 Agg, 703.02 Concrete (Limestone)","Limestone",null,null,null,null,null,null,"National Lime & Stone - Findlay, OH","40007-01",2057,"No. 57 Agg, 703.02 Concrete","Limestone"]
["National Lime & Stone - Findlay, OH (40007-01)","40007-01",20672,"No. 67 Agg, 703.13 Freeze-Thaw (Limestone)","Limestone",null,null,null,null,null,null,"National Lime & Stone - Findlay, OH","40007-01",20672,"No. 67 Agg, 703.13 Freeze-Thaw","Limestone"]
["National Lime & Stone - Lockbourne, OH (45041-01)","45041-01","02SD2","Sand, 703.02 Concrete ","Sand & Gravel",null,null,null,null,null,null,"National Lime & Stone - Lockbourne, OH","45041-01","02SD2","Sand, 703.02 Concrete","Sand & Gravel"]
["National Lime & Stone - Upper Sandusky, OH (40019-01)","40019-01","02SD2","Sand, 703.02 Concrete ","Sand & Gravel",null,null,null,null,null,null,"National Lime & Stone - Upper Sandusky, OH","40019-01","02SD2","Sand, 703.02 Concrete","Sand & Gravel"]
["National Lime & Stone - Wapakoneta, OH (46036B-01)","46036B-01",2008,"No. 8 Agg, 703.02 Concrete (Limestone)","Limestone",null,null,null,null,null,null,"National Lime & Stone - Wapakoneta, OH","46036B-01",2008,"No. 8 Agg, 703.02 Concrete","Limestone"]
["National Lime & Stone - Wapakoneta, OH (46036B-01)","46036B-01",2057,"No. 57 Agg, 703.02 Concrete (Limestone)","Limestone",null,null,null,null,null,null,"National Lime & Stone - Wapakoneta, OH","46036B-01",2057,"No. 57 Agg, 703.02 Concrete","Limestone"]
["National Lime & Stone - Wapakoneta, OH (46036B-01)","46036B-01",20572,"No. 57 Agg, 703.13 Freeze-Thaw (Limestone)","Limestone",null,null,null,null,null,null,"National Lime & Stone - Wapakoneta, OH","46036B-01",20572,"No. 57 Agg, 703.13 Freeze-Thaw","Limestone"]
["Neers S & G - Bellefontaine, OH (46029-01)","46029-01","02SD2","Sand, 703.02 Concrete ","Sand & Gravel",null,null,null,null,null,null,"Neers S & G - Bellefontaine, OH","46029-01","02SD2","Sand, 703.02 Concrete","Sand & Gravel"]
["Neers S & G - Bellefontaine, OH (46029-01)","46029-01","02SD23","Sand, 703.02 Concrete, Acid Insoluble ","Sand & Gravel",null,null,null,null,null,null,"Neers S & G - Bellefontaine, OH","46029-01","02SD23","Sand, 703.02 Concrete, Acid Insoluble","Sand & Gravel"]
["Northern Kentucky Aggregates - Petersburg, KY (47045-01)","47045-01","02SD2","Sand, 703.02 Concrete ","Sand & Gravel",null,null,null,null,null,null,"Northern Kentucky Aggregates - Petersburg, KY","47045-01","02SD2","Sand, 703.02 Concrete","Sand & Gravel"]
["Northern Kentucky Aggregates - Petersburg, KY (47045-01)","47045-01","02SD23","Sand, 703.02 Concrete, Acid Insoluble ","Sand & Gravel",null,null,null,null,null,null,"Northern Kentucky Aggregates - Petersburg, KY","47045-01","02SD23","Sand, 703.02 Concrete, Acid Insoluble","Sand & Gravel"]
["Northern Kentucky Aggregates - Petersburg, KY (47045A-01)","47045A-01",2008,"No. 8 Agg, 703.02 Concrete (Gravel (Crushed))","Sand & Gravel (Crushed)",null,null,null,null,null,null,"Northern Kentucky Aggregates - Petersburg, KY","47045A-01",2008,"No. 8 Agg, 703.02 Concrete","Sand & Gravel (Crushed)"]
["Northern Kentucky Aggregates - Petersburg, KY (47045A-01)","47045A-01",2057,"No. 57 Agg, 703.02 Concrete (Gravel (Crushed))","Sand & Gravel (Crushed)",null,null,null,null,null,null,"Northern Kentucky Aggregates - Petersburg, KY","47045A-01",2057,"No. 57 Agg, 703.02 Concrete","Sand & Gravel (Crushed)"]
["Northern Kentucky Aggregates - Petersburg, KY (47045A-01)","47045A-01",20672,"No. 67 Agg, 703.13 Freeze-Thaw (Gravel (Crushed))","Sand & Gravel (Crushed)",null,null,null,null,null,null,"Northern Kentucky Aggregates - Petersburg, KY","47045A-01",20672,"No. 67 Agg, 703.13 Freeze-Thaw","Sand & Gravel (Crushed)"]
["Oeder & Sons S & G - Lebanon, OH (47024-01)","47024-01","02SD2","Sand, 703.02 Concrete ","Sand & Gravel",null,null,null,null,null,null,"Oeder & Sons S & G - Lebanon, OH","47024-01","02SD2","Sand, 703.02 Concrete","Sand & Gravel"]
["Oeder & Sons S & G - Lebanon, OH (47024-01)","47024-01",2057,"No. 57 Agg, 703.02 Concrete (Gravel)","Sand & Gravel",null,null,null,null,null,null,"Oeder & Sons S & G - Lebanon, OH","47024-01",2057,"No. 57 Agg, 703.02 Concrete","Sand & Gravel"]
["Olen Corp - Columbus, OH (45009-01)","45009-01",2008,"No. 8 Agg, 703.02 Concrete (Gravel (100% Crushed))","Sand & Gravel (100% Crushed)",null,null,null,null,null,null,"Olen Corp - Columbus, OH","45009-01",2008,"No. 8 Agg, 703.02 Concrete","Sand & Gravel (100% Crushed)"]
["Olen Corp - Columbus, OH (45009-01)","45009-01",2067,"No. 67 Agg, 703.02 Concrete (Gravel (100% Crushed))","Sand & Gravel (100% Crushed)",null,null,null,null,null,null,"Olen Corp - Columbus, OH","45009-01",2067,"No. 67 Agg, 703.02 Concrete","Sand & Gravel (100% Crushed)"]
["Olen Corp - Columbus, OH (45009-01)","45009-01",20672,"No. 67 Agg, 703.13 Freeze-Thaw (Gravel (100% Crushed))","Sand & Gravel (100% Crushed)",null,null,null,null,null,null,"Olen Corp - Columbus, OH","45009-01",20672,"No. 67 Agg, 703.13 Freeze-Thaw","Sand & Gravel (100% Crushed)"]
["Olen Corp - Columbus, OH (45009A-01)","45009A-01",2057,"No. 57 Agg, 703.02 Concrete (Gravel (40% Crushed))","Sand & Gravel (Benefited: 40% Crushed)",null,null,null,null,null,null,"Olen Corp - Columbus, OH","45009A-01",2057,"No. 57 Agg, 703.02 Concrete","Sand & Gravel (Benefited: 40% Crushed)"]
["Olen Corp - Columbus, OH (45009A-01)","45009A-01","02SD2","Sand, 703.02 Concrete ","Sand & Gravel (Benefited: 40% Crushed)",null,null,null,null,null,null,"Olen Corp - Columbus, OH","45009A-01","02SD2","Sand, 703.02 Concrete","Sand & Gravel (Benefited: 40% Crushed)"]
["Olen Corp - Columbus, OH (45009A-01)","45009A-01","02SD23","Sand, 703.02 Concrete, Acid Insoluble ","Sand & Gravel (Benefited: 40% Crushed)",null,null,null,null,null,null,"Olen Corp - Columbus, OH","45009A-01","02SD23","Sand, 703.02 Concrete, Acid Insoluble","Sand & Gravel (Benefited: 40% Crushed)"]
["Olen Corp - Columbus, OH (45038-01)","45038-01",2057,"No. 57 Agg, 703.02 Concrete (Limestone)","Limestone",null,null,null,null,null,null,"Olen Corp - Columbus, OH","45038-01",2057,"No. 57 Agg, 703.02 Concrete","Limestone"]
["Olen Corp - Columbus, OH (45038-01)","45038-01",2008,"No. 8 Agg, 703.02 Concrete (Limestone)","Limestone",null,null,null,null,null,null,"Olen Corp - Columbus, OH","45038-01",2008,"No. 8 Agg, 703.02 Concrete","Limestone"]
["Olen Corp - Columbus, OH (45038-01)","45038-01",20080,"No. 8 Agg, 703.02 Super-Structure (Limestone)","Limestone",null,null,null,null,null,null,"Olen Corp - Columbus, OH","45038-01",20080,"No. 8 Agg, 703.02 Super-Structure","Limestone"]
["Olen Corp - Columbus, OH (45038-01)","45038-01",20570,"No. 57 Agg, 703.02 Super-Structure (Limestone)","Limestone",null,null,null,null,null,null,"Olen Corp - Columbus, OH","45038-01",20570,"No. 57 Agg, 703.02 Super-Structure","Limestone"]
["Olen Corp - Fredericktown, OH (44020-01)","44020-01","02SD2","Sand, 703.02 Concrete ","Sand & Gravel",null,null,null,null,null,null,"Olen Corp - Fredericktown, OH","44020-01","02SD2","Sand, 703.02 Concrete","Sand & Gravel"]
["Olen Corp - Fredericktown, OH (44020-01)","44020-01","02SD23","Sand, 703.02 Concrete, Acid Insoluble ","Sand & Gravel",null,null,null,null,null,null,"Olen Corp - Fredericktown, OH","44020-01","02SD23","Sand, 703.02 Concrete, Acid Insoluble","Sand & Gravel"]
["Olen Corp - Fredericktown, OH (44020A-01)","44020A-01",2057,"No. 57 Agg, 703.02 Concrete (Gravel)","Sand & Gravel",null,null,null,null,null,null,"Olen Corp - Fredericktown, OH","44020A-01",2057,"No. 57 Agg, 703.02 Concrete","Sand & Gravel"]
["Olen Corp - St. Louisville, OH (44010-01)","44010-01","02SD2","Sand, 703.02 Concrete ","Sand & Gravel",null,null,null,null,null,null,"Olen Corp - St. Louisville, OH","44010-01","02SD2","Sand, 703.02 Concrete","Sand & Gravel"]
["Olen Corp - St. Louisville, OH (44010-01)","44010-01","02SD23","Sand, 703.02 Concrete, Acid Insoluble ","Sand & Gravel",null,null,null,null,null,null,"Olen Corp - St. Louisville, OH","44010-01","02SD23","Sand, 703.02 Concrete, Acid Insoluble","Sand & Gravel"]
["Olen Corp - Upper Sandusky, OH (40004B-01)","40004B-01",20081,"No. 8 Agg, 703.02 Concrete Overlay (Dolostone)","Dolostone",null,null,null,null,null,null,"Olen Corp - Upper Sandusky, OH","40004B-01",20081,"No. 8 Agg, 703.02 Concrete Overlay","Dolostone"]
["Olen Corp - Upper Sandusky, OH (40004B-01)","40004B-01",2057,"No. 57 Agg, 703.02 Concrete (Dolostone)","Dolostone",null,null,null,null,null,null,"Olen Corp - Upper Sandusky, OH","40004B-01",2057,"No. 57 Agg, 703.02 Concrete","Dolostone"]
["Olen Corp - Upper Sandusky, OH (40004B-01)","40004B-01",20572,"No. 57 Agg, 703.13 Freeze-Thaw (Dolostone)","Dolostone",null,null,null,null,null,null,"Olen Corp - Upper Sandusky, OH","40004B-01",20572,"No. 57 Agg, 703.13 Freeze-Thaw","Dolostone"]
["Olen Corp - Upper Sandusky, OH (40004B-01)","40004B-01",2008,"No. 8 Agg, 703.02 Concrete (Dolostone)","Dolostone",null,null,null,null,null,null,"Olen Corp - Upper Sandusky, OH","40004B-01",2008,"No. 8 Agg, 703.02 Concrete","Dolostone"]
["Olen Corp - Upper Sandusky, OH (40004B-01)","40004B-01",20080,"No. 8 Agg, 703.02 Super-Structure (Dolostone)","Dolostone",null,null,null,null,null,null,"Olen Corp - Upper Sandusky, OH","40004B-01",20080,"No. 8 Agg, 703.02 Super-Structure","Dolostone"]
["Olen Corp - Upper Sandusky, OH (40004B-01)","40004B-01",20570,"No. 57 Agg, 703.02 Super-Structure (Dolostone)","Dolostone",null,null,null,null,null,null,"Olen Corp - Upper Sandusky, OH","40004B-01",20570,"No. 57 Agg, 703.02 Super-Structure","Dolostone"]
["Olen Corp - Wooster, OH (42015-01)","42015-01","02SD2","Sand, 703.02 Concrete ","Sand & Gravel",null,null,null,null,null,null,"Olen Corp - Wooster, OH","42015-01","02SD2","Sand, 703.02 Concrete","Sand & Gravel"]
["Olen Corp - Wooster, OH (42015-01)","42015-01","02SD23","Sand, 703.02 Concrete, Acid Insoluble ","Sand & Gravel",null,null,null,null,null,null,"Olen Corp - Wooster, OH","42015-01","02SD23","Sand, 703.02 Concrete, Acid Insoluble","Sand & Gravel"]
["Ontario Trap Rock - Ontario, Canada (41044-01)","41044-01","02SD2","Sand, 703.02 Concrete ","Trap Rock",null,null,null,null,null,null,"Ontario Trap Rock - Ontario, Canada","41044-01","02SD2","Sand, 703.02 Concrete","Trap Rock"]
["Ontario Trap Rock - Ontario, Canada (41044-01)","41044-01",20081,"No. 8 Agg, 703.02 Concrete Overlay (Trap Rock)","Trap Rock",null,null,null,null,null,null,"Ontario Trap Rock - Ontario, Canada","41044-01",20081,"No. 8 Agg, 703.02 Concrete Overlay","Trap Rock"]
["Ontario Trap Rock - Ontario, Canada (41044-01)","41044-01",2008,"No. 8 Agg, 703.02 Concrete (Trap Rock)","Trap Rock",null,null,null,null,null,null,"Ontario Trap Rock - Ontario, Canada","41044-01",2008,"No. 8 Agg, 703.02 Concrete","Trap Rock"]
["Ontario Trap Rock - Ontario, Canada (41044-01)","41044-01",20080,"No. 8 Agg, 703.02 Super-Structure (Trap Rock)","Trap Rock",null,null,null,null,null,null,"Ontario Trap Rock - Ontario, Canada","41044-01",20080,"No. 8 Agg, 703.02 Super-Structure","Trap Rock"]
["Ontario Trap Rock - Ontario, Canada (41044-01)","41044-01",2057,"No. 57 Agg, 703.02 Concrete (Trap Rock)","Trap Rock",null,null,null,null,null,null,"Ontario Trap Rock - Ontario, Canada","41044-01",2057,"No. 57 Agg, 703.02 Concrete","Trap Rock"]
["Ontario Trap Rock - Ontario, Canada (41044-01)","41044-01",20570,"No. 57 Agg, 703.02 Super-Structure (Trap Rock)","Trap Rock",null,null,null,null,null,null,"Ontario Trap Rock - Ontario, Canada","41044-01",20570,"No. 57 Agg, 703.02 Super-Structure","Trap Rock"]
["Oscar Brugmann Sand & Gravel - Mantua, OH (43006-01)","43006-01","02SD2","Sand, 703.02 Concrete ","Sand & Gravel",null,null,null,null,null,null,"Oscar Brugmann Sand & Gravel - Mantua, OH","43006-01","02SD2","Sand, 703.02 Concrete","Sand & Gravel"]
["Oster S & G - Massillon, OH (43025-01)","43025-01","02SD2","Sand, 703.02 Concrete ","Sand & Gravel",null,null,null,null,null,null,"Oster S & G - Massillon, OH","43025-01","02SD2","Sand, 703.02 Concrete","Sand & Gravel"]
["Oster S & G - Massillon, OH (43025-01)","43025-01","02SD23","Sand, 703.02 Concrete, Acid Insoluble ","Sand & Gravel",null,null,null,null,null,null,"Oster S & G - Massillon, OH","43025-01","02SD23","Sand, 703.02 Concrete, Acid Insoluble","Sand & Gravel"]
["Oster S & G - Massillon, OH (43025-01)","43025-01",2008,"No. 8 Agg, 703.02 Concrete (Gravel)","Sand & Gravel",null,null,null,null,null,null,"Oster S & G - Massillon, OH","43025-01",2008,"No. 8 Agg, 703.02 Concrete","Sand & Gravel"]
["Phillips Companies - Vandalia, OH (46014-01)","46014-01",2057,"No. 57 Agg, 703.02 Concrete (Gravel)","Sand & Gravel",null,null,null,null,null,null,"Phillips Companies - Vandalia, OH","46014-01",2057,"No. 57 Agg, 703.02 Concrete","Sand & Gravel"]
["Phillips Companies - Vandalia, OH (46014-01)","46014-01","02SD2","Sand, 703.02 Concrete ","Sand & Gravel",null,null,null,null,null,null,"Phillips Companies - Vandalia, OH","46014-01","02SD2","Sand, 703.02 Concrete","Sand & Gravel"]
["Phillips Companies - Vandalia, OH (46014-01)","46014-01",20572,"No. 57 Agg, 703.13 Freeze-Thaw (Gravel)","Sand & Gravel",null,null,null,null,null,null,"Phillips Companies - Vandalia, OH","46014-01",20572,"No. 57 Agg, 703.13 Freeze-Thaw","Sand & Gravel"]
["Phillips Companies - Xenia, OH (47025-01)","47025-01",2008,"No. 8 Agg, 703.02 Concrete (Gravel)","Sand & Gravel",null,null,null,null,null,null,"Phillips Companies - Xenia, OH","47025-01",2008,"No. 8 Agg, 703.02 Concrete","Sand & Gravel"]
["Phillips Companies - Xenia, OH (47025-01)","47025-01",2057,"No. 57 Agg, 703.02 Concrete (Gravel)","Sand & Gravel",null,null,null,null,null,null,"Phillips Companies - Xenia, OH","47025-01",2057,"No. 57 Agg, 703.02 Concrete","Sand & Gravel"]
["Phillips Companies - Xenia, OH (47025-01)","47025-01","02SD2","Sand, 703.02 Concrete ","Sand & Gravel",null,null,null,null,null,null,"Phillips Companies - Xenia, OH","47025-01","02SD2","Sand, 703.02 Concrete","Sand & Gravel"]
["Phillips Companies - Xenia, OH (47025-01)","47025-01","02SD23","Sand, 703.02 Concrete, Acid Insoluble ","Sand & Gravel",null,null,null,null,null,null,"Phillips Companies - Xenia, OH","47025-01","02SD23","Sand, 703.02 Concrete, Acid Insoluble","Sand & Gravel"]
[{"$f":"L575&\" (\"&M575&\")\"","v":"Phoenix Asphalt - Magnolia, OH (50064-01)"},{"$f":"M575","v":"50064-01"},{"$f":"N575","v":"02SD2"},"Sand, 703.02 Concrete ","Sand & Gravel",null,null,null,null,null,null,"Phoenix Asphalt - Magnolia, OH","50064-01","02SD2","Sand, 703.02 Concrete","Sand & Gravel"]
["Phoenix Asphalt - Magnolia, OH (50064-01)","50064-01",2008,{"$f":"IF(ISNUMBER(SEARCH(\"MicroSilica\",O576)),REPLACE(O576,19,11,\", SS847/848\"),O576)&\" \"&IF(ISNUMBER(SEARCH(\"Sand\",O576)),\"\",IF(ISNUMBER(SEARCH(\"Limestone\",P576)),\"(Limestone)\",IF(ISNUMBER(SEARCH(\"Dolostone\",P576)),\"(Dolostone)\",IF(ISNUMBER(SEARCH(\"Gravel (Crushed)\",P576)),\"(Gravel (Crushed))\",IF(ISNUMBER(SEARCH(\"Gravel (100% Crushed)\",P576)),\"(Gravel (100% Crushed))\",IF(ISNUMBER(SEARCH(\"Slag\",P576)),\"(Slag (ACBF))\",IF(ISNUMBER(SEARCH(\"Gravel (Blended W/ Olen-Columbus Limestone)\",P576)),\"(Gravel (Blended W/ Limestone))\",IF(ISNUMBER(SEARCH(\"Gravel (Benefited: 40% Crushed)\",P576)),\"(Gravel (40% Crushed))\",IF(ISNUMBER(SEARCH(\"Sand & Gravel\",P576)),\"(Gravel)\",IF(ISNUMBER(SEARCH(\"Trap Rock\",P576)),\"(Trap Rock)\"))))))))))","v":"No. 8 Agg, 703.02 Concrete (Gravel)"},{"$f":"P576","v":"Sand & Gravel"},null,null,null,null,null,null,"Phoenix Asphalt - Magnolia, OH","50064-01",2008,"No. 8 Agg, 703.02 Concrete","Sand & Gravel"]
["Piqua Materials - Piqua, OH (46015-01)","46015-01",20080,"No. 8 Agg, 703.02 Super-Structure (Dolostone)","Dolostone",null,null,null,null,null,null,"Piqua Materials - Piqua, OH","46015-01",20080,"No. 8 Agg, 703.02 Super-Structure","Dolostone"]
["Piqua Materials - Piqua, OH (46015-01)","46015-01",2008,"No. 8 Agg, 703.02 Concrete (Dolostone)","Dolostone",null,null,null,null,null,null,"Piqua Materials - Piqua, OH","46015-01",2008,"No. 8 Agg, 703.02 Concrete","Dolostone"]
["Piqua Materials - Piqua, OH (46015-01)","46015-01",20570,"No. 57 Agg, 703.02 Super-Structure (Dolostone)","Dolostone",null,null,null,null,null,null,"Piqua Materials - Piqua, OH","46015-01",20570,"No. 57 Agg, 703.02 Super-Structure","Dolostone"]
["Piqua Materials - Piqua, OH (46015-01)","46015-01",2057,"No. 57 Agg, 703.02 Concrete (Dolostone)","Dolostone",null,null,null,null,null,null,"Piqua Materials - Piqua, OH","46015-01",2057,"No. 57 Agg, 703.02 Concrete","Dolostone"]
["Piqua Materials - Piqua, OH (46015-01)","46015-01",20572,"No. 57 Agg, 703.13 Freeze-Thaw (Dolostone)","Dolostone",null,null,null,null,null,null,"Piqua Materials - Piqua, OH","46015-01",20572,"No. 57 Agg, 703.13 Freeze-Thaw","Dolostone"]
["Precision Agg - Portage, OH (41033-01)","41033-01",20081,"No. 8 Agg, 703.02 Concrete Overlay (Limestone)","Limestone",null,null,null,null,null,null,"Precision Agg - Portage, OH","41033-01",20081,"No. 8 Agg, 703.02 Concrete Overlay","Limestone"]
["Precision Agg - Portage, OH (41033-01)","41033-01",2008,"No. 8 Agg, 703.02 Concrete (Limestone)","Limestone",null,null,null,null,null,null,"Precision Agg - Portage, OH","41033-01",2008,"No. 8 Agg, 703.02 Concrete","Limestone"]
["Precision Agg - Portage, OH (41033-01)","41033-01",20080,"No. 8 Agg, 703.02 Super-Structure (Limestone)","Limestone",null,null,null,null,null,null,"Precision Agg - Portage, OH","41033-01",20080,"No. 8 Agg, 703.02 Super-Structure","Limestone"]
["Precision Agg - Portage, OH (41033-01)","41033-01",2057,"No. 57 Agg, 703.02 Concrete (Limestone)","Limestone",null,null,null,null,null,null,"Precision Agg - Portage, OH","41033-01",2057,"No. 57 Agg, 703.02 Concrete","Limestone"]
["Precision Agg - Portage, OH (41033-01)","41033-01",20570,"No. 57 Agg, 703.02 Super-Structure (Limestone)","Limestone",null,null,null,null,null,null,"Precision Agg - Portage, OH","41033-01",20570,"No. 57 Agg, 703.02 Super-Structure","Limestone"]
["Precision Agg - Portage, OH (41033-01)","41033-01",20572,"No. 57 Agg, 703.13 Freeze-Thaw (Limestone)","Limestone",null,null,null,null,null,null,"Precision Agg - Portage, OH","41033-01",20572,"No. 57 Agg, 703.13 Freeze-Thaw","Limestone"]
["Riverside - Battletown, KY (49037-01)","49037-01",2067,"No. 67 Agg, 703.02 Concrete (Limestone)","Indirect-Out-of-State / Limestone",null,null,null,null,null,null,"Riverside - Battletown, KY","49037-01",2067,"No. 67 Agg, 703.02 Concrete","Indirect-Out-of-State / Limestone"]
["Riverside - Battletown, KY (49037-01)","49037-01",2057,"No. 57 Agg, 703.02 Concrete (Limestone)","Indirect-Out-of-State / Limestone",null,null,null,null,null,null,"Riverside - Battletown, KY","49037-01",2057,"No. 57 Agg, 703.02 Concrete","Indirect-Out-of-State / Limestone"]
["Rootstown S & G - Ravenna, OH (43077-01)","43077-01","02SD2","Sand, 703.02 Concrete ","Sand & Gravel",null,null,null,null,null,null,"Rootstown S & G - Ravenna, OH","43077-01","02SD2","Sand, 703.02 Concrete","Sand & Gravel"]
["Rootstown S & G - Ravenna, OH (43077-01)","43077-01","02SD23","Sand, 703.02 Concrete, Acid Insoluble ","Sand & Gravel",null,null,null,null,null,null,"Rootstown S & G - Ravenna, OH","43077-01","02SD23","Sand, 703.02 Concrete, Acid Insoluble","Sand & Gravel"]
["Rupp Construction - Marshallville, OH (42014-01)","42014-01","02SD2","Sand, 703.02 Concrete ","Sand & Gravel",null,null,null,null,null,null,"Rupp Construction - Marshallville, OH","42014-01","02SD2","Sand, 703.02 Concrete","Sand & Gravel"]
["Rupp Construction - Marshallville, OH (42014-01)","42014-01","02SD23","Sand, 703.02 Concrete, Acid Insoluble ","Sand & Gravel",null,null,null,null,null,null,"Rupp Construction - Marshallville, OH","42014-01","02SD23","Sand, 703.02 Concrete, Acid Insoluble","Sand & Gravel"]
["Shelly Materials - Belle Center, OH (46026-01)","46026-01",20080,"No. 8 Agg, 703.02 Super-Structure (Limestone)","Limestone",null,null,null,null,null,null,"Shelly Materials - Belle Center, OH","46026-01",20080,"No. 8 Agg, 703.02 Super-Structure","Limestone"]
["Shelly Materials - Belle Center, OH (46026-01)","46026-01",20081,"No. 8 Agg, 703.02 Concrete Overlay (Limestone)","Limestone",null,null,null,null,null,null,"Shelly Materials - Belle Center, OH","46026-01",20081,"No. 8 Agg, 703.02 Concrete Overlay","Limestone"]
["Shelly Materials - Belle Center, OH (46026-01)","46026-01",2008,"No. 8 Agg, 703.02 Concrete (Limestone)","Limestone",null,null,null,null,null,null,"Shelly Materials - Belle Center, OH","46026-01",2008,"No. 8 Agg, 703.02 Concrete","Limestone"]
["Shelly Materials - Belle Center, OH (46026-01)","46026-01",20570,"No. 57 Agg, 703.02 Super-Structure (Limestone)","Limestone",null,null,null,null,null,null,"Shelly Materials - Belle Center, OH","46026-01",20570,"No. 57 Agg, 703.02 Super-Structure","Limestone"]
["Shelly Materials - Belle Center, OH (46026-01)","46026-01",2057,"No. 57 Agg, 703.02 Concrete (Limestone)","Limestone",null,null,null,null,null,null,"Shelly Materials - Belle Center, OH","46026-01",2057,"No. 57 Agg, 703.02 Concrete","Limestone"]
["Shelly Materials - Belle Center, OH (46026-01)","46026-01",20572,"No. 57 Agg, 703.13 Freeze-Thaw (Limestone)","Limestone",null,null,null,null,null,null,"Shelly Materials - Belle Center, OH","46026-01",20572,"No. 57 Agg, 703.13 Freeze-Thaw","Limestone"]
["Shelly Materials - Chillicothe, OH (48004-01)","48004-01","02SD2","Sand, 703.02 Concrete ","Sand & Gravel",null,null,null,null,null,null,"Shelly Materials - Chillicothe, OH","48004-01","02SD2","Sand, 703.02 Concrete","Sand & Gravel"]
["Shelly Materials - Chillicothe, OH (48004-01)","48004-01","02SD23","Sand, 703.02 Concrete, Acid Insoluble ","Sand & Gravel",null,null,null,null,null,null,"Shelly Materials - Chillicothe, OH","48004-01","02SD23","Sand, 703.02 Concrete, Acid Insoluble","Sand & Gravel"]
["Shelly Materials - Coshocton, OH (44003-01)","44003-01",20080,"No. 8 Agg, 703.02 Super-Structure (Gravel)","Sand & Gravel",null,null,null,null,null,null,"Shelly Materials - Coshocton, OH","44003-01",20080,"No. 8 Agg, 703.02 Super-Structure","Sand & Gravel"]
["Shelly Materials - Coshocton, OH (44003-01)","44003-01",20081,"No. 8 Agg, 703.02 Concrete Overlay (Gravel)","Sand & Gravel",null,null,null,null,null,null,"Shelly Materials - Coshocton, OH","44003-01",20081,"No. 8 Agg, 703.02 Concrete Overlay","Sand & Gravel"]
["Shelly Materials - Coshocton, OH (44003-01)","44003-01",2057,"No. 57 Agg, 703.02 Concrete (Gravel)","Sand & Gravel",null,null,null,null,null,null,"Shelly Materials - Coshocton, OH","44003-01",2057,"No. 57 Agg, 703.02 Concrete","Sand & Gravel"]
["Shelly Materials - Coshocton, OH (44003-01)","44003-01","02SD2","Sand, 703.02 Concrete ","Sand & Gravel",null,null,null,null,null,null,"Shelly Materials - Coshocton, OH","44003-01","02SD2","Sand, 703.02 Concrete","Sand & Gravel"]
["Shelly Materials - Coshocton, OH (44003-01)","44003-01","02SD23","Sand, 703.02 Concrete, Acid Insoluble ","Sand & Gravel",null,null,null,null,null,null,"Shelly Materials - Coshocton, OH","44003-01","02SD23","Sand, 703.02 Concrete, Acid Insoluble","Sand & Gravel"]
["Shelly Materials - Coshocton, OH (44003-01)","44003-01",2008,"No. 8 Agg, 703.02 Concrete (Gravel)","Sand & Gravel",null,null,null,null,null,null,"Shelly Materials - Coshocton, OH","44003-01",2008,"No. 8 Agg, 703.02 Concrete","Sand & Gravel"]
["Shelly Materials - Coshocton, OH (44003-01)","44003-01",20570,"No. 57 Agg, 703.02 Super-Structure (Gravel)","Sand & Gravel",null,null,null,null,null,null,"Shelly Materials - Coshocton, OH","44003-01",20570,"No. 57 Agg, 703.02 Super-Structure","Sand & Gravel"]
["Shelly Materials - Coshocton, OH (44003-01)","44003-01",20572,"No. 57 Agg, 703.13 Freeze-Thaw (Gravel)","Sand & Gravel",null,null,null,null,null,null,"Shelly Materials - Coshocton, OH","44003-01",20572,"No. 57 Agg, 703.13 Freeze-Thaw","Sand & Gravel"]
["Shelly Materials - Dresden, OH (44002-01)","44002-01","02SD2","Sand, 703.02 Concrete ","Sand & Gravel",null,null,null,null,null,null,"Shelly Materials - Dresden, OH","44002-01","02SD2","Sand, 703.02 Concrete","Sand & Gravel"]
["Shelly Materials - East Fultonham, OH (44013A-01)","44013A-01",2057,"No. 57 Agg, 703.02 Concrete (Limestone)","Limestone (Blended W/ Shelly-Columbus Limestone 75:25)",null,null,null,null,null,null,"Shelly Materials - East Fultonham, OH","44013A-01",2057,"No. 57 Agg, 703.02 Concrete","Limestone (Blended W/ Shelly-Columbus Limestone 75:25)"]
["Shelly Materials - East Fultonham, OH (44013A-01)","44013A-01",20572,"No. 57 Agg, 703.13 Freeze-Thaw (Limestone)","Limestone (Blended W/ Shelly-Columbus Limestone 75:25)",null,null,null,null,null,null,"Shelly Materials - East Fultonham, OH","44013A-01",20572,"No. 57 Agg, 703.13 Freeze-Thaw","Limestone (Blended W/ Shelly-Columbus Limestone 75:25)"]
["Shelly Materials - Forest, OH (40020-01)","40020-01",2008,"No. 8 Agg, 703.02 Concrete (Limestone)","Limestone",null,null,null,null,null,null,"Shelly Materials - Forest, OH","40020-01",2008,"No. 8 Agg, 703.02 Concrete","Limestone"]
["Shelly Materials - Forest, OH (40020-01)","40020-01",20081,"No. 8 Agg, 703.02 Concrete Overlay (Limestone)","Limestone",null,null,null,null,null,null,"Shelly Materials - Forest, OH","40020-01",20081,"No. 8 Agg, 703.02 Concrete Overlay","Limestone"]
["Shelly Materials - Forest, OH (40020-01)","40020-01",20080,"No. 8 Agg, 703.02 Super-Structure (Limestone)","Limestone",null,null,null,null,null,null,"Shelly Materials - Forest, OH","40020-01",20080,"No. 8 Agg, 703.02 Super-Structure","Limestone"]
["Shelly Materials - Forest, OH (40020-01)","40020-01",20572,"No. 57 Agg, 703.13 Freeze-Thaw (Limestone)","Limestone",null,null,null,null,null,null,"Shelly Materials - Forest, OH","40020-01",20572,"No. 57 Agg, 703.13 Freeze-Thaw","Limestone"]
["Shelly Materials - Forest, OH (40020-01)","40020-01",2057,"No. 57 Agg, 703.02 Concrete (Limestone)","Limestone",null,null,null,null,null,null,"Shelly Materials - Forest, OH","40020-01",2057,"No. 57 Agg, 703.02 Concrete","Limestone"]
["Shelly Materials - Forest, OH (40020-01)","40020-01",20570,"No. 57 Agg, 703.02 Super-Structure (Limestone)","Limestone",null,null,null,null,null,null,"Shelly Materials - Forest, OH","40020-01",20570,"No. 57 Agg, 703.02 Super-Structure","Limestone"]
["Shelly Materials - Grove City, OH (45003-01)","45003-01","02SD2","Sand, 703.02 Concrete ","Sand & Gravel",null,null,null,null,null,null,"Shelly Materials - Grove City, OH","45003-01","02SD2","Sand, 703.02 Concrete","Sand & Gravel"]
["Shelly Materials - Hilliard, OH (45004-01)","45004-01",2057,"No. 57 Agg, 703.02 Concrete (Limestone)","Limestone",null,null,null,null,null,null,"Shelly Materials - Hilliard, OH","45004-01",2057,"No. 57 Agg, 703.02 Concrete","Limestone"]
["Shelly Materials - Hilliard, OH (45004-01)","45004-01",20570,"No. 57 Agg, 703.02 Super-Structure (Limestone)","Limestone",null,null,null,null,null,null,"Shelly Materials - Hilliard, OH","45004-01",20570,"No. 57 Agg, 703.02 Super-Structure","Limestone"]
["Shelly Materials - Hilliard, OH (45004A-01)","45004A-01",20572,"No. 57 Agg, 703.13 Freeze-Thaw (Limestone)","Limestone",null,null,null,null,null,null,"Shelly Materials - Hilliard, OH","45004A-01",20572,"No. 57 Agg, 703.13 Freeze-Thaw","Limestone"]
["Shelly Materials - Lockbourne, OH (45043-01)","45043-01","02SD2","Sand, 703.02 Concrete ","Sand & Gravel",null,null,null,null,null,null,"Shelly Materials - Lockbourne, OH","45043-01","02SD2","Sand, 703.02 Concrete","Sand & Gravel"]
["Shelly Materials - Marietta, OH (49048-01)","49048-01",2008,"No. 8 Agg, 703.02 Concrete (Gravel)","Sand & Gravel",null,null,null,null,null,null,"Shelly Materials - Marietta, OH","49048-01",2008,"No. 8 Agg, 703.02 Concrete","Sand & Gravel"]
["Shelly Materials - Marietta, OH (49048-01)","49048-01",20080,"No. 8 Agg, 703.02 Super-Structure (Gravel)","Sand & Gravel",null,null,null,null,null,null,"Shelly Materials - Marietta, OH","49048-01",20080,"No. 8 Agg, 703.02 Super-Structure","Sand & Gravel"]
["Shelly Materials - Marietta, OH (49048-01)","49048-01",20081,"No. 8 Agg, 703.02 Concrete Overlay (Gravel)","Sand & Gravel",null,null,null,null,null,null,"Shelly Materials - Marietta, OH","49048-01",20081,"No. 8 Agg, 703.02 Concrete Overlay","Sand & Gravel"]
["Shelly Materials - Marietta, OH (49048-01)","49048-01",20570,"No. 57 Agg, 703.02 Super-Structure (Gravel)","Sand & Gravel",null,null,null,null,null,null,"Shelly Materials - Marietta, OH","49048-01",20570,"No. 57 Agg, 703.02 Super-Structure","Sand & Gravel"]
["Shelly Materials - Marietta, OH (49048-01)","49048-01",2057,"No. 57 Agg, 703.02 Concrete (Gravel)","Sand & Gravel",null,null,null,null,null,null,"Shelly Materials - Marietta, OH","49048-01",2057,"No. 57 Agg, 703.02 Concrete","Sand & Gravel"]
["Shelly Materials - Marietta, OH (49048-01)","49048-01",20572,"No. 57 Agg, 703.13 Freeze-Thaw (Gravel)","Sand & Gravel",null,null,null,null,null,null,"Shelly Materials - Marietta, OH","49048-01",20572,"No. 57 Agg, 703.13 Freeze-Thaw","Sand & Gravel"]
["Shelly Materials - Marietta, OH (49048-01)","49048-01","02SD2","Sand, 703.02 Concrete ","Sand & Gravel",null,null,null,null,null,null,"Shelly Materials - Marietta, OH","49048-01","02SD2","Sand, 703.02 Concrete","Sand & Gravel"]
["Shelly Materials - Mechanicsburg, OH (46053-01)","46053-01",20572,"No. 57 Agg, 703.13 Freeze-Thaw (Gravel)","Sand & Gravel",null,null,null,null,null,null,"Shelly Materials - Mechanicsburg, OH","46053-01",20572,"No. 57 Agg, 703.13 Freeze-Thaw","Sand & Gravel"]
["Shelly Materials - Mechanicsburg, OH (46053-01)","46053-01",2057,"No. 57 Agg, 703.02 Concrete (Gravel)","Sand & Gravel",null,null,null,null,null,null,"Shelly Materials - Mechanicsburg, OH","46053-01",2057,"No. 57 Agg, 703.02 Concrete","Sand & Gravel"]
["Shelly Materials - Mechanicsburg, OH (46053-01)","46053-01",2008,"No. 8 Agg, 703.02 Concrete (Gravel)","Sand & Gravel",null,null,null,null,null,null,"Shelly Materials - Mechanicsburg, OH","46053-01",2008,"No. 8 Agg, 703.02 Concrete","Sand & Gravel"]
["Shelly Materials - Mechanicsburg, OH (46053-01)","46053-01","02SD2","Sand, 703.02 Concrete ","Sand & Gravel",null,null,null,null,null,null,"Shelly Materials - Mechanicsburg, OH","46053-01","02SD2","Sand, 703.02 Concrete","Sand & Gravel"]
["Shelly Materials - Ostrander, OH (45019-01)","45019-01",20080,"No. 8 Agg, 703.02 Super-Structure (Limestone)","Limestone",null,null,null,null,null,null,"Shelly Materials - Ostrander, OH","45019-01",20080,"No. 8 Agg, 703.02 Super-Structure","Limestone"]
["Shelly Materials - Ostrander, OH (45019-01)","45019-01",20081,"No. 8 Agg, 703.02 Concrete Overlay (Limestone)","Limestone",null,null,null,null,null,null,"Shelly Materials - Ostrander, OH","45019-01",20081,"No. 8 Agg, 703.02 Concrete Overlay","Limestone"]
["Shelly Materials - Ostrander, OH (45019-01)","45019-01",2008,"No. 8 Agg, 703.02 Concrete (Limestone)","Limestone",null,null,null,null,null,null,"Shelly Materials - Ostrander, OH","45019-01",2008,"No. 8 Agg, 703.02 Concrete","Limestone"]
["Shelly Materials - Ostrander, OH (45019-01)","45019-01",20570,"No. 57 Agg, 703.02 Super-Structure (Limestone)","Limestone",null,null,null,null,null,null,"Shelly Materials - Ostrander, OH","45019-01",20570,"No. 57 Agg, 703.02 Super-Structure","Limestone"]
[{"$f":"L639&\" (\"&M639&\")\"","v":"Shelly Materials - Ostrander, OH (45019-01)"},{"$f":"M639","v":"45019-01"},{"$f":"N639","v":2057},"No. 57 Agg, 703.02 Concrete (Limestone)","Limestone",null,null,null,null,null,null,"Shelly Materials - Ostrander, OH","45019-01",2057,"No. 57 Agg, 703.02 Concrete","Limestone"]
["Shelly Materials - Ostrander, OH (45019-01)","45019-01",20572,{"$f":"IF(ISNUMBER(SEARCH(\"MicroSilica\",O640)),REPLACE(O640,19,11,\", SS847/848\"),O640)&\" \"&IF(ISNUMBER(SEARCH(\"Sand\",O640)),\"\",IF(ISNUMBER(SEARCH(\"Limestone\",P640)),\"(Limestone)\",IF(ISNUMBER(SEARCH(\"Dolostone\",P640)),\"(Dolostone)\",IF(ISNUMBER(SEARCH(\"Gravel (Crushed)\",P640)),\"(Gravel (Crushed))\",IF(ISNUMBER(SEARCH(\"Gravel (100% Crushed)\",P640)),\"(Gravel (100% Crushed))\",IF(ISNUMBER(SEARCH(\"Slag\",P640)),\"(Slag (ACBF))\",IF(ISNUMBER(SEARCH(\"Gravel (Blended W/ Olen-Columbus Limestone)\",P640)),\"(Gravel (Blended W/ Limestone))\",IF(ISNUMBER(SEARCH(\"Gravel (Benefited: 40% Crushed)\",P640)),\"(Gravel (40% Crushed))\",IF(ISNUMBER(SEARCH(\"Sand & Gravel\",P640)),\"(Gravel)\",IF(ISNUMBER(SEARCH(\"Trap Rock\",P640)),\"(Trap Rock)\"))))))))))","v":"No. 57 Agg, 703.13 Freeze-Thaw (Limestone)"},{"$f":"P640","v":"Limestone"},null,null,null,null,null,null,"Shelly Materials - Ostrander, OH","45019-01",20572,"No. 57 Agg, 703.13 Freeze-Thaw","Limestone"]
["Shelly Materials - Portland, OH (49058-01)","49058-01",2008,"No. 8 Agg, 703.02 Concrete (Gravel)","Sand & Gravel",null,null,null,null,null,null,"Shelly Materials - Portland, OH","49058-01",2008,"No. 8 Agg, 703.02 Concrete","Sand & Gravel"]
["Shelly Materials - Portland, OH (49058-01)","49058-01","02SD2","Sand, 703.02 Concrete ","Sand & Gravel",null,null,null,null,null,null,"Shelly Materials - Portland, OH","49058-01","02SD2","Sand, 703.02 Concrete","Sand & Gravel"]
["Shelly Materials - Portland, OH (49058-01)","49058-01",2057,"No. 57 Agg, 703.02 Concrete (Gravel)","Sand & Gravel",null,null,null,null,null,null,"Shelly Materials - Portland, OH","49058-01",2057,"No. 57 Agg, 703.02 Concrete","Sand & Gravel"]
["Shelly Materials - Portland, OH (49058-01)","49058-01",20572,"No. 57 Agg, 703.13 Freeze-Thaw (Gravel)","Sand & Gravel",null,null,null,null,null,null,"Shelly Materials - Portland, OH","49058-01",20572,"No. 57 Agg, 703.13 Freeze-Thaw","Sand & Gravel"]
["Shelly Materials - Portland, OH (49058-01)","49058-01",20570,"No. 57 Agg, 703.02 Super-Structure (Gravel)","Sand & Gravel",null,null,null,null,null,null,"Shelly Materials - Portland, OH","49058-01",20570,"No. 57 Agg, 703.02 Super-Structure","Sand & Gravel"]
["Shelly Materials - Portland, OH (49058-01)","49058-01",20080,"No. 8 Agg, 703.02 Super-Structure (Gravel)","Sand & Gravel",null,null,null,null,null,null,"Shelly Materials - Portland, OH","49058-01",20080,"No. 8 Agg, 703.02 Super-Structure","Sand & Gravel"]
["Shelly Materials - Reedsville, OH (49045-01)","49045-01",2008,"No. 8 Agg, 703.02 Concrete (Gravel)","Sand & Gravel",null,null,null,null,null,null,"Shelly Materials - Reedsville, OH","49045-01",2008,"No. 8 Agg, 703.02 Concrete","Sand & Gravel"]
["Shelly Materials - Reedsville, OH (49045-01)","49045-01",20080,"No. 8 Agg, 703.02 Super-Structure (Gravel)","Sand & Gravel",null,null,null,null,null,null,"Shelly Materials - Reedsville, OH","49045-01",20080,"No. 8 Agg, 703.02 Super-Structure","Sand & Gravel"]
["Shelly Materials - Reedsville, OH (49045-01)","49045-01",20081,"No. 8 Agg, 703.02 Concrete Overlay (Gravel)","Sand & Gravel",null,null,null,null,null,null,"Shelly Materials - Reedsville, OH","49045-01",20081,"No. 8 Agg, 703.02 Concrete Overlay","Sand & Gravel"]
["Shelly Materials - Reedsville, OH (49045-01)","49045-01","02SD2","Sand, 703.02 Concrete ","Sand & Gravel",null,null,null,null,null,null,"Shelly Materials - Reedsville, OH","49045-01","02SD2","Sand, 703.02 Concrete","Sand & Gravel"]
["Shelly Materials - Reedsville, OH (49045-01)","49045-01",20570,"No. 57 Agg, 703.02 Super-Structure (Gravel)","Sand & Gravel",null,null,null,null,null,null,"Shelly Materials - Reedsville, OH","49045-01",20570,"No. 57 Agg, 703.02 Super-Structure","Sand & Gravel"]
["Shelly Materials - Reedsville, OH (49045-01)","49045-01",2057,"No. 57 Agg, 703.02 Concrete (Gravel)","Sand & Gravel",null,null,null,null,null,null,"Shelly Materials - Reedsville, OH","49045-01",2057,"No. 57 Agg, 703.02 Concrete","Sand & Gravel"]
["Shelly Materials - Reedsville, OH (49045-01)","49045-01",20572,"No. 57 Agg, 703.13 Freeze-Thaw (Gravel)","Sand & Gravel",null,null,null,null,null,null,"Shelly Materials - Reedsville, OH","49045-01",20572,"No. 57 Agg, 703.13 Freeze-Thaw","Sand & Gravel"]
["Shelly Materials - St. Louisville, OH (44007-01)","44007-01","02SD2","Sand, 703.02 Concrete ","Sand & Gravel",null,null,null,null,null,null,"Shelly Materials - St. Louisville, OH","44007-01","02SD2","Sand, 703.02 Concrete","Sand & Gravel"]
["Shelly Materials - St. Louisville, OH (44007-01)","44007-01","02SD23","Sand, 703.02 Concrete, Acid Insoluble ","Sand & Gravel",null,null,null,null,null,null,"Shelly Materials - St. Louisville, OH","44007-01","02SD23","Sand, 703.02 Concrete, Acid Insoluble","Sand & Gravel"]
["Shelly Materials - Streetsboro, OH (43016-01)","43016-01","02SD2","Sand, 703.02 Concrete ","Sand & Gravel",null,null,null,null,null,null,"Shelly Materials - Streetsboro, OH","43016-01","02SD2","Sand, 703.02 Concrete","Sand & Gravel"]
["Shelly Materials - Streetsboro, OH (43016-01)","43016-01","02SD23","Sand, 703.02 Concrete, Acid Insoluble ","Sand & Gravel",null,null,null,null,null,null,"Shelly Materials - Streetsboro, OH","43016-01","02SD23","Sand, 703.02 Concrete, Acid Insoluble","Sand & Gravel"]
["Shelly Materials - Streetsboro, OH (43016-01)","43016-01","02008M","No. 8 Agg, 703.02 Concrete, Mod Grading (Gravel)","Sand & Gravel",null,null,null,null,null,null,"Shelly Materials - Streetsboro, OH","43016-01","02008M","No. 8 Agg, 703.02 Concrete, Mod Grading","Sand & Gravel"]
["Shelly Materials - West Mansfield, OH (45013-01)","45013-01",20080,"No. 8 Agg, 703.02 Super-Structure (Limestone)","Limestone",null,null,null,null,null,null,"Shelly Materials - West Mansfield, OH","45013-01",20080,"No. 8 Agg, 703.02 Super-Structure","Limestone"]
["Shelly Materials - West Mansfield, OH (45013-01)","45013-01",20081,"No. 8 Agg, 703.02 Concrete Overlay (Limestone)","Limestone",null,null,null,null,null,null,"Shelly Materials - West Mansfield, OH","45013-01",20081,"No. 8 Agg, 703.02 Concrete Overlay","Limestone"]
["Shelly Materials - West Mansfield, OH (45013-01)","45013-01",2008,"No. 8 Agg, 703.02 Concrete (Limestone)","Limestone",null,null,null,null,null,null,"Shelly Materials - West Mansfield, OH","45013-01",2008,"No. 8 Agg, 703.02 Concrete","Limestone"]
["Shelly Materials - West Mansfield, OH (45013-01)","45013-01",20570,"No. 57 Agg, 703.02 Super-Structure (Limestone)","Limestone",null,null,null,null,null,null,"Shelly Materials - West Mansfield, OH","45013-01",20570,"No. 57 Agg, 703.02 Super-Structure","Limestone"]
["Shelly Materials - West Mansfield, OH (45013-01)","45013-01",20572,"No. 57 Agg, 703.13 Freeze-Thaw (Limestone)","Limestone",null,null,null,null,null,null,"Shelly Materials - West Mansfield, OH","45013-01",20572,"No. 57 Agg, 703.13 Freeze-Thaw","Limestone"]
["Shelly Materials - West Mansfield, OH (45013-01)","45013-01",2057,"No. 57 Agg, 703.02 Concrete (Limestone)","Limestone",null,null,null,null,null,null,"Shelly Materials - West Mansfield, OH","45013-01",2057,"No. 57 Agg, 703.02 Concrete","Limestone"]
["Shelly Materials- Grove City, OH (45002-01)","45002-01",20081,"No. 8 Agg, 703.02 Concrete Overlay (Limestone)","Limestone",null,null,null,null,null,null,"Shelly Materials- Grove City, OH","45002-01",20081,"No. 8 Agg, 703.02 Concrete Overlay","Limestone"]
["Shelly Materials- Grove City, OH (45002-01)","45002-01",2008,"No. 8 Agg, 703.02 Concrete (Limestone)","Limestone",null,null,null,null,null,null,"Shelly Materials- Grove City, OH","45002-01",2008,"No. 8 Agg, 703.02 Concrete","Limestone"]
["Shelly Materials- Grove City, OH (45002-01)","45002-01",20080,"No. 8 Agg, 703.02 Super-Structure (Limestone)","Limestone",null,null,null,null,null,null,"Shelly Materials- Grove City, OH","45002-01",20080,"No. 8 Agg, 703.02 Super-Structure","Limestone"]
["Shelly Materials- Grove City, OH (45002-01)","45002-01",2057,"No. 57 Agg, 703.02 Concrete (Limestone)","Limestone",null,null,null,null,null,null,"Shelly Materials- Grove City, OH","45002-01",2057,"No. 57 Agg, 703.02 Concrete","Limestone"]
["Shelly Materials- Grove City, OH (45002-01)","45002-01",20570,"No. 57 Agg, 703.02 Super-Structure (Limestone)","Limestone",null,null,null,null,null,null,"Shelly Materials- Grove City, OH","45002-01",20570,"No. 57 Agg, 703.02 Super-Structure","Limestone"]
["Sidwell Materials - New Philadelphia, OH (50029-01)","50029-01",2008,"No. 8 Agg, 703.02 Concrete (Gravel)","Sand & Gravel",null,null,null,null,null,null,"Sidwell Materials - New Philadelphia, OH","50029-01",2008,"No. 8 Agg, 703.02 Concrete","Sand & Gravel"]
["Sidwell Materials - New Philadelphia, OH (50029-01)","50029-01",20080,"No. 8 Agg, 703.02 Super-Structure (Gravel)","Sand & Gravel",null,null,null,null,null,null,"Sidwell Materials - New Philadelphia, OH","50029-01",20080,"No. 8 Agg, 703.02 Super-Structure","Sand & Gravel"]
["Sidwell Materials - New Philadelphia, OH (50029-01)","50029-01","02SD2","Sand, 703.02 Concrete ","Sand & Gravel",null,null,null,null,null,null,"Sidwell Materials - New Philadelphia, OH","50029-01","02SD2","Sand, 703.02 Concrete","Sand & Gravel"]
["Sidwell Materials - New Philadelphia, OH (50029-01)","50029-01","02SD23","Sand, 703.02 Concrete, Acid Insoluble ","Sand & Gravel",null,null,null,null,null,null,"Sidwell Materials - New Philadelphia, OH","50029-01","02SD23","Sand, 703.02 Concrete, Acid Insoluble","Sand & Gravel"]
["Sidwell Materials - New Philadelphia, OH (50029-01)","50029-01",20570,"No. 57 Agg, 703.02 Super-Structure (Gravel)","Sand & Gravel",null,null,null,null,null,null,"Sidwell Materials - New Philadelphia, OH","50029-01",20570,"No. 57 Agg, 703.02 Super-Structure","Sand & Gravel"]
["Sidwell Materials - New Philadelphia, OH (50029-01)","50029-01",2057,"No. 57 Agg, 703.02 Concrete (Gravel)","Sand & Gravel",null,null,null,null,null,null,"Sidwell Materials - New Philadelphia, OH","50029-01",2057,"No. 57 Agg, 703.02 Concrete","Sand & Gravel"]
["Sidwell Materials - New Philadelphia, OH (50029-01)","50029-01",20572,"No. 57 Agg, 703.13 Freeze-Thaw (Gravel)","Sand & Gravel",null,null,null,null,null,null,"Sidwell Materials - New Philadelphia, OH","50029-01",20572,"No. 57 Agg, 703.13 Freeze-Thaw","Sand & Gravel"]
["Simak Trucking & Excavating - North Kingsville, OH (43080-01)","43080-01","02SD2","Sand, 703.02 Concrete ","Sand & Gravel",null,null,null,null,null,null,"Simak Trucking & Excavating - North Kingsville, OH","43080-01","02SD2","Sand, 703.02 Concrete","Sand & Gravel"]
["Smalls S & G - Gambier, OH (44019-01)","44019-01","02SD2","Sand, 703.02 Concrete ","Sand & Gravel",null,null,null,null,null,null,"Smalls S & G - Gambier, OH","44019-01","02SD2","Sand, 703.02 Concrete","Sand & Gravel"]
["Smalls S & G - Gambier, OH (44019-01)","44019-01","02SD23","Sand, 703.02 Concrete, Acid Insoluble ","Sand & Gravel",null,null,null,null,null,null,"Smalls S & G - Gambier, OH","44019-01","02SD23","Sand, 703.02 Concrete, Acid Insoluble","Sand & Gravel"]
["Smalls S & G - Gambier, OH (44019-01)","44019-01",2057,"No. 57 Agg, 703.02 Concrete (Gravel)","Sand & Gravel",null,null,null,null,null,null,"Smalls S & G - Gambier, OH","44019-01",2057,"No. 57 Agg, 703.02 Concrete","Sand & Gravel"]
["Smelter Bay Sand - Marysville, MI (41026-01)","41026-01","02SD2","Sand, 703.02 Concrete ","Indirect-Out-of-State / Sand & Gravel",null,null,null,null,null,null,"Smelter Bay Sand - Marysville, MI","41026-01","02SD2","Sand, 703.02 Concrete","Indirect-Out-of-State / Sand & Gravel"]
["Smelter Bay Sand - Marysville, MI (41026-01)","41026-01","02SD23","Sand, 703.02 Concrete, Acid Insoluble ","Indirect-Out-of-State / Sand & Gravel",null,null,null,null,null,null,"Smelter Bay Sand - Marysville, MI","41026-01","02SD23","Sand, 703.02 Concrete, Acid Insoluble","Indirect-Out-of-State / Sand & Gravel"]
["Soehnlen Brothers Sand & Gravel - Beach City, OH (50069-01)","50069-01","02SD2","Sand, 703.02 Concrete ","Sand & Gravel",null,null,null,null,null,null,"Soehnlen Brothers Sand & Gravel - Beach City, OH","50069-01","02SD2","Sand, 703.02 Concrete","Sand & Gravel"]
["Soehnlen Brothers Sand & Gravel - Beach City, OH (50069-01)","50069-01","02SD23","Sand, 703.02 Concrete, Acid Insoluble ","Sand & Gravel",null,null,null,null,null,null,"Soehnlen Brothers Sand & Gravel - Beach City, OH","50069-01","02SD23","Sand, 703.02 Concrete, Acid Insoluble","Sand & Gravel"]
["SRM Materials - Germantown, OH (46050-01)","46050-01",2057,"No. 57 Agg, 703.02 Concrete (Gravel)","Sand & Gravel",null,null,null,null,null,null,"SRM Materials - Germantown, OH","46050-01",2057,"No. 57 Agg, 703.02 Concrete","Sand & Gravel"]
["SRM Materials - Germantown, OH (46050-01)","46050-01","02SD2","Sand, 703.02 Concrete ","Sand & Gravel",null,null,null,null,null,null,"SRM Materials - Germantown, OH","46050-01","02SD2","Sand, 703.02 Concrete","Sand & Gravel"]
["SRM Materials - Germantown, OH (46050-01)","46050-01",20572,"No. 57 Agg, 703.13 Freeze-Thaw (Gravel)","Sand & Gravel",null,null,null,null,null,null,"SRM Materials - Germantown, OH","46050-01",20572,"No. 57 Agg, 703.13 Freeze-Thaw","Sand & Gravel"]
["Stafford Gravel - Butler, IN (41035-01)","41035-01","02SD2","Sand, 703.02 Concrete ","Sand & Gravel",null,null,null,null,null,null,"Stafford Gravel - Butler, IN","41035-01","02SD2","Sand, 703.02 Concrete","Sand & Gravel"]
["Stafford Gravel - Butler, IN (41035-01)","41035-01","02SD23","Sand, 703.02 Concrete, Acid Insoluble ","Sand & Gravel",null,null,null,null,null,null,"Stafford Gravel - Butler, IN","41035-01","02SD23","Sand, 703.02 Concrete, Acid Insoluble","Sand & Gravel"]
["Stocker Sand & Gravel - Gnadenhutten, OH (50038-01)","50038-01",2008,"No. 8 Agg, 703.02 Concrete (Gravel)","Sand & Gravel",null,null,null,null,null,null,"Stocker Sand & Gravel - Gnadenhutten, OH","50038-01",2008,"No. 8 Agg, 703.02 Concrete","Sand & Gravel"]
["Stocker Sand & Gravel - Gnadenhutten, OH (50038-01)","50038-01",20080,"No. 8 Agg, 703.02 Super-Structure (Gravel)","Sand & Gravel",null,null,null,null,null,null,"Stocker Sand & Gravel - Gnadenhutten, OH","50038-01",20080,"No. 8 Agg, 703.02 Super-Structure","Sand & Gravel"]
["Stocker Sand & Gravel - Gnadenhutten, OH (50038-01)","50038-01","02SD2","Sand, 703.02 Concrete ","Sand & Gravel",null,null,null,null,null,null,"Stocker Sand & Gravel - Gnadenhutten, OH","50038-01","02SD2","Sand, 703.02 Concrete","Sand & Gravel"]
["Stocker Sand & Gravel - Gnadenhutten, OH (50038-01)","50038-01","02SD23","Sand, 703.02 Concrete, Acid Insoluble ","Sand & Gravel",null,null,null,null,null,null,"Stocker Sand & Gravel - Gnadenhutten, OH","50038-01","02SD23","Sand, 703.02 Concrete, Acid Insoluble","Sand & Gravel"]
["Stocker Sand & Gravel - Gnadenhutten, OH (50038-01)","50038-01",20570,"No. 57 Agg, 703.02 Super-Structure (Gravel)","Sand & Gravel",null,null,null,null,null,null,"Stocker Sand & Gravel - Gnadenhutten, OH","50038-01",20570,"No. 57 Agg, 703.02 Super-Structure","Sand & Gravel"]
["Stocker Sand & Gravel - Gnadenhutten, OH (50038-01)","50038-01",2057,"No. 57 Agg, 703.02 Concrete (Gravel)","Sand & Gravel",null,null,null,null,null,null,"Stocker Sand & Gravel - Gnadenhutten, OH","50038-01",2057,"No. 57 Agg, 703.02 Concrete","Sand & Gravel"]
["Stocker Sand & Gravel - Gnadenhutten, OH (50038-01)","50038-01",20572,"No. 57 Agg, 703.13 Freeze-Thaw (Gravel)","Sand & Gravel",null,null,null,null,null,null,"Stocker Sand & Gravel - Gnadenhutten, OH","50038-01",20572,"No. 57 Agg, 703.13 Freeze-Thaw","Sand & Gravel"]
["Stocker Sand & Gravel - Gnadenhutten, OH (50075-01)","50075-01",2008,"No. 8 Agg, 703.02 Concrete (Gravel)","Sand & Gravel",null,null,null,null,null,null,"Stocker Sand & Gravel - Gnadenhutten, OH","50075-01",2008,"No. 8 Agg, 703.02 Concrete","Sand & Gravel"]
["Stocker Sand & Gravel - Gnadenhutten, OH (50075-01)","50075-01","02SD2","Sand, 703.02 Concrete ","Sand & Gravel",null,null,null,null,null,null,"Stocker Sand & Gravel - Gnadenhutten, OH","50075-01","02SD2","Sand, 703.02 Concrete","Sand & Gravel"]
["Stocker Sand & Gravel - Gnadenhutten, OH (50075-01)","50075-01","02SD23","Sand, 703.02 Concrete, Acid Insoluble ","Sand & Gravel",null,null,null,null,null,null,"Stocker Sand & Gravel - Gnadenhutten, OH","50075-01","02SD23","Sand, 703.02 Concrete, Acid Insoluble","Sand & Gravel"]
["Stocker Sand & Gravel - Gnadenhutten, OH (50075-01)","50075-01",2057,"No. 57 Agg, 703.02 Concrete (Gravel)","Sand & Gravel",null,null,null,null,null,null,"Stocker Sand & Gravel - Gnadenhutten, OH","50075-01",2057,"No. 57 Agg, 703.02 Concrete","Sand & Gravel"]
["Stocker Sand & Gravel - Gnadenhutten, OH (50075-01)","50075-01","02009M","No. 9 Agg, 703.02 Concrete, Mod Grading (Gravel)","Sand & Gravel",null,null,null,null,null,null,"Stocker Sand & Gravel - Gnadenhutten, OH","50075-01","02009M","No. 9 Agg, 703.02 Concrete, Mod Grading","Sand & Gravel"]
["Stone Street Quarries - Hoagland, IN (40036-01)","40036-01","02SD2M","Sand, 703.02 Concrete, Mod Grading ","Dolostone",null,null,null,null,null,null,"Stone Street Quarries - Hoagland, IN","40036-01","02SD2M","Sand, 703.02 Concrete, Mod Grading","Dolostone"]
[{"$f":"L703&\" (\"&M703&\")\"","v":"Stoneco - Canton, OH (43007-01)"},{"$f":"M703","v":"43007-01"},{"$f":"N703","v":"02SD2"},"Sand, 703.02 Concrete ","Sand & Gravel",null,null,null,null,null,null,"Stoneco - Canton, OH","43007-01","02SD2","Sand, 703.02 Concrete","Sand & Gravel"]
["Stoneco - Canton, OH (43007-01)","43007-01","02SD23",{"$f":"IF(ISNUMBER(SEARCH(\"MicroSilica\",O704)),REPLACE(O704,19,11,\", SS847/848\"),O704)&\" \"&IF(ISNUMBER(SEARCH(\"Sand\",O704)),\"\",IF(ISNUMBER(SEARCH(\"Limestone\",P704)),\"(Limestone)\",IF(ISNUMBER(SEARCH(\"Dolostone\",P704)),\"(Dolostone)\",IF(ISNUMBER(SEARCH(\"Gravel (Crushed)\",P704)),\"(Gravel (Crushed))\",IF(ISNUMBER(SEARCH(\"Gravel (100% Crushed)\",P704)),\"(Gravel (100% Crushed))\",IF(ISNUMBER(SEARCH(\"Slag\",P704)),\"(Slag (ACBF))\",IF(ISNUMBER(SEARCH(\"Gravel (Blended W/ Olen-Columbus Limestone)\",P704)),\"(Gravel (Blended W/ Limestone))\",IF(ISNUMBER(SEARCH(\"Gravel (Benefited: 40% Crushed)\",P704)),\"(Gravel (40% Crushed))\",IF(ISNUMBER(SEARCH(\"Sand & Gravel\",P704)),\"(Gravel)\",IF(ISNUMBER(SEARCH(\"Trap Rock\",P704)),\"(Trap Rock)\"))))))))))","v":"Sand, 703.02 Concrete, Acid Insoluble "},{"$f":"P704","v":"Sand & Gravel"},null,null,null,null,null,null,"Stoneco - Canton, OH","43007-01","02SD23","Sand, 703.02 Concrete, Acid Insoluble","Sand & Gravel"]
["Stoneco - Canton, OH (43007-01)","43007-01",2008,"No. 8 Agg, 703.02 Concrete (Gravel)","Sand & Gravel",null,null,null,null,null,null,"Stoneco - Canton, OH","43007-01",2008,"No. 8 Agg, 703.02 Concrete","Sand & Gravel"]
["Stoneco - Carey, OH (40017-01)","40017-01",2008,"No. 8 Agg, 703.02 Concrete (Limestone)","Limestone",null,null,null,null,null,null,"Stoneco - Carey, OH","40017-01",2008,"No. 8 Agg, 703.02 Concrete","Limestone"]
["Stoneco - Carey, OH (40017-01)","40017-01",20081,"No. 8 Agg, 703.02 Concrete Overlay (Limestone)","Limestone",null,null,null,null,null,null,"Stoneco - Carey, OH","40017-01",20081,"No. 8 Agg, 703.02 Concrete Overlay","Limestone"]
["Stoneco - Carey, OH (40017-01)","40017-01",20080,"No. 8 Agg, 703.02 Super-Structure (Limestone)","Limestone",null,null,null,null,null,null,"Stoneco - Carey, OH","40017-01",20080,"No. 8 Agg, 703.02 Super-Structure","Limestone"]
["Stoneco - Carey, OH (40017-01)","40017-01",2057,"No. 57 Agg, 703.02 Concrete (Limestone)","Limestone",null,null,null,null,null,null,"Stoneco - Carey, OH","40017-01",2057,"No. 57 Agg, 703.02 Concrete","Limestone"]
["Stoneco - Carey, OH (40017-01)","40017-01",20570,"No. 57 Agg, 703.02 Super-Structure (Limestone)","Limestone",null,null,null,null,null,null,"Stoneco - Carey, OH","40017-01",20570,"No. 57 Agg, 703.02 Super-Structure","Limestone"]
["Stoneco - Carey, OH (40017-01)","40017-01",20572,"No. 57 Agg, 703.13 Freeze-Thaw (Limestone)","Limestone",null,null,null,null,null,null,"Stoneco - Carey, OH","40017-01",20572,"No. 57 Agg, 703.13 Freeze-Thaw","Limestone"]
["Stoneco - Celina, OH (46022B-01)","46022B-01",20572,"No. 57 Agg, 703.13 Freeze-Thaw (Limestone)","Limestone",null,null,null,null,null,null,"Stoneco - Celina, OH","46022B-01",20572,"No. 57 Agg, 703.13 Freeze-Thaw","Limestone"]
["Stoneco - Celina, OH (46022B-01)","46022B-01",2008,"No. 8 Agg, 703.02 Concrete (Limestone)","Limestone",null,null,null,null,null,null,"Stoneco - Celina, OH","46022B-01",2008,"No. 8 Agg, 703.02 Concrete","Limestone"]
["Stoneco - Celina, OH (46022B-01)","46022B-01",2057,"No. 57 Agg, 703.02 Concrete (Limestone)","Limestone",null,null,null,null,null,null,"Stoneco - Celina, OH","46022B-01",2057,"No. 57 Agg, 703.02 Concrete","Limestone"]
["Stoneco - Clay Center, OH (41016-01)","41016-01",20081,"No. 8 Agg, 703.02 Concrete Overlay (Dolostone)","Dolostone",null,null,null,null,null,null,"Stoneco - Clay Center, OH","41016-01",20081,"No. 8 Agg, 703.02 Concrete Overlay","Dolostone"]
["Stoneco - Clay Center, OH (41016-01)","41016-01",2008,"No. 8 Agg, 703.02 Concrete (Dolostone)","Dolostone",null,null,null,null,null,null,"Stoneco - Clay Center, OH","41016-01",2008,"No. 8 Agg, 703.02 Concrete","Dolostone"]
["Stoneco - Clay Center, OH (41016-01)","41016-01",20080,"No. 8 Agg, 703.02 Super-Structure (Dolostone)","Dolostone",null,null,null,null,null,null,"Stoneco - Clay Center, OH","41016-01",20080,"No. 8 Agg, 703.02 Super-Structure","Dolostone"]
["Stoneco - Clay Center, OH (41016-01)","41016-01",2057,"No. 57 Agg, 703.02 Concrete (Dolostone)","Dolostone",null,null,null,null,null,null,"Stoneco - Clay Center, OH","41016-01",2057,"No. 57 Agg, 703.02 Concrete","Dolostone"]
["Stoneco - Clay Center, OH (41016-01)","41016-01",20570,"No. 57 Agg, 703.02 Super-Structure (Dolostone)","Dolostone",null,null,null,null,null,null,"Stoneco - Clay Center, OH","41016-01",20570,"No. 57 Agg, 703.02 Super-Structure","Dolostone"]
["Stoneco - Clay Center, OH (41016-01)","41016-01",20572,"No. 57 Agg, 703.13 Freeze-Thaw (Dolostone)","Dolostone",null,null,null,null,null,null,"Stoneco - Clay Center, OH","41016-01",20572,"No. 57 Agg, 703.13 Freeze-Thaw","Dolostone"]
["Stoneco - Clay Center, OH (41016-01)","41016-01",2357,"No. 357 Agg, 703.02 Concrete (Dolostone)","Dolostone",null,null,null,null,null,null,"Stoneco - Clay Center, OH","41016-01",2357,"No. 357 Agg, 703.02 Concrete","Dolostone"]
["Stoneco - Convoy, OH (40013-01)","40013-01",2008,"No. 8 Agg, 703.02 Concrete (Limestone)","Limestone",null,null,null,null,null,null,"Stoneco - Convoy, OH","40013-01",2008,"No. 8 Agg, 703.02 Concrete","Limestone"]
["Stoneco - Convoy, OH (40013-01)","40013-01",20081,"No. 8 Agg, 703.02 Concrete Overlay (Limestone)","Limestone",null,null,null,null,null,null,"Stoneco - Convoy, OH","40013-01",20081,"No. 8 Agg, 703.02 Concrete Overlay","Limestone"]
["Stoneco - Convoy, OH (40013-01)","40013-01",20080,"No. 8 Agg, 703.02 Super-Structure (Limestone)","Limestone",null,null,null,null,null,null,"Stoneco - Convoy, OH","40013-01",20080,"No. 8 Agg, 703.02 Super-Structure","Limestone"]
["Stoneco - Convoy, OH (40013-01)","40013-01",2057,"No. 57 Agg, 703.02 Concrete (Limestone)","Limestone",null,null,null,null,null,null,"Stoneco - Convoy, OH","40013-01",2057,"No. 57 Agg, 703.02 Concrete","Limestone"]
["Stoneco - Convoy, OH (40013-01)","40013-01",20570,"No. 57 Agg, 703.02 Super-Structure (Limestone)","Limestone",null,null,null,null,null,null,"Stoneco - Convoy, OH","40013-01",20570,"No. 57 Agg, 703.02 Super-Structure","Limestone"]
["Stoneco - Convoy, OH (40013-01)","40013-01",20572,"No. 57 Agg, 703.13 Freeze-Thaw (Limestone)","Limestone",null,null,null,null,null,null,"Stoneco - Convoy, OH","40013-01",20572,"No. 57 Agg, 703.13 Freeze-Thaw","Limestone"]
["Stoneco - Maumee, OH (41023-01)","41023-01",2057,"No. 57 Agg, 703.02 Concrete (Dolostone)","Dolostone",null,null,null,null,null,null,"Stoneco - Maumee, OH","41023-01",2057,"No. 57 Agg, 703.02 Concrete","Dolostone"]
["Stoneco - Maumee, OH (41023-01)","41023-01",20570,"No. 57 Agg, 703.02 Super-Structure (Dolostone)","Dolostone",null,null,null,null,null,null,"Stoneco - Maumee, OH","41023-01",20570,"No. 57 Agg, 703.02 Super-Structure","Dolostone"]
["Stoneco - Maumee, OH (41023B-01)","41023B-01",20570,"No. 57 Agg, 703.02 Super-Structure (Dolostone)","Dolostone: Upper Bench",null,null,null,null,null,null,"Stoneco - Maumee, OH","41023B-01",20570,"No. 57 Agg, 703.02 Super-Structure","Dolostone: Upper Bench"]
["Stoneco - Maumee, OH (41023B-01)","41023B-01",2057,"No. 57 Agg, 703.02 Concrete (Dolostone)","Dolostone: Upper Bench",null,null,null,null,null,null,"Stoneco - Maumee, OH","41023B-01",2057,"No. 57 Agg, 703.02 Concrete","Dolostone: Upper Bench"]
["Stoneco - Maumee, OH (41023B-01)","41023B-01",20572,"No. 57 Agg, 703.13 Freeze-Thaw (Dolostone)","Dolostone: Upper Bench",null,null,null,null,null,null,"Stoneco - Maumee, OH","41023B-01",20572,"No. 57 Agg, 703.13 Freeze-Thaw","Dolostone: Upper Bench"]
["Stoneco - Oakwood, OH (40012-01)","40012-01",2008,"No. 8 Agg, 703.02 Concrete (Limestone)","Limestone",null,null,null,null,null,null,"Stoneco - Oakwood, OH","40012-01",2008,"No. 8 Agg, 703.02 Concrete","Limestone"]
["Stoneco - Oakwood, OH (40012-01)","40012-01",20081,"No. 8 Agg, 703.02 Concrete Overlay (Limestone)","Limestone",null,null,null,null,null,null,"Stoneco - Oakwood, OH","40012-01",20081,"No. 8 Agg, 703.02 Concrete Overlay","Limestone"]
["Stoneco - Oakwood, OH (40012-01)","40012-01",20080,"No. 8 Agg, 703.02 Super-Structure (Limestone)","Limestone",null,null,null,null,null,null,"Stoneco - Oakwood, OH","40012-01",20080,"No. 8 Agg, 703.02 Super-Structure","Limestone"]
["Stoneco - Oakwood, OH (40012-01)","40012-01",20572,"No. 57 Agg, 703.13 Freeze-Thaw (Limestone)","Limestone",null,null,null,null,null,null,"Stoneco - Oakwood, OH","40012-01",20572,"No. 57 Agg, 703.13 Freeze-Thaw","Limestone"]
["Stoneco - Oakwood, OH (40012-01)","40012-01",2057,"No. 57 Agg, 703.02 Concrete (Limestone)","Limestone",null,null,null,null,null,null,"Stoneco - Oakwood, OH","40012-01",2057,"No. 57 Agg, 703.02 Concrete","Limestone"]
["Stoneco - Oakwood, OH (40012-01)","40012-01",20570,"No. 57 Agg, 703.02 Super-Structure (Limestone)","Limestone",null,null,null,null,null,null,"Stoneco - Oakwood, OH","40012-01",20570,"No. 57 Agg, 703.02 Super-Structure","Limestone"]
["Stoneco - Portage, OH (41003-01)","41003-01",2008,"No. 8 Agg, 703.02 Concrete (Limestone)","Limestone",null,null,null,null,null,null,"Stoneco - Portage, OH","41003-01",2008,"No. 8 Agg, 703.02 Concrete","Limestone"]
["Stoneco - Portage, OH (41003-01)","41003-01",20081,"No. 8 Agg, 703.02 Concrete Overlay (Limestone)","Limestone",null,null,null,null,null,null,"Stoneco - Portage, OH","41003-01",20081,"No. 8 Agg, 703.02 Concrete Overlay","Limestone"]
["Stoneco - Portage, OH (41003-01)","41003-01",20080,"No. 8 Agg, 703.02 Super-Structure (Limestone)","Limestone",null,null,null,null,null,null,"Stoneco - Portage, OH","41003-01",20080,"No. 8 Agg, 703.02 Super-Structure","Limestone"]
["Stoneco - Portage, OH (41003-01)","41003-01",20572,"No. 57 Agg, 703.13 Freeze-Thaw (Limestone)","Limestone",null,null,null,null,null,null,"Stoneco - Portage, OH","41003-01",20572,"No. 57 Agg, 703.13 Freeze-Thaw","Limestone"]
["Stoneco - Portage, OH (41003-01)","41003-01",2057,"No. 57 Agg, 703.02 Concrete (Limestone)","Limestone",null,null,null,null,null,null,"Stoneco - Portage, OH","41003-01",2057,"No. 57 Agg, 703.02 Concrete","Limestone"]
["Stoneco - Portage, OH (41003-01)","41003-01",20570,"No. 57 Agg, 703.02 Super-Structure (Limestone)","Limestone",null,null,null,null,null,null,"Stoneco - Portage, OH","41003-01",20570,"No. 57 Agg, 703.02 Super-Structure","Limestone"]
["Stoneco / Allied Corp - Petersburg, OH (43072-01)","43072-01",2008,"No. 8 Agg, 703.02 Concrete (Limestone)","Limestone",null,null,null,null,null,null,"Stoneco / Allied Corp - Petersburg, OH","43072-01",2008,"No. 8 Agg, 703.02 Concrete","Limestone"]
["Stoneco / Allied Corp - Petersburg, OH (43072-01)","43072-01",2057,"No. 57 Agg, 703.02 Concrete (Limestone)","Limestone",null,null,null,null,null,null,"Stoneco / Allied Corp - Petersburg, OH","43072-01",2057,"No. 57 Agg, 703.02 Concrete","Limestone"]
["Stoneco / Allied Corp - Petersburg, OH (43072-01)","43072-01",20570,"No. 57 Agg, 703.02 Super-Structure (Limestone)","Limestone",null,null,null,null,null,null,"Stoneco / Allied Corp - Petersburg, OH","43072-01",20570,"No. 57 Agg, 703.02 Super-Structure","Limestone"]
["Stoneco / Allied Corp - Petersburg, OH (43072-01)","43072-01",20572,"No. 57 Agg, 703.13 Freeze-Thaw (Limestone)","Limestone",null,null,null,null,null,null,"Stoneco / Allied Corp - Petersburg, OH","43072-01",20572,"No. 57 Agg, 703.13 Freeze-Thaw","Limestone"]
["Stoneco of Michigan - Ann Arbor (41060-01)","41060-01","02SD2","Sand, 703.02 Concrete ","Sand & Gravel",null,null,null,null,null,null,"Stoneco of Michigan - Ann Arbor","41060-01","02SD2","Sand, 703.02 Concrete","Sand & Gravel"]
["Stoneco of Michigan - Horton, MI (41031-01)","41031-01","02SD2","Sand, 703.02 Concrete ","Sand & Gravel",null,null,null,null,null,null,"Stoneco of Michigan - Horton, MI","41031-01","02SD2","Sand, 703.02 Concrete","Sand & Gravel"]
["Stoneco of Michigan - Ottawa Lake, MI (41032-01)","41032-01",2057,"No. 57 Agg, 703.02 Concrete (Limestone)","Limestone",null,null,null,null,null,null,"Stoneco of Michigan - Ottawa Lake, MI","41032-01",2057,"No. 57 Agg, 703.02 Concrete","Limestone"]
["Stoneco of Michigan - Ottawa Lake, MI (41032-01)","41032-01",20570,"No. 57 Agg, 703.02 Super-Structure (Limestone)","Limestone",null,null,null,null,null,null,"Stoneco of Michigan - Ottawa Lake, MI","41032-01",20570,"No. 57 Agg, 703.02 Super-Structure","Limestone"]
["Stoneco of Michigan - Ottawa Lake, MI (41032-01)","41032-01",20080,"No. 8 Agg, 703.02 Super-Structure (Limestone)","Limestone",null,null,null,null,null,null,"Stoneco of Michigan - Ottawa Lake, MI","41032-01",20080,"No. 8 Agg, 703.02 Super-Structure","Limestone"]
["Stoneco of Michigan - Ottawa Lake, MI (41032-01)","41032-01",2008,"No. 8 Agg, 703.02 Concrete (Limestone)","Limestone",null,null,null,null,null,null,"Stoneco of Michigan - Ottawa Lake, MI","41032-01",2008,"No. 8 Agg, 703.02 Concrete","Limestone"]
["Stoneco of Michigan - Ottawa Lake, MI (41032-01)","41032-01",20572,"No. 57 Agg, 703.13 Freeze-Thaw (Limestone)","Limestone",null,null,null,null,null,null,"Stoneco of Michigan - Ottawa Lake, MI","41032-01",20572,"No. 57 Agg, 703.13 Freeze-Thaw","Limestone"]
["Subtropolis Mining - Petersburg, OH (43094-01)","43094-01",2067,"No. 67 Agg, 703.02 Concrete (Limestone)","Limestone",null,null,null,null,null,null,"Subtropolis Mining - Petersburg, OH","43094-01",2067,"No. 67 Agg, 703.02 Concrete","Limestone"]
["Subtropolis Mining - Petersburg, OH (43094-01)","43094-01",2008,"No. 8 Agg, 703.02 Concrete (Limestone)","Limestone",null,null,null,null,null,null,"Subtropolis Mining - Petersburg, OH","43094-01",2008,"No. 8 Agg, 703.02 Concrete","Limestone"]
["Subtropolis Mining - Petersburg, OH (43094-01)","43094-01",20572,"No. 57 Agg, 703.13 Freeze-Thaw (Limestone)","Limestone",null,null,null,null,null,null,"Subtropolis Mining - Petersburg, OH","43094-01",20572,"No. 57 Agg, 703.13 Freeze-Thaw","Limestone"]
["Subtropolis Mining - Petersburg, OH (43094-01)","43094-01",2057,"No. 57 Agg, 703.02 Concrete (Limestone)","Limestone",null,null,null,null,null,null,"Subtropolis Mining - Petersburg, OH","43094-01",2057,"No. 57 Agg, 703.02 Concrete","Limestone"]
["Three Rivers Aggregates - Slippery Rock, PA (43075-01)","43075-01","02SD2","Sand, 703.02 Concrete ","Sand & Gravel",null,null,null,null,null,null,"Three Rivers Aggregates - Slippery Rock, PA","43075-01","02SD2","Sand, 703.02 Concrete","Sand & Gravel"]
["Three Rivers Aggregates - Slippery Rock, PA (43095-01)","43095-01","02SD2","Sand, 703.02 Concrete ","Sand & Gravel",null,null,null,null,null,null,"Three Rivers Aggregates - Slippery Rock, PA","43095-01","02SD2","Sand, 703.02 Concrete","Sand & Gravel"]
["Three Rivers Aggregates - Wampum, PA (43088-01)","43088-01","02SD2","Sand, 703.02 Concrete ","Sand & Gravel",null,null,null,null,null,null,"Three Rivers Aggregates - Wampum, PA","43088-01","02SD2","Sand, 703.02 Concrete","Sand & Gravel"]
["Tiger S & G - Massillon, OH (43044-01)","43044-01","02SD2","Sand, 703.02 Concrete ","Sand & Gravel",null,null,null,null,null,null,"Tiger S & G - Massillon, OH","43044-01","02SD2","Sand, 703.02 Concrete","Sand & Gravel"]
["TMS International / Stein LLC - Cleveland, OH (51047-01)","51047-01",2057,"No. 57 Agg, 703.02 Concrete (Slag (ACBF))","Slag",null,null,null,null,null,null,"TMS International / Stein LLC - Cleveland, OH","51047-01",2057,"No. 57 Agg, 703.02 Concrete","Slag"]
["TMS International / Stein LLC - Cleveland, OH (51047-01)","51047-01",20570,"No. 57 Agg, 703.02 Super-Structure (Slag (ACBF))","Slag",null,null,null,null,null,null,"TMS International / Stein LLC - Cleveland, OH","51047-01",20570,"No. 57 Agg, 703.02 Super-Structure","Slag"]
["TMS International / Stein LLC - Cleveland, OH (51047-01)","51047-01",20572,"No. 57 Agg, 703.13 Freeze-Thaw (Slag (ACBF))","Slag",null,null,null,null,null,null,"TMS International / Stein LLC - Cleveland, OH","51047-01",20572,"No. 57 Agg, 703.13 Freeze-Thaw","Slag"]
[{"$f":"L767&\" (\"&M767&\")\"","v":"Tow Path Materials - Chillicothe, OH (48050-01)"},{"$f":"M767","v":"48050-01"},{"$f":"N767","v":"02SD2"},"Sand, 703.02 Concrete ","Sand & Gravel",null,null,null,null,null,null,"Tow Path Materials - Chillicothe, OH","48050-01","02SD2","Sand, 703.02 Concrete","Sand & Gravel"]
["Tow Path Materials - Lucasville, OH (48038-01)","48038-01","02SD2",{"$f":"IF(ISNUMBER(SEARCH(\"MicroSilica\",O768)),REPLACE(O768,19,11,\", SS847/848\"),O768)&\" \"&IF(ISNUMBER(SEARCH(\"Sand\",O768)),\"\",IF(ISNUMBER(SEARCH(\"Limestone\",P768)),\"(Limestone)\",IF(ISNUMBER(SEARCH(\"Dolostone\",P768)),\"(Dolostone)\",IF(ISNUMBER(SEARCH(\"Gravel (Crushed)\",P768)),\"(Gravel (Crushed))\",IF(ISNUMBER(SEARCH(\"Gravel (100% Crushed)\",P768)),\"(Gravel (100% Crushed))\",IF(ISNUMBER(SEARCH(\"Slag\",P768)),\"(Slag (ACBF))\",IF(ISNUMBER(SEARCH(\"Gravel (Blended W/ Olen-Columbus Limestone)\",P768)),\"(Gravel (Blended W/ Limestone))\",IF(ISNUMBER(SEARCH(\"Gravel (Benefited: 40% Crushed)\",P768)),\"(Gravel (40% Crushed))\",IF(ISNUMBER(SEARCH(\"Sand & Gravel\",P768)),\"(Gravel)\",IF(ISNUMBER(SEARCH(\"Trap Rock\",P768)),\"(Trap Rock)\"))))))))))","v":"Sand, 703.02 Concrete "},{"$f":"P768","v":"Sand & Gravel"},null,null,null,null,null,null,"Tow Path Materials - Lucasville, OH","48038-01","02SD2","Sand, 703.02 Concrete","Sand & Gravel"]
["Tow Path Materials - Lucasville, OH (48038-01)","48038-01","02SD23","Sand, 703.02 Concrete, Acid Insoluble ","Sand & Gravel",null,null,null,null,null,null,"Tow Path Materials - Lucasville, OH","48038-01","02SD23","Sand, 703.02 Concrete, Acid Insoluble","Sand & Gravel"]
["U.S. Aggregates - Decatur, IN (40005-01)","40005-01",2057,"No. 57 Agg, 703.02 Concrete (Limestone)","Limestone",null,null,null,null,null,null,"U.S. Aggregates - Decatur, IN","40005-01",2057,"No. 57 Agg, 703.02 Concrete","Limestone"]
["U.S. Aggregates - Decatur, IN (40005-01)","40005-01",2008,"No. 8 Agg, 703.02 Concrete (Limestone)","Limestone",null,null,null,null,null,null,"U.S. Aggregates - Decatur, IN","40005-01",2008,"No. 8 Agg, 703.02 Concrete","Limestone"]
["U.S. Aggregates - Decatur, IN (40005-01)","40005-01",20080,"No. 8 Agg, 703.02 Super-Structure (Limestone)","Limestone",null,null,null,null,null,null,"U.S. Aggregates - Decatur, IN","40005-01",20080,"No. 8 Agg, 703.02 Super-Structure","Limestone"]
["U.S. Aggregates - Portland, IN (40032-01)","40032-01",20570,"No. 57 Agg, 703.02 Super-Structure (Limestone)","Limestone",null,null,null,null,null,null,"U.S. Aggregates - Portland, IN","40032-01",20570,"No. 57 Agg, 703.02 Super-Structure","Limestone"]
["U.S. Aggregates - Portland, IN (40032-01)","40032-01",2057,"No. 57 Agg, 703.02 Concrete (Limestone)","Limestone",null,null,null,null,null,null,"U.S. Aggregates - Portland, IN","40032-01",2057,"No. 57 Agg, 703.02 Concrete","Limestone"]
["U.S. Aggregates - Richmond, IN (47009-01)","47009-01",2057,"No. 57 Agg, 703.02 Concrete (Gravel)","Sand & Gravel",null,null,null,null,null,null,"U.S. Aggregates - Richmond, IN","47009-01",2057,"No. 57 Agg, 703.02 Concrete","Sand & Gravel"]
["U.S. Aggregates - Richmond, IN (47009-01)","47009-01","02SD2","Sand, 703.02 Concrete ","Sand & Gravel",null,null,null,null,null,null,"U.S. Aggregates - Richmond, IN","47009-01","02SD2","Sand, 703.02 Concrete","Sand & Gravel"]
["U.S. Aggregates - Richmond, IN (47009-01)","47009-01",20572,"No. 57 Agg, 703.13 Freeze-Thaw (Gravel)","Sand & Gravel",null,null,null,null,null,null,"U.S. Aggregates - Richmond, IN","47009-01",20572,"No. 57 Agg, 703.13 Freeze-Thaw","Sand & Gravel"]
["United Agg - Danville, OH (44005-01)","44005-01","02SD2","Sand, 703.02 Concrete ","Sand & Gravel",null,null,null,null,null,null,"United Agg - Danville, OH","44005-01","02SD2","Sand, 703.02 Concrete","Sand & Gravel"]
["United Agg - Danville, OH (44005-01)","44005-01",2008,"No. 8 Agg, 703.02 Concrete (Gravel)","Sand & Gravel",null,null,null,null,null,null,"United Agg - Danville, OH","44005-01",2008,"No. 8 Agg, 703.02 Concrete","Sand & Gravel"]
["United Agg - Mt. Vernon, OH (44009-01)","44009-01","02SD2","Sand, 703.02 Concrete ","Sand & Gravel",null,null,null,null,null,null,"United Agg - Mt. Vernon, OH","44009-01","02SD2","Sand, 703.02 Concrete","Sand & Gravel"]
["United Agg - Mt. Vernon, OH (44009-01)","44009-01","02SD23","Sand, 703.02 Concrete, Acid Insoluble ","Sand & Gravel",null,null,null,null,null,null,"United Agg - Mt. Vernon, OH","44009-01","02SD23","Sand, 703.02 Concrete, Acid Insoluble","Sand & Gravel"]
["Urbana Materials - Urbana, OH (46028-01)","46028-01",2057,"No. 57 Agg, 703.02 Concrete (Gravel)","Sand & Gravel",null,null,null,null,null,null,"Urbana Materials - Urbana, OH","46028-01",2057,"No. 57 Agg, 703.02 Concrete","Sand & Gravel"]
["Urbana Materials - Urbana, OH (46028-01)","46028-01","02SD2","Sand, 703.02 Concrete ","Sand & Gravel",null,null,null,null,null,null,"Urbana Materials - Urbana, OH","46028-01","02SD2","Sand, 703.02 Concrete","Sand & Gravel"]
["Urbana Materials - Urbana, OH (46028-01)","46028-01","02SD23","Sand, 703.02 Concrete, Acid Insoluble ","Sand & Gravel",null,null,null,null,null,null,"Urbana Materials - Urbana, OH","46028-01","02SD23","Sand, 703.02 Concrete, Acid Insoluble","Sand & Gravel"]
["Urbana Materials - Urbana, OH (46028-01)","46028-01",2008,"No. 8 Agg, 703.02 Concrete (Gravel)","Sand & Gravel",null,null,null,null,null,null,"Urbana Materials - Urbana, OH","46028-01",2008,"No. 8 Agg, 703.02 Concrete","Sand & Gravel"]
["Urbana Materials - Urbana, OH (46028-01)","46028-01",20572,"No. 57 Agg, 703.13 Freeze-Thaw (Gravel)","Sand & Gravel",null,null,null,null,null,null,"Urbana Materials - Urbana, OH","46028-01",20572,"No. 57 Agg, 703.13 Freeze-Thaw","Sand & Gravel"]
["Urbana Materials - Urbana, OH (46028-01)","46028-01",20570,"No. 57 Agg, 703.02 Super-Structure (Gravel)","Sand & Gravel",null,null,null,null,null,null,"Urbana Materials - Urbana, OH","46028-01",20570,"No. 57 Agg, 703.02 Super-Structure","Sand & Gravel"]
["Watson Gravel - Cleves, OH (47087-01)","47087-01",2008,"No. 8 Agg, 703.02 Concrete (Gravel)","Sand & Gravel",null,null,null,null,null,null,"Watson Gravel - Cleves, OH","47087-01",2008,"No. 8 Agg, 703.02 Concrete","Sand & Gravel"]
["Watson Gravel - Cleves, OH (47087-01)","47087-01",20080,"No. 8 Agg, 703.02 Super-Structure (Gravel)","Sand & Gravel",null,null,null,null,null,null,"Watson Gravel - Cleves, OH","47087-01",20080,"No. 8 Agg, 703.02 Super-Structure","Sand & Gravel"]
["Watson Gravel - Cleves, OH (47087-01)","47087-01","02SD2","Sand, 703.02 Concrete ","Sand & Gravel",null,null,null,null,null,null,"Watson Gravel - Cleves, OH","47087-01","02SD2","Sand, 703.02 Concrete","Sand & Gravel"]
["Watson Gravel - Cleves, OH (47087-01)","47087-01",20570,"No. 57 Agg, 703.02 Super-Structure (Gravel)","Sand & Gravel",null,null,null,null,null,null,"Watson Gravel - Cleves, OH","47087-01",20570,"No. 57 Agg, 703.02 Super-Structure","Sand & Gravel"]
["Watson Gravel - Cleves, OH (47087-01)","47087-01",2057,"No. 57 Agg, 703.02 Concrete (Gravel)","Sand & Gravel",null,null,null,null,null,null,"Watson Gravel - Cleves, OH","47087-01",2057,"No. 57 Agg, 703.02 Concrete","Sand & Gravel"]
["Watson Gravel - Hamilton, OH (47029-01)","47029-01",2008,"No. 8 Agg, 703.02 Concrete (Gravel)","Sand & Gravel",null,null,null,null,null,null,"Watson Gravel - Hamilton, OH","47029-01",2008,"No. 8 Agg, 703.02 Concrete","Sand & Gravel"]
["Watson Gravel - Hamilton, OH (47029-01)","47029-01",20080,"No. 8 Agg, 703.02 Super-Structure (Gravel)","Sand & Gravel",null,null,null,null,null,null,"Watson Gravel - Hamilton, OH","47029-01",20080,"No. 8 Agg, 703.02 Super-Structure","Sand & Gravel"]
["Watson Gravel - Hamilton, OH (47029-01)","47029-01",2057,"No. 57 Agg, 703.02 Concrete (Gravel)","Sand & Gravel",null,null,null,null,null,null,"Watson Gravel - Hamilton, OH","47029-01",2057,"No. 57 Agg, 703.02 Concrete","Sand & Gravel"]
["Watson Gravel - Hamilton, OH (47029-01)","47029-01","02SD2","Sand, 703.02 Concrete ","Sand & Gravel",null,null,null,null,null,null,"Watson Gravel - Hamilton, OH","47029-01","02SD2","Sand, 703.02 Concrete","Sand & Gravel"]
["Watson Gravel - Hamilton, OH (47029-01)","47029-01",20570,"No. 57 Agg, 703.02 Super-Structure (Gravel)","Sand & Gravel",null,null,null,null,null,null,"Watson Gravel - Hamilton, OH","47029-01",20570,"No. 57 Agg, 703.02 Super-Structure","Sand & Gravel"]
["Watson Gravel - Harrison, OH (47079-01)","47079-01",2008,"No. 8 Agg, 703.02 Concrete (Gravel)","Sand & Gravel",null,null,null,null,null,null,"Watson Gravel - Harrison, OH","47079-01",2008,"No. 8 Agg, 703.02 Concrete","Sand & Gravel"]
["Watson Gravel - Harrison, OH (47079-01)","47079-01","02SD2","Sand, 703.02 Concrete ","Sand & Gravel",null,null,null,null,null,null,"Watson Gravel - Harrison, OH","47079-01","02SD2","Sand, 703.02 Concrete","Sand & Gravel"]
["Watson Gravel - Harrison, OH (47079-01)","47079-01","02SD23","Sand, 703.02 Concrete, Acid Insoluble ","Sand & Gravel",null,null,null,null,null,null,"Watson Gravel - Harrison, OH","47079-01","02SD23","Sand, 703.02 Concrete, Acid Insoluble","Sand & Gravel"]
["Watson Gravel - Harrison, OH (47079-01)","47079-01",20570,"No. 57 Agg, 703.02 Super-Structure (Gravel)","Sand & Gravel",null,null,null,null,null,null,"Watson Gravel - Harrison, OH","47079-01",20570,"No. 57 Agg, 703.02 Super-Structure","Sand & Gravel"]
["Watson Gravel - Harrison, OH (47079-01)","47079-01",2057,"No. 57 Agg, 703.02 Concrete (Gravel)","Sand & Gravel",null,null,null,null,null,null,"Watson Gravel - Harrison, OH","47079-01",2057,"No. 57 Agg, 703.02 Concrete","Sand & Gravel"]
["Watson Gravel - Middletown, OH (47044-01)","47044-01",2008,"No. 8 Agg, 703.02 Concrete (Gravel)","Sand & Gravel",null,null,null,null,null,null,"Watson Gravel - Middletown, OH","47044-01",2008,"No. 8 Agg, 703.02 Concrete","Sand & Gravel"]
["Watson Gravel - Middletown, OH (47044-01)","47044-01","02SD2","Sand, 703.02 Concrete ","Sand & Gravel",null,null,null,null,null,null,"Watson Gravel - Middletown, OH","47044-01","02SD2","Sand, 703.02 Concrete","Sand & Gravel"]
["Watson Gravel - Middletown, OH (47044-01)","47044-01",20570,"No. 57 Agg, 703.02 Super-Structure (Gravel)","Sand & Gravel",null,null,null,null,null,null,"Watson Gravel - Middletown, OH","47044-01",20570,"No. 57 Agg, 703.02 Super-Structure","Sand & Gravel"]
["Watson Gravel - Middletown, OH (47044-01)","47044-01",2057,"No. 57 Agg, 703.02 Concrete (Gravel)","Sand & Gravel",null,null,null,null,null,null,"Watson Gravel - Middletown, OH","47044-01",2057,"No. 57 Agg, 703.02 Concrete","Sand & Gravel"]
["Watson Gravel - Middletown, OH (47044-01)","47044-01",20572,"No. 57 Agg, 703.13 Freeze-Thaw (Gravel)","Sand & Gravel",null,null,null,null,null,null,"Watson Gravel - Middletown, OH","47044-01",20572,"No. 57 Agg, 703.13 Freeze-Thaw","Sand & Gravel"]
["Weber Materials - St. Mary's, OH (46032-01)","46032-01",20572,"No. 57 Agg, 703.13 Freeze-Thaw (Dolostone)","Dolostone",null,null,null,null,null,null,"Weber Materials - St. Mary's, OH","46032-01",20572,"No. 57 Agg, 703.13 Freeze-Thaw","Dolostone"]
["Weber Materials - St. Mary's, OH (46032-01)","46032-01",20570,"No. 57 Agg, 703.02 Super-Structure (Dolostone)","Dolostone",null,null,null,null,null,null,"Weber Materials - St. Mary's, OH","46032-01",20570,"No. 57 Agg, 703.02 Super-Structure","Dolostone"]
["Weber Materials - St. Mary's, OH (46032-01)","46032-01",2057,"No. 57 Agg, 703.02 Concrete (Dolostone)","Dolostone",null,null,null,null,null,null,"Weber Materials - St. Mary's, OH","46032-01",2057,"No. 57 Agg, 703.02 Concrete","Dolostone"]
["Weber Materials - St. Mary's, OH (46032-01)","46032-01",2008,"No. 8 Agg, 703.02 Concrete (Dolostone)","Dolostone",null,null,null,null,null,null,"Weber Materials - St. Mary's, OH","46032-01",2008,"No. 8 Agg, 703.02 Concrete","Dolostone"]
["Weber Materials - St. Mary's, OH (46032-01)","46032-01",20080,"No. 8 Agg, 703.02 Super-Structure (Dolostone)","Dolostone",null,null,null,null,null,null,"Weber Materials - St. Mary's, OH","46032-01",20080,"No. 8 Agg, 703.02 Super-Structure","Dolostone"]
["Weber Sand & Gravel - Edgerton, OH (41017-01)","41017-01","02SD2","Sand, 703.02 Concrete ","Sand & Gravel",null,null,null,null,null,null,"Weber Sand & Gravel - Edgerton, OH","41017-01","02SD2","Sand, 703.02 Concrete","Sand & Gravel"]
["Weber Sand & Gravel - Edgerton, OH (41017-01)","41017-01","02SD23","Sand, 703.02 Concrete, Acid Insoluble ","Sand & Gravel",null,null,null,null,null,null,"Weber Sand & Gravel - Edgerton, OH","41017-01","02SD23","Sand, 703.02 Concrete, Acid Insoluble","Sand & Gravel"]
["Welch Sand & Gravel - Harrison, OH (47033-01)","47033-01",2057,"No. 57 Agg, 703.02 Concrete (Gravel)","Sand & Gravel",null,null,null,null,null,null,"Welch Sand & Gravel - Harrison, OH","47033-01",2057,"No. 57 Agg, 703.02 Concrete","Sand & Gravel"]
["Welch Sand & Gravel - Harrison, OH (47033-01)","47033-01","02SD2","Sand, 703.02 Concrete ","Sand & Gravel",null,null,null,null,null,null,"Welch Sand & Gravel - Harrison, OH","47033-01","02SD2","Sand, 703.02 Concrete","Sand & Gravel"]
["Welch Sand & Gravel - Harrison, OH (47033-01)","47033-01",20570,"No. 57 Agg, 703.02 Super-Structure (Gravel)","Sand & Gravel",null,null,null,null,null,null,"Welch Sand & Gravel - Harrison, OH","47033-01",20570,"No. 57 Agg, 703.02 Super-Structure","Sand & Gravel"]
["Welch Sand & Gravel - Harrison, OH (47033-01)","47033-01",2008,"No. 8 Agg, 703.02 Concrete (Gravel)","Sand & Gravel",null,null,null,null,null,null,"Welch Sand & Gravel - Harrison, OH","47033-01",2008,"No. 8 Agg, 703.02 Concrete","Sand & Gravel"]
["Welch Sand & Gravel - Harrison, OH (47033-01)","47033-01",20080,"No. 8 Agg, 703.02 Super-Structure (Gravel)","Sand & Gravel",null,null,null,null,null,null,"Welch Sand & Gravel - Harrison, OH","47033-01",20080,"No. 8 Agg, 703.02 Super-Structure","Sand & Gravel"]
["Westfall Agg & Materials - Circleville, OH (45035-01)","45035-01","02SD2","Sand, 703.02 Concrete ","Sand & Gravel",null,null,null,null,null,null,"Westfall Agg & Materials - Circleville, OH","45035-01","02SD2","Sand, 703.02 Concrete","Sand & Gravel"]
["Westfall Agg & Materials - Circleville, OH (45035-01)","45035-01",2057,"No. 57 Agg, 703.02 Concrete (Gravel)","Sand & Gravel",null,null,null,null,null,null,"Westfall Agg & Materials - Circleville, OH","45035-01",2057,"No. 57 Agg, 703.02 Concrete","Sand & Gravel"]
["William Albert - Coshocton, OH (44032-01)","44032-01",2008,"No. 8 Agg, 703.02 Concrete (Gravel)","Sand & Gravel",null,null,null,null,null,null,"William Albert - Coshocton, OH","44032-01",2008,"No. 8 Agg, 703.02 Concrete","Sand & Gravel"]
["William Albert - Coshocton, OH (44032-01)","44032-01",2057,"No. 57 Agg, 703.02 Concrete (Gravel)","Sand & Gravel",null,null,null,null,null,null,"William Albert - Coshocton, OH","44032-01",2057,"No. 57 Agg, 703.02 Concrete","Sand & Gravel"]
["William Albert - Coshocton, OH (44032-01)","44032-01","02SD2","Sand, 703.02 Concrete ","Sand & Gravel",null,null,null,null,null,null,"William Albert - Coshocton, OH","44032-01","02SD2","Sand, 703.02 Concrete","Sand & Gravel"]
["William Albert - Coshocton, OH (44032-01)","44032-01",20572,"No. 57 Agg, 703.13 Freeze-Thaw (Gravel)","Sand & Gravel",null,null,null,null,null,null,"William Albert - Coshocton, OH","44032-01",20572,"No. 57 Agg, 703.13 Freeze-Thaw","Sand & Gravel"]
["Wylie & Sons Landscaping - Perrysburg, OH (41066-01)","41066-01",2008,"No. 8 Agg, 703.02 Concrete (Limestone)","Limestone",null,null,null,null,null,null,"Wylie & Sons Landscaping - Perrysburg, OH","41066-01",2008,"No. 8 Agg, 703.02 Concrete","Limestone"]
["Wylie & Sons Landscaping - Perrysburg, OH (41066-01)","41066-01",20572,"No. 57 Agg, 703.13 Freeze-Thaw (Limestone)","Limestone",null,null,null,null,null,null,"Wylie & Sons Landscaping - Perrysburg, OH","41066-01",20572,"No. 57 Agg, 703.13 Freeze-Thaw","Limestone"]
["Wylie & Sons Landscaping - Perrysburg, OH (41066-01)","41066-01",2057,"No. 57 Agg, 703.02 Concrete (Limestone)","Limestone",null,null,null,null,null,null,"Wylie & Sons Landscaping - Perrysburg, OH","41066-01",2057,"No. 57 Agg, 703.02 Concrete","Limestone"]
["Wylie & Sons Landscaping - Perrysburg, OH (41066-01)","41066-01",20570,"No. 57 Agg, 703.02 Super-Structure (Limestone)","Limestone",null,null,null,null,null,null,"Wylie & Sons Landscaping - Perrysburg, OH","41066-01",20570,"No. 57 Agg, 703.02 Super-Structure","Limestone"]
["Wylie & Sons Landscaping - Perrysburg, OH (41066-01)","41066-01",20080,"No. 8 Agg, 703.02 Super-Structure (Limestone)","Limestone",null,null,null,null,null,null,"Wylie & Sons Landscaping - Perrysburg, OH","41066-01",20080,"No. 8 Agg, 703.02 Super-Structure","Limestone"]
[{"$f":"L831&\" (\"&M831&\")\"","v":"Wysong Gravel - Camden, OH (47034-01)"},{"$f":"M831","v":"47034-01"},{"$f":"N831","v":2057},"No. 57 Agg, 703.02 Concrete (Gravel)","Sand & Gravel",null,null,null,null,null,null,"Wysong Gravel - Camden, OH","47034-01",2057,"No. 57 Agg, 703.02 Concrete","Sand & Gravel"]
["Wysong Gravel - Camden, OH (47034-01)","47034-01","02SD2",{"$f":"IF(ISNUMBER(SEARCH(\"MicroSilica\",O832)),REPLACE(O832,19,11,\", SS847/848\"),O832)&\" \"&IF(ISNUMBER(SEARCH(\"Sand\",O832)),\"\",IF(ISNUMBER(SEARCH(\"Limestone\",P832)),\"(Limestone)\",IF(ISNUMBER(SEARCH(\"Dolostone\",P832)),\"(Dolostone)\",IF(ISNUMBER(SEARCH(\"Gravel (Crushed)\",P832)),\"(Gravel (Crushed))\",IF(ISNUMBER(SEARCH(\"Gravel (100% Crushed)\",P832)),\"(Gravel (100% Crushed))\",IF(ISNUMBER(SEARCH(\"Slag\",P832)),\"(Slag (ACBF))\",IF(ISNUMBER(SEARCH(\"Gravel (Blended W/ Olen-Columbus Limestone)\",P832)),\"(Gravel (Blended W/ Limestone))\",IF(ISNUMBER(SEARCH(\"Gravel (Benefited: 40% Crushed)\",P832)),\"(Gravel (40% Crushed))\",IF(ISNUMBER(SEARCH(\"Sand & Gravel\",P832)),\"(Gravel)\",IF(ISNUMBER(SEARCH(\"Trap Rock\",P832)),\"(Trap Rock)\"))))))))))","v":"Sand, 703.02 Concrete "},{"$f":"P832","v":"Sand & Gravel"},null,null,null,null,null,null,"Wysong Gravel - Camden, OH","47034-01","02SD2","Sand, 703.02 Concrete","Sand & Gravel"]
["Wysong Gravel - Camden, OH (47034-01)","47034-01",20572,"No. 57 Agg, 703.13 Freeze-Thaw (Gravel)","Sand & Gravel",null,null,null,null,null,null,"Wysong Gravel - Camden, OH","47034-01",20572,"No. 57 Agg, 703.13 Freeze-Thaw","Sand & Gravel"]
["Wysong Gravel - West Alexandria, OH (47036-01)","47036-01","02SD2","Sand, 703.02 Concrete ","Sand & Gravel",null,null,null,null,null,null,"Wysong Gravel - West Alexandria, OH","47036-01","02SD2","Sand, 703.02 Concrete","Sand & Gravel"]
["Wysong Gravel - West Alexandria, OH (47036-01)","47036-01","02SD23","Sand, 703.02 Concrete, Acid Insoluble ","Sand & Gravel",null,null,null,null,null,null,"Wysong Gravel - West Alexandria, OH","47036-01","02SD23","Sand, 703.02 Concrete, Acid Insoluble","Sand & Gravel"]
["XL S & G - Negley, OH (50039-01)","50039-01","02SD2","Sand, 703.02 Concrete ","Sand & Gravel",null,null,null,null,null,null,"XL S & G - Negley, OH","50039-01","02SD2","Sand, 703.02 Concrete","Sand & Gravel"]
["Youngs S & G - Loudonville, OH (42001-01)","42001-01","02SD2","Sand, 703.02 Concrete ","Sand & Gravel",null,null,null,null,null,null,"Youngs S & G - Loudonville, OH","42001-01","02SD2","Sand, 703.02 Concrete","Sand & Gravel"]
["Youngs S & G - Loudonville, OH (42001-01)","42001-01","02SD23","Sand, 703.02 Concrete, Acid Insoluble ","Sand & Gravel",null,null,null,null,null,null,"Youngs S & G - Loudonville, OH","42001-01","02SD23","Sand, 703.02 Concrete, Acid Insoluble","Sand & Gravel"]

{"sheet":"Cm MATL LIST","index":16,"n_rows":208,"n_cols":4,"rows_kept":208,"cut":false,"hidden":true,"merged":[]}
["3751L","Argos USA, LLC - Calera, AL","72300-01","Blended Portland Limestone Cement Type 1L"]
["3751L","Argos USA, LLC - Martinsburg, WV","72301-01","Blended Portland Limestone Cement Type 1L"]
["3751L","Ash Grove - Chanute, KS","72348-01","Blended Portland Limestone Cement Type 1L"]
["3751L","Ash Grove - Mississauga, ON, CA","72310-01","Blended Portland Limestone Cement Type 1L"]
["3751L","Buzzi Unicem USA - Cape Girardeau, MO","72303-01","Blended Portland Limestone Cement Type 1L"]
["3751L","Buzzi Unicem USA - Chattanooga, TN","72304-01","Blended Portland Limestone Cement Type 1L"]
["3751L","Buzzi Unicem USA - Festus, MO","72305-01","Blended Portland Limestone Cement Type 1L"]
["3751L","Buzzi Unicem USA - Green Castle, IN","72306-01","Blended Portland Limestone Cement Type 1L"]
["3751L","Continental Cement - Davenport, IA","72308-01","Blended Portland Limestone Cement Type 1L"]
["3751L","Dragon Products - Thomaston, ME","72340-01","Blended Portland Limestone Cement Type 1L"]
["3751L","Fairborn Cement Company - Fairborn, OH","72311-01","Blended Portland Limestone Cement Type 1L"]
["3751L","Heidelberg Materials - Logansport, IN","72324-01","Blended Portland Limestone Cement Type 1L"]
["3751L","Heidelberg Materials - Mason City, IA","72336-01","Blended Portland Limestone Cement Type 1L"]
["3751L","Heidelberg Materials - Mitchell, IN","72325-01","Blended Portland Limestone Cement Type 1L"]
["3751L","Heidelberg Materials - Picton, ON","72327-01","Blended Portland Limestone Cement Type 1L"]
["3751L","Heidelberg Materials - Union Bridge, MD","72329-01","Blended Portland Limestone Cement Type 1L"]
["3751L","Holcim (US), Inc. - Alpena, MI","72313-01","Blended Portland Limestone Cement Type 1L"]
["3751L","Holcim (US), Inc. - Bloomsdale, MO","72318-01","Blended Portland Limestone Cement Type 1L"]
["3751L","Holcim (US), Inc. - Grand Chain, IL","72315-01","Blended Portland Limestone Cement Type 1L"]
["3751L","Holcim (US), Inc. - Hagerstown, MD","72319-01","Blended Portland Limestone Cement Type 1L"]
["3751L","Holcim (US), Inc. - Holly Hill, SC","72320-01","Blended Portland Limestone Cement Type 1L"]
["3751L","Holcim (US), Inc. - Lafarge - M'Sila, Algeria","72350-01","Blended Portland Limestone Cement Type 1L"]
["3751L","Holcim (US), Inc. - Paulding, OH","72316-01","Blended Portland Limestone Cement Type 1L"]
["3751L","Hollingshead Cement, LLC - Lafarge Emirates, UAE","72346-01","Blended Portland Limestone Cement Type 1L"]
["3751L","Hollingshead Cement, LLC - Lafarge-M'Sila, Algeria","72347-01","Blended Portland Limestone Cement Type 1L"]
["3751L","Illinois Cement Company - LaSalle, IL","72312-01","Blended Portland Limestone Cement Type 1L"]
["3751L","Kosmos - Louisville, KY","72307-01","Blended Portland Limestone Cement Type 1L"]
["3751L","Lafarge - Bath, Ontario, Canada","72314-01","Blended Portland Limestone Cement Type 1L"]
["3751L","Roanoke Cement - Troutville, VA","72335-01","Blended Portland Limestone Cement Type 1L"]
["3751L","St-Lawrence (BP) - Joliette, Canada","72309-01","Blended Portland Limestone Cement Type 1L"]
["3751L","St. Mary's Cement - Bowmanville, ON, CA","72331-01","Blended Portland Limestone Cement Type 1L"]
["3751L","St. Mary's Cement - Charlevoix, MI","72332-01","Blended Portland Limestone Cement Type 1L"]
["3751L","St. Mary's Cement - Detroit, MI","72333-01","Blended Portland Limestone Cement Type 1L"]
["3751L","St. Mary's Cement - St. Marys, Ontario, Canada","72334-01","Blended Portland Limestone Cement Type 1L"]
["001CMF","National Lime & Stone - Carey, OH","40030-01","Carbonate Micro-Fines"]
["001CMF","Piqua Materials - Piqua, OH","46015-01","Carbonate Micro-Fines"]
[2002,"Ash Grove - DTE Energy #1 - Belle River, MI","72517-01","Flyash Class C"]
[2002,"Ash Grove - DTE Energy #2 - Belle River, MI","72518-01","Flyash Class C"]
[2002,"EM Resources - Scherer - Julliet, GA","72537-01","Flyash Class C"]
[2002,"EM Resources-Ameren - Labadie, MO","72502-01","Flyash Class C"]
[2002,"EM Resources-Miler Coal Ash- Quinton, AL","72536-01","Flyash Class C"]
[2002,"EM Resources-NIPSCO-Schafer - Wheatfield, IN","72508-01","Flyash Class C"]
[2002,"EM Resources-Union Power - Rush Island, MO","72503-01","Flyash Class C"]
[2002,"Holcim - We Energy - Oak Creek #8, WI","72525-01","Flyash Class C"]
[2002,"Holcim- We Energy - Oak Creek #7, WI","72524-01","Flyash Class C"]
[2002,"Holcim-Alliant - Columbia, WI","72522-01","Flyash Class C"]
[2002,"Holcim-Alliant - Edgewater, WI","72523-01","Flyash Class C"]
[2002,"Holcim-Wisconsin Pub Service-Weston #3, WI","72527-01","Flyash Class C"]
[2003,"Charah Solutions - Gavin - Cheshire, OH","72530-01","Flyash Class F"]
[2003,"Charah Solutions - Vistra - Miami Fort #7, OH","72510-01","Flyash Class F"]
[2003,"Charah Solutions - Vistra - Miami Fort #8, OH","72511-01","Flyash Class F"]
[2003,"Dynegy - Miami Fort Station - North Bend, OH","91565-01","Flyash Class F"]
[2003,"EM Resources LLC - Duke Energy - Cayuga, IN","72512-01","Flyash Class F"]
[2003,"EM Resources-NIPSCO-Schafer - Wheatfield, IN","72508-01","Flyash Class F"]
[2003,"EM Resources-Ohio Edison-Sammis - Stratton, OH","72509-01","Flyash Class F"]
[2003,"EM Resources-Talen Energy - Washingtonville, PA","72534-01","Flyash Class F"]
[2003,"Fly Ash Direct - AEP - John Amos #1 - Winfield, WV","72513-01","Flyash Class F"]
[2003,"Fly Ash Direct - AEP - John Amos #2 - Winfield, WV","72514-01","Flyash Class F"]
[2003,"Flyash Direct - AEP - John Amos #3 - Winfield, WV","72519-01","Flyash Class F"]
[2003,"Flyash Direct - AEP - Mountaineer - Letart, WV","72521-01","Flyash Class F"]
[2003,"Holcim (US), Inc. - LG&E - Ghent","72506-01","Flyash Class F"]
[2003,"Holcim (US), Inc. - LG&E - Mill Creek","72504-01","Flyash Class F"]
[2003,"Ohio Valley Ash-Louisville Gas & Elec - Ghent, KY","72533-01","Flyash Class F"]
[2003,"Ozinga - DTE Energy - Belle River, MI","72507-01","Flyash Class F"]
[2003,"Separation Technologies - Cardinal - Brilliant, OH","72532-01","Flyash Class F"]
[2003,"Separation Technologies - Longview Pwer - Longview","72501-01","Flyash Class F"]
[2003,"Separation Technologies-Ovec - Clifty Creek, IN","72535-01","Flyash Class F"]
[37603,"Argos Turkish Slag - Hatay, Turkiye","72400-01","Granulated Slag Grade 100"]
[37603,"Ash Grove - Mississauga, ON, CA","72310-01","Granulated Slag Grade 100"]
[37603,"Heidelberg Materials (Slag) - Speed, IN","72408-01","Granulated Slag Grade 100"]
[37603,"Heidelberg Materials - Middlebranch, OH","72402-01","Granulated Slag Grade 100"]
[37603,"Holcim - Chicago, IL","72401-01","Granulated Slag Grade 100"]
[37603,"Ozinga - Anshan Iron & Steel, China","72406-01","Granulated Slag Grade 100"]
[37603,"Silvi Slag - Tangshan, China","72407-01","Granulated Slag Grade 100"]
[37603,"Skyway Cement - Chicago, IL","72404-01","Granulated Slag Grade 100"]
[37603,"St. Mary's Cement - Detroit, MI","72333-01","Granulated Slag Grade 100"]
[37603,"WALAN Spclty Cnstrctn Prdcts, LLC - Wilmington, DE","72409-01","Granulated Slag Grade 100"]
[37604,"Heidelberg Materials - Camden, NJ","72405-01","Granulated Slag Grade 120"]
[37604,"Heidelberg Materials - Fleetwood, PA","72323-01","Granulated Slag Grade 120"]
[37604,"Heidelberg Materials - Middlebranch, OH","72402-01","Granulated Slag Grade 120"]
[37604,"Holcim - Chicago, IL","72401-01","Granulated Slag Grade 120"]
[37601,"ACME Construction Products - Cincinnati, OH","72612-01","Micro-Silica Powder"]
[37601,"Elkem Materials - Coraopolis, PA","72601-01","Micro-Silica Powder"]
[37601,"Euclid Chemical - Cleveland, OH","72602-01","Micro-Silica Powder"]
[37601,"Ferroglobe USA Silica Fume Sales - Beverly, OH","72611-01","Micro-Silica Powder"]
[37601,"Ferroglobe USA Silica Fume Sales. - Alloy, WV","72610-01","Micro-Silica Powder"]
[37601,"GCP Applied Technologies - Wilmington, MA","72603-01","Micro-Silica Powder"]
[37601,"Hydration Kontrol, Claryville, KY","72606-01","Micro-Silica Powder"]
[37601,"Master Builders Solutions Admix - Cleveland, OH","72600-01","Micro-Silica Powder"]
[37601,"RED Industrial Products - Burnsville,MS","72607-01","Micro-Silica Powder"]
[37601,"RED Industrial Products - Calvert City, KY"," 72613-01","Micro-Silica Powder"]
[37601,"RED Industrial Products-Henan-Mongolia, China","72604-01","Micro-Silica Powder"]
[37601,"Russ Tech - Jeffersontown, KY","72608-01","Micro-Silica Powder"]
[37601,"Sika - Lyndhurst, NJ","72609-01","Micro-Silica Powder"]
[2004,"3M Corporation - Wausau, WI","72500-01","Natural Pozzolan Class N"]
[37504,"Argos USA, LLC - Calera, AL","72300-01","Portland Cement Type 1"]
[37504,"Argos USA, LLC - Martinsburg, WV","72301-01","Portland Cement Type 1"]
[37504,"Armstrong Cement & Supply - Cabot, PA","72302-01","Portland Cement Type 1"]
[37504,"Ash Grove - Canakkale, EZINE, TUR","72337-01","Portland Cement Type 1"]
[37504,"Ash Grove - Mississauga, ON, CA","72310-01","Portland Cement Type 1"]
[37504,"Benchmark Materials - Song Lam Cement, Vietnam","72344-01","Portland Cement Type 1"]
[37504,"Buzzi Unicem USA - Cape Girardeau, MO","72303-01","Portland Cement Type 1"]
[37504,"Buzzi Unicem USA - Festus, MO","72305-01","Portland Cement Type 1"]
[37504,"Buzzi Unicem USA - Green Castle, IN","72306-01","Portland Cement Type 1"]
[37504,"Cemex - Knoxville, TN","72317-01","Portland Cement Type 1"]
[37504,"Continental Cement - Davenport, IA","72308-01","Portland Cement Type 1"]
[37504,"Dragon Products - Thomaston, ME","72340-01","Portland Cement Type 1"]
[37504,"Fairborn Cement Company - Fairborn, OH","72311-01","Portland Cement Type 1"]
[37504,"Heidelberg Materials - Fleetwood, PA","72323-01","Portland Cement Type 1"]
[37504,"Heidelberg Materials - Logansport, IN","72324-01","Portland Cement Type 1"]
[37504,"Heidelberg Materials - Mason City, IA","72336-01","Portland Cement Type 1"]
[37504,"Heidelberg Materials - Mitchell, IN","72325-01","Portland Cement Type 1"]
[37504,"Heidelberg Materials - Nazareth, PA","72326-01","Portland Cement Type 1"]
[37504,"Heidelberg Materials - Picton, ON","72327-01","Portland Cement Type 1"]
[37504,"Heidelberg Materials - Union Bridge, MD","72329-01","Portland Cement Type 1"]
[37504,"Holcim (US), Inc. - Alpena, MI","72313-01","Portland Cement Type 1"]
[37504,"Holcim (US), Inc. - Bloomsdale, MO","72318-01","Portland Cement Type 1"]
[37504,"Holcim (US), Inc. - Grand Chain, IL","72315-01","Portland Cement Type 1"]
[37504,"Holcim (US), Inc. - Hagerstown, MD","72319-01","Portland Cement Type 1"]
[37504,"Holcim (US), Inc. - Holly Hill, SC","72320-01","Portland Cement Type 1"]
[37504,"Holcim (US), Inc. - Paulding, OH","72316-01","Portland Cement Type 1"]
[37504,"Hollingshead Cement, LLC - Hereke, Turkiye","72338-01","Portland Cement Type 1"]
[37504,"Illinois Cement Company - LaSalle, IL","72312-01","Portland Cement Type 1"]
[37504,"Keystone Cement -  Bath, PA","72322-01","Portland Cement Type 1"]
[37504,"Kosmos - Louisville, KY","72307-01","Portland Cement Type 1"]
[37504,"Lafarge - Bath, Ontario, Canada","72314-01","Portland Cement Type 1"]
[37504,"McInnis Cement - Stamford, CT","72330-01","Portland Cement Type 1"]
[37504,"Omni Materials, Inc.-Ozinga-Hereke, Turkiye","72342-01","Portland Cement Type 1"]
[37504,"Ozinga - Hereke, Turkiye","72339-01","Portland Cement Type 1"]
[37504,"Ozinga - Long Son Cement, Vietnam","72352-01","Portland Cement Type 1"]
[37504,"Ozinga - Song Lam Cement, Vietnam","72345-01","Portland Cement Type 1"]
[37504,"Roanoke Cement - Troutville, VA","72335-01","Portland Cement Type 1"]
[37504,"Silvi Cement - Medcem Global - Mersin, Turkiye","72343-01","Portland Cement Type 1"]
[37504,"St-Lawrence (BP) - Joliette, Canada","72309-01","Portland Cement Type 1"]
[37504,"St. Mary's Cement - Bowmanville, ON, CA","72331-01","Portland Cement Type 1"]
[37504,"St. Mary's Cement - Charlevoix, MI","72332-01","Portland Cement Type 1"]
[37504,"St. Mary's Cement - Detroit, MI","72333-01","Portland Cement Type 1"]
[37504,"St. Mary's Cement - St. Marys, Ontario, Canada","72334-01","Portland Cement Type 1"]
[37501,"Fairborn Cement Company - Fairborn, OH","72311-01","Portland Cement Type 1A"]
[37501,"Heidelberg Materials - Logansport, IN","72324-01","Portland Cement Type 1A"]
[37501,"Holcim (US), Inc. - Paulding, OH","72316-01","Portland Cement Type 1A"]
[37501,"Kosmos - Louisville, KY","72307-01","Portland Cement Type 1A"]
[37501,"St. Mary's Cement - Detroit, MI","72333-01","Portland Cement Type 1A"]
[37506,"Holcim (US), Inc. - Paulding, OH","72316-01","Portland Cement Type 1SM"]
[37502,"Argos USA, LLC - Calera, AL","72300-01","Portland Cement Type 2"]
[37502,"Argos USA, LLC - Martinsburg, WV","72301-01","Portland Cement Type 2"]
[37502,"Armstrong Cement & Supply - Cabot, PA","72302-01","Portland Cement Type 2"]
[37502,"Ash Grove - Canakkale, EZINE, TUR","72337-01","Portland Cement Type 2"]
[37502,"Ash Grove - Mississauga, ON, CA","72310-01","Portland Cement Type 2"]
[37502,"Benchmark Materials - Song Lam Cement, Vietnam","72344-01","Portland Cement Type 2"]
[37502,"Buzzi Unicem USA - Cape Girardeau, MO","72303-01","Portland Cement Type 2"]
[37502,"Buzzi Unicem USA - Chattanooga, TN","72304-01","Portland Cement Type 2"]
[37502,"Buzzi Unicem USA - Festus, MO","72305-01","Portland Cement Type 2"]
[37502,"Cemex - Knoxville, TN","72317-01","Portland Cement Type 2"]
[37502,"Dragon Products - Thomaston, ME","72340-01","Portland Cement Type 2"]
[37502,"Fairborn Cement Company - Fairborn, OH","72311-01","Portland Cement Type 2"]
[37502,"Heidelberg Materials - Fleetwood, PA","72323-01","Portland Cement Type 2"]
[37502,"Heidelberg Materials - Logansport, IN","72324-01","Portland Cement Type 2"]
[37502,"Heidelberg Materials - Mitchell, IN","72325-01","Portland Cement Type 2"]
[37502,"Heidelberg Materials - Nazareth, PA","72326-01","Portland Cement Type 2"]
[37502,"Heidelberg Materials - Picton, ON","72327-01","Portland Cement Type 2"]
[37502,"Heidelberg Materials - Union Bridge, MD","72329-01","Portland Cement Type 2"]
[37502,"Holcim (US), Inc. - Alpena, MI","72313-01","Portland Cement Type 2"]
[37502,"Holcim (US), Inc. - Bloomsdale, MO","72318-01","Portland Cement Type 2"]
[37502,"Holcim (US), Inc. - Grand Chain, IL","72315-01","Portland Cement Type 2"]
[37502,"Holcim (US), Inc. - Hagerstown, MD","72319-01","Portland Cement Type 2"]
[37502,"Holcim (US), Inc. - Holly Hill, SC","72320-01","Portland Cement Type 2"]
[37502,"Hollingshead Cement, LLC - Hereke, Turkiye","72338-01","Portland Cement Type 2"]
[37502,"Keystone Cement -  Bath, PA","72322-01","Portland Cement Type 2"]
[37502,"Kosmos - Louisville, KY","72307-01","Portland Cement Type 2"]
[37502,"Lafarge - Bath, Ontario, Canada","72314-01","Portland Cement Type 2"]
[37502,"McInnis Cement - Stamford, CT","72330-01","Portland Cement Type 2"]
[37502,"Ohio Valley Cem Matls - Goltas - Isparta, Turkiye","72349-01","Portland Cement Type 2"]
[37502,"Omni Materials, Inc.-Ozinga-Hereke, Turkiye","72342-01","Portland Cement Type 2"]
[37502,"Ozinga - Hereke, Turkiye","72339-01","Portland Cement Type 2"]
[37502,"Ozinga - Long Son Cement, Vietnam","72352-01","Portland Cement Type 2"]
[37502,"Ozinga - Song Lam Cement, Vietnam","72345-01","Portland Cement Type 2"]
[37502,"Roanoke Cement - Troutville, VA","72335-01","Portland Cement Type 2"]
[37502,"Silvi Cement - Medcem Global - Mersin, Turkiye","72343-01","Portland Cement Type 2"]
[37502,"St-Lawrence (BP) - Joliette, Canada","72309-01","Portland Cement Type 2"]
[37502,"St. Mary's Cement - Bowmanville, ON, CA","72331-01","Portland Cement Type 2"]
[37502,"St. Mary's Cement - Charlevoix, MI","72332-01","Portland Cement Type 2"]
[37502,"St. Mary's Cement - Detroit, MI","72333-01","Portland Cement Type 2"]
[37502,"St. Mary's Cement - St. Marys, Ontario, Canada","72334-01","Portland Cement Type 2"]
[37505,"Argos USA, LLC - Martinsburg, WV","72301-01","Portland Cement Type 3"]
[37505,"Armstrong Cement & Supply - Cabot, PA","72302-01","Portland Cement Type 3"]
[37505,"Ash Grove - Mississauga, ON, CA","72310-01","Portland Cement Type 3"]
[37505,"Buzzi Unicem USA - Chattanooga, TN","72304-01","Portland Cement Type 3"]
[37505,"Buzzi Unicem USA - Green Castle, IN","72306-01","Portland Cement Type 3"]
[37505,"Fairborn Cement Company - Fairborn, OH","72311-01","Portland Cement Type 3"]
[37505,"Heidelberg Materials - Logansport, IN","72324-01","Portland Cement Type 3"]
[37505,"Heidelberg Materials - Mitchell, IN","72325-01","Portland Cement Type 3"]
[37505,"Heidelberg Materials - Union Bridge, MD","72329-01","Portland Cement Type 3"]
[37505,"Holcim (US), Inc. - Alpena, MI","72313-01","Portland Cement Type 3"]
[37505,"Holcim (US), Inc. - Hagerstown, MD","72319-01","Portland Cement Type 3"]
[37505,"Holcim (US), Inc. - Paulding, OH","72316-01","Portland Cement Type 3"]
[37505,"Illinois Cement Company - LaSalle, IL","72312-01","Portland Cement Type 3"]
[37505,"Keystone Cement -  Bath, PA","72322-01","Portland Cement Type 3"]
[37505,"Kosmos - Louisville, KY","72307-01","Portland Cement Type 3"]
[37505,"Lafarge - Bath, Ontario, Canada","72314-01","Portland Cement Type 3"]
[37505,"McInnis Cement - Stamford, CT","72330-01","Portland Cement Type 3"]
[37505,"Roanoke Cement - Troutville, VA","72335-01","Portland Cement Type 3"]
[37505,"St. Mary's Cement - Bowmanville, ON, CA","72331-01","Portland Cement Type 3"]
[37505,"St. Mary's Cement - Charlevoix, MI","72332-01","Portland Cement Type 3"]
[37505,"St. Mary's Cement - Detroit, MI","72333-01","Portland Cement Type 3"]
[37505,"St. Mary's Cement - St. Marys, Ontario, Canada","72334-01","Portland Cement Type 3"]
[375121,"Holcim (US), Inc. - Paulding, OH","72316-01","Portland Cement Type GU, 8% Micro Silca"]
[375121,"St. Mary's Cement - St. Marys, Ontario, Canada","72334-01","Portland Cement Type GU, 8% Micro Silca"]

{"sheet":"ADMIX PRODUCER LIST","index":17,"n_rows":16,"n_cols":2,"rows_kept":16,"cut":false,"hidden":true,"merged":[]}
["Chryso - Royse City, TX","72713-01"]
["Cortec Laboratories - St. Paul, MN","72716-01"]
["DarCole Products - Henderson, KY","72794-01"]
["Euclid Chemical - Cleveland, OH","72602-01"]
["Fritz-Pak Corporation - Mesquite, TX","72733-01"]
["GCP Applied Technologies - Wilmington, MA","72603-01"]
["Hycrete Tech","72740-01"]
["Ipa Systems","72742-01"]
["Krete Industries - Brookfield, WI","72808-01"]
["MAPEI Corporation - Deerfield Beach, FL","72735-01"]
["Master Builders Solutions Admix - Cleveland, OH","72600-01"]
["Occidental Chemical Corporation - Ludington, MI","72755-01"]
["Premiere Concrete Admixtures - Pioneer, OH","72764-01"]
["Russ Tech - Jeffersontown, KY","72608-01"]
["Sika Corporation","72773-01"]
["Trinseo - Midland, MI","72785-01"]

{"sheet":"ADMIX PRODUCT LIST","index":18,"n_rows":471,"n_cols":16,"rows_kept":471,"cut":false,"hidden":true,"merged":[[6,6,11,9]]}
[{"$f":"L1","v":"72713-01"},{"$f":"IF(ISNUMBER(SEARCH(\"Liquid\",O1)),M1,IF(ISNUMBER(SEARCH(\"Self\",O1)),M1&\" (SCC)\",IF(ISNUMBER(SEARCH(\"Corrosion\",O1)),M1&\" (CI)\",IF(ISNUMBER(SEARCH(\"Type\",O1)),M1&\" (\"&REPLACE(O1,1,10,\"\")&\")\",M1))))","v":"CHRYSO® AIR NVR"},{"$f":"N1","v":42001},"Admixture, Air Entraining",{"$f":"IF(ISNUMBER(SEARCH(\"Lyndhurst\",P1)),\"Sika Corporation\",P1)","v":"Chryso - Royse City, TX"},null,null,null,null,null,null,"72713-01","CHRYSO® AIR NVR",42001,"Admixture, Air Entraining","Chryso - Royse City, TX"]
[{"$f":"L2","v":"72713-01"},{"$f":"IF(ISNUMBER(SEARCH(\"Liquid\",O2)),M2,IF(ISNUMBER(SEARCH(\"Self\",O2)),M2&\" (SCC)\",IF(ISNUMBER(SEARCH(\"Corrosion\",O2)),M2&\" (CI)\",IF(ISNUMBER(SEARCH(\"Type\",O2)),M2&\" (\"&REPLACE(O2,1,10,\"\")&\")\",M2))))","v":"CHRYSO® AIR G 100"},{"$f":"N2","v":42001},{"$f":"O2","v":"Admixture, Air Entraining"},{"$f":"IF(ISNUMBER(SEARCH(\"Lyndhurst\",P2)),\"Sika Corporation\",P2)","v":"Chryso - Royse City, TX"},null,null,null,null,null,null,"72713-01","CHRYSO® AIR G 100",42001,"Admixture, Air Entraining","Chryso - Royse City, TX"]
["72713-01","CHRYSO® AIR 260",42001,"Admixture, Air Entraining","Chryso - Royse City, TX",null,null,null,null,null,null,"72713-01","CHRYSO® AIR 260",42001,"Admixture, Air Entraining","Chryso - Royse City, TX"]
["72713-01","CHRYSO® OPTIMA 249 (Type A,F)",42110,"Admixture Type A,F","Chryso - Royse City, TX",null,null,null,null,null,null,"72713-01","CHRYSO® OPTIMA 249",42110,"Admixture Type A,F","Chryso - Royse City, TX"]
["72713-01","CHRYSO® FLUID OPTIMA 256 EMx (Type A,F)",42110,"Admixture Type A,F","Chryso - Royse City, TX",null,null,null,null,null,null,"72713-01","CHRYSO® FLUID OPTIMA 256 EMx",42110,"Admixture Type A,F","Chryso - Royse City, TX"]
["72713-01","CHRYSO® FLUID OPTIMA 203 (Type A,F)",42110,"Admixture Type A,F","Chryso - Royse City, TX",null,null,null,null,null,null,"72713-01","CHRYSO® FLUID OPTIMA 203",42110,"Admixture Type A,F","Chryso - Royse City, TX"]
["72713-01","CHRYSO® OPTIMA 249 (Type A)",42101,"Admixture Type A","Chryso - Royse City, TX",null,"INSERT QUERY OVERTOP VALUES ON THE RIGHT\n->>>",null,null,null,null,"72713-01","CHRYSO® OPTIMA 249",42101,"Admixture Type A","Chryso - Royse City, TX"]
["72713-01","CHRYSO® OPTIMA 249 (Type F)",42106,"Admixture Type F","Chryso - Royse City, TX",null,null,null,null,null,null,"72713-01","CHRYSO® OPTIMA 249",42106,"Admixture Type F","Chryso - Royse City, TX"]
["72713-01","CHRYSO® FLUID OPTIMA 256 Emx (Type A)",42101,"Admixture Type A","Chryso - Royse City, TX",null,null,null,null,null,null,"72713-01","CHRYSO® FLUID OPTIMA 256 Emx",42101,"Admixture Type A","Chryso - Royse City, TX"]
["72713-01","CHRYSO® FLUID OPTIMA 256 EMx (Type F)",42106,"Admixture Type F","Chryso - Royse City, TX",null,null,null,null,null,null,"72713-01","CHRYSO® FLUID OPTIMA 256 EMx",42106,"Admixture Type F","Chryso - Royse City, TX"]
["72713-01","CHRYSO® FLUID OPTIMA 203 (Type A)",42101,"Admixture Type A","Chryso - Royse City, TX",null,null,null,null,null,null,"72713-01","CHRYSO® FLUID OPTIMA 203",42101,"Admixture Type A","Chryso - Royse City, TX"]
["72713-01","CHRYSO® FLUID OPTIMA 203 (Type F)",42106,"Admixture Type F","Chryso - Royse City, TX",null,null,null,null,null,null,"72713-01","CHRYSO® FLUID OPTIMA 203",42106,"Admixture Type F","Chryso - Royse City, TX"]
["72716-01","MCI 2005 NS (CI)",43301,"Admixture Corrosion Inhibitor","Cortec Laboratories - St. Paul, MN",null,null,null,null,null,null,"72716-01","MCI 2005 NS",43301,"Admixture Corrosion Inhibitor","Cortec Laboratories - St. Paul, MN"]
["72716-01","MCI 2005 (CI)",43301,"Admixture Corrosion Inhibitor","Cortec Laboratories - St. Paul, MN",null,null,null,null,null,null,"72716-01","MCI 2005",43301,"Admixture Corrosion Inhibitor","Cortec Laboratories - St. Paul, MN"]
["72794-01","DWR 385 (Type A)",42101,"Admixture Type A","DarCole Products - Henderson, KY",null,null,null,null,null,null,"72794-01","DWR 385",42101,"Admixture Type A","DarCole Products - Henderson, KY"]
["72794-01","DNL 485 (Type A)",42101,"Admixture Type A","DarCole Products - Henderson, KY",null,null,null,null,null,null,"72794-01","DNL 485",42101,"Admixture Type A","DarCole Products - Henderson, KY"]
["72794-01","DNL 785 (Type A)",42101,"Admixture Type A","DarCole Products - Henderson, KY",null,null,null,null,null,null,"72794-01","DNL 785",42101,"Admixture Type A","DarCole Products - Henderson, KY"]
["72794-01","DNS 166 (Type C)",42103,"Admixture Type C","DarCole Products - Henderson, KY",null,null,null,null,null,null,"72794-01","DNS 166",42103,"Admixture Type C","DarCole Products - Henderson, KY"]
["72794-01","DSF 1443 SCC (Type F)",42106,"Admixture Type F","DarCole Products - Henderson, KY",null,null,null,null,null,null,"72794-01","DSF 1443 SCC",42106,"Admixture Type F","DarCole Products - Henderson, KY"]
["72794-01","DSA 110",42001,"Admixture, Air Entraining","DarCole Products - Henderson, KY",null,null,null,null,null,null,"72794-01","DSA 110",42001,"Admixture, Air Entraining","DarCole Products - Henderson, KY"]
["72602-01","PLASTOL 6400 (SCC)",42117,"Admixture Self Compacting Concrete","Euclid Chemical - Cleveland, OH",null,null,null,null,null,null,"72602-01","PLASTOL 6400",42117,"Admixture Self Compacting Concrete","Euclid Chemical - Cleveland, OH"]
["72602-01","PLASTOL 6420 (SCC)",42117,"Admixture Self Compacting Concrete","Euclid Chemical - Cleveland, OH",null,null,null,null,null,null,"72602-01","PLASTOL 6420",42117,"Admixture Self Compacting Concrete","Euclid Chemical - Cleveland, OH"]
["72602-01","PLASTOL 6200EXT (SCC)",42117,"Admixture Self Compacting Concrete","Euclid Chemical - Cleveland, OH",null,null,null,null,null,null,"72602-01","PLASTOL 6200EXT",42117,"Admixture Self Compacting Concrete","Euclid Chemical - Cleveland, OH"]
["72602-01","PLASTOL 6425 (SCC)",42117,"Admixture Self Compacting Concrete","Euclid Chemical - Cleveland, OH",null,null,null,null,null,null,"72602-01","PLASTOL 6425",42117,"Admixture Self Compacting Concrete","Euclid Chemical - Cleveland, OH"]
["72602-01","VISCTROL (SCC)",42117,"Admixture Self Compacting Concrete","Euclid Chemical - Cleveland, OH",null,null,null,null,null,null,"72602-01","VISCTROL",42117,"Admixture Self Compacting Concrete","Euclid Chemical - Cleveland, OH"]
["72602-01","EUCON AEA 92S",42001,"Admixture, Air Entraining","Euclid Chemical - Cleveland, OH",null,null,null,null,null,null,"72602-01","EUCON AEA 92S",42001,"Admixture, Air Entraining","Euclid Chemical - Cleveland, OH"]
["72602-01","EUCON AEA-92",42001,"Admixture, Air Entraining","Euclid Chemical - Cleveland, OH",null,null,null,null,null,null,"72602-01","EUCON AEA-92",42001,"Admixture, Air Entraining","Euclid Chemical - Cleveland, OH"]
["72602-01","EUCON EASY FILL",42001,"Admixture, Air Entraining","Euclid Chemical - Cleveland, OH",null,null,null,null,null,null,"72602-01","EUCON EASY FILL",42001,"Admixture, Air Entraining","Euclid Chemical - Cleveland, OH"]
["72602-01","EUCON AIR MAC6",42001,"Admixture, Air Entraining","Euclid Chemical - Cleveland, OH",null,null,null,null,null,null,"72602-01","EUCON AIR MAC6",42001,"Admixture, Air Entraining","Euclid Chemical - Cleveland, OH"]
["72602-01","EUCON AIR MAC 12",42001,"Admixture, Air Entraining","Euclid Chemical - Cleveland, OH",null,null,null,null,null,null,"72602-01","EUCON AIR MAC 12",42001,"Admixture, Air Entraining","Euclid Chemical - Cleveland, OH"]
["72602-01","EUCON AIR MIX 250",42001,"Admixture, Air Entraining","Euclid Chemical - Cleveland, OH",null,null,null,null,null,null,"72602-01","EUCON AIR MIX 250",42001,"Admixture, Air Entraining","Euclid Chemical - Cleveland, OH"]
["72602-01","EUCON AIR MIX 200",42001,"Admixture, Air Entraining","Euclid Chemical - Cleveland, OH",null,null,null,null,null,null,"72602-01","EUCON AIR MIX 200",42001,"Admixture, Air Entraining","Euclid Chemical - Cleveland, OH"]
["72602-01","EUCON AIR MIX",42001,"Admixture, Air Entraining","Euclid Chemical - Cleveland, OH",null,null,null,null,null,null,"72602-01","EUCON AIR MIX",42001,"Admixture, Air Entraining","Euclid Chemical - Cleveland, OH"]
["72602-01","ACCELGUARD STANDARD (Type C)",42103,"Admixture Type C","Euclid Chemical - Cleveland, OH",null,null,null,null,null,null,"72602-01","ACCELGUARD STANDARD",42103,"Admixture Type C","Euclid Chemical - Cleveland, OH"]
["72602-01","EUCON CIA (Type C)",42103,"Admixture Type C","Euclid Chemical - Cleveland, OH",null,null,null,null,null,null,"72602-01","EUCON CIA",42103,"Admixture Type C","Euclid Chemical - Cleveland, OH"]
["72602-01","PLASTOL SPC (Type F)",42106,"Admixture Type F","Euclid Chemical - Cleveland, OH",null,null,null,null,null,null,"72602-01","PLASTOL SPC",42106,"Admixture Type F","Euclid Chemical - Cleveland, OH"]
["72602-01","PLASTOL 6400 (Type F)",42106,"Admixture Type F","Euclid Chemical - Cleveland, OH",null,null,null,null,null,null,"72602-01","PLASTOL 6400",42106,"Admixture Type F","Euclid Chemical - Cleveland, OH"]
["72602-01","PLASTOL 6420 (Type F)",42106,"Admixture Type F","Euclid Chemical - Cleveland, OH",null,null,null,null,null,null,"72602-01","PLASTOL 6420",42106,"Admixture Type F","Euclid Chemical - Cleveland, OH"]
["72602-01","EUCON 1037 (Type F)",42106,"Admixture Type F","Euclid Chemical - Cleveland, OH",null,null,null,null,null,null,"72602-01","EUCON 1037",42106,"Admixture Type F","Euclid Chemical - Cleveland, OH"]
["72602-01","PLASTOL 5000 (Type F)",42106,"Admixture Type F","Euclid Chemical - Cleveland, OH",null,null,null,null,null,null,"72602-01","PLASTOL 5000",42106,"Admixture Type F","Euclid Chemical - Cleveland, OH"]
["72602-01","PLASTOL 6425 (Type F)",42106,"Admixture Type F","Euclid Chemical - Cleveland, OH",null,null,null,null,null,null,"72602-01","PLASTOL 6425",42106,"Admixture Type F","Euclid Chemical - Cleveland, OH"]
["72602-01","PLASTOL 6200EXT (Type F)",42106,"Admixture Type F","Euclid Chemical - Cleveland, OH",null,null,null,null,null,null,"72602-01","PLASTOL 6200EXT",42106,"Admixture Type F","Euclid Chemical - Cleveland, OH"]
["72602-01","EUCON MRX (Type F)",42106,"Admixture Type F","Euclid Chemical - Cleveland, OH",null,null,null,null,null,null,"72602-01","EUCON MRX",42106,"Admixture Type F","Euclid Chemical - Cleveland, OH"]
["72602-01","EUCON SE (Type A,B,D)",42108,"Admixture Type A,B,D","Euclid Chemical - Cleveland, OH",null,null,null,null,null,null,"72602-01","EUCON SE",42108,"Admixture Type A,B,D","Euclid Chemical - Cleveland, OH"]
["72602-01","EUCON WR (Type A,B,D)",42108,"Admixture Type A,B,D","Euclid Chemical - Cleveland, OH",null,null,null,null,null,null,"72602-01","EUCON WR",42108,"Admixture Type A,B,D","Euclid Chemical - Cleveland, OH"]
["72602-01","EUCON 37 (Type A,F)",42110,"Admixture Type A,F","Euclid Chemical - Cleveland, OH",null,null,null,null,null,null,"72602-01","EUCON 37",42110,"Admixture Type A,F","Euclid Chemical - Cleveland, OH"]
["72602-01","EUCON MR (Type A,F)",42110,"Admixture Type A,F","Euclid Chemical - Cleveland, OH",null,null,null,null,null,null,"72602-01","EUCON MR",42110,"Admixture Type A,F","Euclid Chemical - Cleveland, OH"]
["72602-01","PLASTOL 341 (Type A,F)",42110,"Admixture Type A,F","Euclid Chemical - Cleveland, OH",null,null,null,null,null,null,"72602-01","PLASTOL 341",42110,"Admixture Type A,F","Euclid Chemical - Cleveland, OH"]
["72602-01","PLASTOL ULTRA 209 (Type A,F)",42110,"Admixture Type A,F","Euclid Chemical - Cleveland, OH",null,null,null,null,null,null,"72602-01","PLASTOL ULTRA 209",42110,"Admixture Type A,F","Euclid Chemical - Cleveland, OH"]
["72602-01","ACCELGUARD G3 (Type C,E)",42113,"Admixture Type C,E","Euclid Chemical - Cleveland, OH",null,null,null,null,null,null,"72602-01","ACCELGUARD G3",42113,"Admixture Type C,E","Euclid Chemical - Cleveland, OH"]
["72602-01","ACCELGUARD 80 (Type C,E)",42113,"Admixture Type C,E","Euclid Chemical - Cleveland, OH",null,null,null,null,null,null,"72602-01","ACCELGUARD 80",42113,"Admixture Type C,E","Euclid Chemical - Cleveland, OH"]
["72602-01","*ACCELGUARD HE (Type C,E)",42113,"Admixture Type C,E","Euclid Chemical - Cleveland, OH",null,null,null,null,null,null,"72602-01","*ACCELGUARD HE",42113,"Admixture Type C,E","Euclid Chemical - Cleveland, OH"]
["72602-01","ACCELGUARD NCA (Type C,E)",42113,"Admixture Type C,E","Euclid Chemical - Cleveland, OH",null,null,null,null,null,null,"72602-01","ACCELGUARD NCA",42113,"Admixture Type C,E","Euclid Chemical - Cleveland, OH"]
["72602-01","ACCELGUARD 90 (Type C,E)",42113,"Admixture Type C,E","Euclid Chemical - Cleveland, OH",null,null,null,null,null,null,"72602-01","ACCELGUARD 90",42113,"Admixture Type C,E","Euclid Chemical - Cleveland, OH"]
["72602-01","EUCON A+ (Type A)",42101,"Admixture Type A","Euclid Chemical - Cleveland, OH",null,null,null,null,null,null,"72602-01","EUCON A+",42101,"Admixture Type A","Euclid Chemical - Cleveland, OH"]
["72602-01","EUCON 537 (Type G)",42107,"Admixture Type G","Euclid Chemical - Cleveland, OH",null,null,null,null,null,null,"72602-01","EUCON 537",42107,"Admixture Type G","Euclid Chemical - Cleveland, OH"]
["72602-01","EUCON WR-75 (Type A,D)",42109,"Admixture Type A,D","Euclid Chemical - Cleveland, OH",null,null,null,null,null,null,"72602-01","EUCON WR-75",42109,"Admixture Type A,D","Euclid Chemical - Cleveland, OH"]
["72602-01","EUCON WR-91 (Type A,D)",42109,"Admixture Type A,D","Euclid Chemical - Cleveland, OH",null,null,null,null,null,null,"72602-01","EUCON WR-91",42109,"Admixture Type A,D","Euclid Chemical - Cleveland, OH"]
["72602-01","EUCON STASIS (Type B,D)",42112,"Admixture Type B,D","Euclid Chemical - Cleveland, OH",null,null,null,null,null,null,"72602-01","EUCON STASIS",42112,"Admixture Type B,D","Euclid Chemical - Cleveland, OH"]
["72602-01","EUCON RETARDER 100 (Type B,D)",42112,"Admixture Type B,D","Euclid Chemical - Cleveland, OH",null,null,null,null,null,null,"72602-01","EUCON RETARDER 100",42112,"Admixture Type B,D","Euclid Chemical - Cleveland, OH"]
["72602-01","EUCON RETARDER 75 (Type B,D)",42112,"Admixture Type B,D","Euclid Chemical - Cleveland, OH",null,null,null,null,null,null,"72602-01","EUCON RETARDER 75",42112,"Admixture Type B,D","Euclid Chemical - Cleveland, OH"]
["72602-01","EUCON AWA",42203,"Admixture Anti-Washout","Euclid Chemical - Cleveland, OH",null,null,null,null,null,null,"72602-01","EUCON AWA",42203,"Admixture Anti-Washout","Euclid Chemical - Cleveland, OH"]
["72602-01","EUCON CIA (CI)",43301,"Admixture Corrosion Inhibitor","Euclid Chemical - Cleveland, OH",null,null,null,null,null,null,"72602-01","EUCON CIA",43301,"Admixture Corrosion Inhibitor","Euclid Chemical - Cleveland, OH"]
["72602-01","Eucon AWA-P20 (SCC)",42117,"Admixture Self Compacting Concrete","Euclid Chemical - Cleveland, OH",null,null,null,null,null,null,"72602-01","Eucon AWA-P20",42117,"Admixture Self Compacting Concrete","Euclid Chemical - Cleveland, OH"]
["72602-01","PLASTOL 6425 (Type A,F)",42110,"Admixture Type A,F","Euclid Chemical - Cleveland, OH",null,null,null,null,null,null,"72602-01","PLASTOL 6425",42110,"Admixture Type A,F","Euclid Chemical - Cleveland, OH"]
[{"$f":"L66","v":"72602-01"},{"$f":"IF(ISNUMBER(SEARCH(\"Liquid\",O66)),M66,IF(ISNUMBER(SEARCH(\"Self\",O66)),M66&\" (SCC)\",IF(ISNUMBER(SEARCH(\"Corrosion\",O66)),M66&\" (CI)\",IF(ISNUMBER(SEARCH(\"Type\",O66)),M66&\" (\"&REPLACE(O66,1,10,\"\")&\")\",M66))))","v":"*ACCELGUARD HE (Type E)"},{"$f":"N66","v":42105},{"$f":"O66","v":"Admixture Type E"},{"$f":"IF(ISNUMBER(SEARCH(\"Lyndhurst\",P66)),\"Sika Corporation\",P66)","v":"Euclid Chemical - Cleveland, OH"},null,null,null,null,null,null,"72602-01","*ACCELGUARD HE",42105,"Admixture Type E","Euclid Chemical - Cleveland, OH"]
["72602-01","ACCELGUARD 80 (Type E)",42105,"Admixture Type E","Euclid Chemical - Cleveland, OH",null,null,null,null,null,null,"72602-01","ACCELGUARD 80",42105,"Admixture Type E","Euclid Chemical - Cleveland, OH"]
["72602-01","ACCELGUARD 90 (Type E)",42105,"Admixture Type E","Euclid Chemical - Cleveland, OH",null,null,null,null,null,null,"72602-01","ACCELGUARD 90",42105,"Admixture Type E","Euclid Chemical - Cleveland, OH"]
["72602-01","ACCELGUARD G3 (Type E)",42105,"Admixture Type E","Euclid Chemical - Cleveland, OH",null,null,null,null,null,null,"72602-01","ACCELGUARD G3",42105,"Admixture Type E","Euclid Chemical - Cleveland, OH"]
["72602-01","ACCELGUARD NCA (Type E)",42105,"Admixture Type E","Euclid Chemical - Cleveland, OH",null,null,null,null,null,null,"72602-01","ACCELGUARD NCA",42105,"Admixture Type E","Euclid Chemical - Cleveland, OH"]
["72602-01","EUCON WR (Type B)",42102,"Admixture Type B","Euclid Chemical - Cleveland, OH",null,null,null,null,null,null,"72602-01","EUCON WR",42102,"Admixture Type B","Euclid Chemical - Cleveland, OH"]
["72602-01","EUCON WR (Type D)",42104,"Admixture Type D","Euclid Chemical - Cleveland, OH",null,null,null,null,null,null,"72602-01","EUCON WR",42104,"Admixture Type D","Euclid Chemical - Cleveland, OH"]
["72602-01","EUCON SE (Type B)",42102,"Admixture Type B","Euclid Chemical - Cleveland, OH",null,null,null,null,null,null,"72602-01","EUCON SE",42102,"Admixture Type B","Euclid Chemical - Cleveland, OH"]
["72602-01","EUCON SE (Type D)",42104,"Admixture Type D","Euclid Chemical - Cleveland, OH",null,null,null,null,null,null,"72602-01","EUCON SE",42104,"Admixture Type D","Euclid Chemical - Cleveland, OH"]
["72602-01","EUCON STASIS (Type B)",42102,"Admixture Type B","Euclid Chemical - Cleveland, OH",null,null,null,null,null,null,"72602-01","EUCON STASIS",42102,"Admixture Type B","Euclid Chemical - Cleveland, OH"]
["72602-01","EUCON STASIS (Type D)",42104,"Admixture Type D","Euclid Chemical - Cleveland, OH",null,null,null,null,null,null,"72602-01","EUCON STASIS",42104,"Admixture Type D","Euclid Chemical - Cleveland, OH"]
["72602-01","EUCON RETARDER 100 (Type B)",42102,"Admixture Type B","Euclid Chemical - Cleveland, OH",null,null,null,null,null,null,"72602-01","EUCON RETARDER 100",42102,"Admixture Type B","Euclid Chemical - Cleveland, OH"]
["72602-01","EUCON RETARDER 100 (Type D)",42104,"Admixture Type D","Euclid Chemical - Cleveland, OH",null,null,null,null,null,null,"72602-01","EUCON RETARDER 100",42104,"Admixture Type D","Euclid Chemical - Cleveland, OH"]
["72602-01","EUCON RETARDER 75 (Type B)",42102,"Admixture Type B","Euclid Chemical - Cleveland, OH",null,null,null,null,null,null,"72602-01","EUCON RETARDER 75",42102,"Admixture Type B","Euclid Chemical - Cleveland, OH"]
["72602-01","EUCON RETARDER 75 (Type D)",42104,"Admixture Type D","Euclid Chemical - Cleveland, OH",null,null,null,null,null,null,"72602-01","EUCON RETARDER 75",42104,"Admixture Type D","Euclid Chemical - Cleveland, OH"]
["72602-01","EUCON WR-91 (Type D)",42104,"Admixture Type D","Euclid Chemical - Cleveland, OH",null,null,null,null,null,null,"72602-01","EUCON WR-91",42104,"Admixture Type D","Euclid Chemical - Cleveland, OH"]
["72602-01","EUCON WR-75 (Type D)",42104,"Admixture Type D","Euclid Chemical - Cleveland, OH",null,null,null,null,null,null,"72602-01","EUCON WR-75",42104,"Admixture Type D","Euclid Chemical - Cleveland, OH"]
["72602-01","*ACCELGUARD HE (Type C)",42103,"Admixture Type C","Euclid Chemical - Cleveland, OH",null,null,null,null,null,null,"72602-01","*ACCELGUARD HE",42103,"Admixture Type C","Euclid Chemical - Cleveland, OH"]
["72602-01","ACCELGUARD 80 (Type C)",42103,"Admixture Type C","Euclid Chemical - Cleveland, OH",null,null,null,null,null,null,"72602-01","ACCELGUARD 80",42103,"Admixture Type C","Euclid Chemical - Cleveland, OH"]
["72602-01","ACCELGUARD 90 (Type C)",42103,"Admixture Type C","Euclid Chemical - Cleveland, OH",null,null,null,null,null,null,"72602-01","ACCELGUARD 90",42103,"Admixture Type C","Euclid Chemical - Cleveland, OH"]
["72602-01","ACCELGUARD G3 (Type C)",42103,"Admixture Type C","Euclid Chemical - Cleveland, OH",null,null,null,null,null,null,"72602-01","ACCELGUARD G3",42103,"Admixture Type C","Euclid Chemical - Cleveland, OH"]
["72602-01","ACCELGUARD NCA (Type C)",42103,"Admixture Type C","Euclid Chemical - Cleveland, OH",null,null,null,null,null,null,"72602-01","ACCELGUARD NCA",42103,"Admixture Type C","Euclid Chemical - Cleveland, OH"]
["72602-01","PLASTOL 341 (Type A)",42101,"Admixture Type A","Euclid Chemical - Cleveland, OH",null,null,null,null,null,null,"72602-01","PLASTOL 341",42101,"Admixture Type A","Euclid Chemical - Cleveland, OH"]
["72602-01","PLASTOL 341 (Type F)",42106,"Admixture Type F","Euclid Chemical - Cleveland, OH",null,null,null,null,null,null,"72602-01","PLASTOL 341",42106,"Admixture Type F","Euclid Chemical - Cleveland, OH"]
["72602-01","PLASTOL 6425 (Type A)",42101,"Admixture Type A","Euclid Chemical - Cleveland, OH",null,null,null,null,null,null,"72602-01","PLASTOL 6425",42101,"Admixture Type A","Euclid Chemical - Cleveland, OH"]
["72602-01","EUCON 37 (Type A)",42101,"Admixture Type A","Euclid Chemical - Cleveland, OH",null,null,null,null,null,null,"72602-01","EUCON 37",42101,"Admixture Type A","Euclid Chemical - Cleveland, OH"]
["72602-01","EUCON 37 (Type F)",42106,"Admixture Type F","Euclid Chemical - Cleveland, OH",null,null,null,null,null,null,"72602-01","EUCON 37",42106,"Admixture Type F","Euclid Chemical - Cleveland, OH"]
["72602-01","EUCON MR (Type A)",42101,"Admixture Type A","Euclid Chemical - Cleveland, OH",null,null,null,null,null,null,"72602-01","EUCON MR",42101,"Admixture Type A","Euclid Chemical - Cleveland, OH"]
["72602-01","EUCON MR (Type F)",42106,"Admixture Type F","Euclid Chemical - Cleveland, OH",null,null,null,null,null,null,"72602-01","EUCON MR",42106,"Admixture Type F","Euclid Chemical - Cleveland, OH"]
["72602-01","PLASTOL ULTRA 209 (Type A)",42101,"Admixture Type A","Euclid Chemical - Cleveland, OH",null,null,null,null,null,null,"72602-01","PLASTOL ULTRA 209",42101,"Admixture Type A","Euclid Chemical - Cleveland, OH"]
["72602-01","PLASTOL ULTRA 209 (Type F)",42106,"Admixture Type F","Euclid Chemical - Cleveland, OH",null,null,null,null,null,null,"72602-01","PLASTOL ULTRA 209",42106,"Admixture Type F","Euclid Chemical - Cleveland, OH"]
["72602-01","EUCON WR (Type A)",42101,"Admixture Type A","Euclid Chemical - Cleveland, OH",null,null,null,null,null,null,"72602-01","EUCON WR",42101,"Admixture Type A","Euclid Chemical - Cleveland, OH"]
["72602-01","EUCON SE (Type A)",42101,"Admixture Type A","Euclid Chemical - Cleveland, OH",null,null,null,null,null,null,"72602-01","EUCON SE",42101,"Admixture Type A","Euclid Chemical - Cleveland, OH"]
["72602-01","EUCON WR-91 (Type A)",42101,"Admixture Type A","Euclid Chemical - Cleveland, OH",null,null,null,null,null,null,"72602-01","EUCON WR-91",42101,"Admixture Type A","Euclid Chemical - Cleveland, OH"]
["72602-01","EUCON WR-75 (Type A)",42101,"Admixture Type A","Euclid Chemical - Cleveland, OH",null,null,null,null,null,null,"72602-01","EUCON WR-75",42101,"Admixture Type A","Euclid Chemical - Cleveland, OH"]
["72733-01","FR-1 (Type D)",42104,"Admixture Type D","Fritz-Pak Corporation - Mesquite, TX",null,null,null,null,null,null,"72733-01","FR-1",42104,"Admixture Type D","Fritz-Pak Corporation - Mesquite, TX"]
["72733-01","FRITZ-PAK NCA (Type C)",42103,"Admixture Type C","Fritz-Pak Corporation - Mesquite, TX",null,null,null,null,null,null,"72733-01","FRITZ-PAK NCA",42103,"Admixture Type C","Fritz-Pak Corporation - Mesquite, TX"]
["72733-01","FRITZ-PAK NCA (Type E)",42105,"Admixture Type E","Fritz-Pak Corporation - Mesquite, TX",null,null,null,null,null,null,"72733-01","FRITZ-PAK NCA",42105,"Admixture Type E","Fritz-Pak Corporation - Mesquite, TX"]
["72733-01","FR-1 (Type B)",42102,"Admixture Type B","Fritz-Pak Corporation - Mesquite, TX",null,null,null,null,null,null,"72733-01","FR-1",42102,"Admixture Type B","Fritz-Pak Corporation - Mesquite, TX"]
["72733-01","AIR PLUS",42001,"Admixture, Air Entraining","Fritz-Pak Corporation - Mesquite, TX",null,null,null,null,null,null,"72733-01","AIR PLUS",42001,"Admixture, Air Entraining","Fritz-Pak Corporation - Mesquite, TX"]
["72733-01","SUPER AIR PLUS",42001,"Admixture, Air Entraining","Fritz-Pak Corporation - Mesquite, TX",null,null,null,null,null,null,"72733-01","SUPER AIR PLUS",42001,"Admixture, Air Entraining","Fritz-Pak Corporation - Mesquite, TX"]
["72733-01","DELAYED SET, STANDARD & MINI (Type D)",42104,"Admixture Type D","Fritz-Pak Corporation - Mesquite, TX",null,null,null,null,null,null,"72733-01","DELAYED SET, STANDARD & MINI",42104,"Admixture Type D","Fritz-Pak Corporation - Mesquite, TX"]
["72733-01","SUPERCIZER 7 (Type D)",42104,"Admixture Type D","Fritz-Pak Corporation - Mesquite, TX",null,null,null,null,null,null,"72733-01","SUPERCIZER 7",42104,"Admixture Type D","Fritz-Pak Corporation - Mesquite, TX"]
["72733-01","SUPERCIZER 5 (Type F)",42106,"Admixture Type F","Fritz-Pak Corporation - Mesquite, TX",null,null,null,null,null,null,"72733-01","SUPERCIZER 5",42106,"Admixture Type F","Fritz-Pak Corporation - Mesquite, TX"]
["72733-01","SUPERCIZER 7 (Type G)",42107,"Admixture Type G","Fritz-Pak Corporation - Mesquite, TX",null,null,null,null,null,null,"72733-01","SUPERCIZER 7",42107,"Admixture Type G","Fritz-Pak Corporation - Mesquite, TX"]
["72733-01","FR-1 (Type B,D)",42112,"Admixture Type B,D","Fritz-Pak Corporation - Mesquite, TX",null,null,null,null,null,null,"72733-01","FR-1",42112,"Admixture Type B,D","Fritz-Pak Corporation - Mesquite, TX"]
["72733-01","FRITZ-PAK NCA (Type C,E)",42113,"Admixture Type C,E","Fritz-Pak Corporation - Mesquite, TX",null,null,null,null,null,null,"72733-01","FRITZ-PAK NCA",42113,"Admixture Type C,E","Fritz-Pak Corporation - Mesquite, TX"]
["72603-01","MIRA 110 (Type F)",42106,"Admixture Type F","GCP Applied Technologies - Wilmington, MA",null,null,null,null,null,null,"72603-01","MIRA 110",42106,"Admixture Type F","GCP Applied Technologies - Wilmington, MA"]
["72603-01","ZYLA 640 (Type D)",42104,"Admixture Type D","GCP Applied Technologies - Wilmington, MA",null,null,null,null,null,null,"72603-01","ZYLA 640",42104,"Admixture Type D","GCP Applied Technologies - Wilmington, MA"]
["72603-01","DAREX AEA ED",42001,"Admixture, Air Entraining","GCP Applied Technologies - Wilmington, MA",null,null,null,null,null,null,"72603-01","DAREX AEA ED",42001,"Admixture, Air Entraining","GCP Applied Technologies - Wilmington, MA"]
["72603-01","Daravair AT60",42001,"Admixture, Air Entraining","GCP Applied Technologies - Wilmington, MA",null,null,null,null,null,null,"72603-01","Daravair AT60",42001,"Admixture, Air Entraining","GCP Applied Technologies - Wilmington, MA"]
["72603-01","Airalon 7000",42001,"Admixture, Air Entraining","GCP Applied Technologies - Wilmington, MA",null,null,null,null,null,null,"72603-01","Airalon 7000",42001,"Admixture, Air Entraining","GCP Applied Technologies - Wilmington, MA"]
["72603-01","Daravair 1000",42001,"Admixture, Air Entraining","GCP Applied Technologies - Wilmington, MA",null,null,null,null,null,null,"72603-01","Daravair 1000",42001,"Admixture, Air Entraining","GCP Applied Technologies - Wilmington, MA"]
["72603-01","Daravair 1400",42001,"Admixture, Air Entraining","GCP Applied Technologies - Wilmington, MA",null,null,null,null,null,null,"72603-01","Daravair 1400",42001,"Admixture, Air Entraining","GCP Applied Technologies - Wilmington, MA"]
["72603-01","Darex II AEA",42001,"Admixture, Air Entraining","GCP Applied Technologies - Wilmington, MA",null,null,null,null,null,null,"72603-01","Darex II AEA",42001,"Admixture, Air Entraining","GCP Applied Technologies - Wilmington, MA"]
["72603-01","TERAPAVE  AEA",42001,"Admixture, Air Entraining","GCP Applied Technologies - Wilmington, MA",null,null,null,null,null,null,"72603-01","TERAPAVE  AEA",42001,"Admixture, Air Entraining","GCP Applied Technologies - Wilmington, MA"]
["72603-01","MIRA 35 (Type A)",42101,"Admixture Type A","GCP Applied Technologies - Wilmington, MA",null,null,null,null,null,null,"72603-01","MIRA 35",42101,"Admixture Type A","GCP Applied Technologies - Wilmington, MA"]
["72603-01","WRDA 82 (Type A)",42101,"Admixture Type A","GCP Applied Technologies - Wilmington, MA",null,null,null,null,null,null,"72603-01","WRDA 82",42101,"Admixture Type A","GCP Applied Technologies - Wilmington, MA"]
["72603-01","WRDA with Hycol (Type A)",42101,"Admixture Type A","GCP Applied Technologies - Wilmington, MA",null,null,null,null,null,null,"72603-01","WRDA with Hycol",42101,"Admixture Type A","GCP Applied Technologies - Wilmington, MA"]
["72603-01","Daracem-55 (Type A)",42101,"Admixture Type A","GCP Applied Technologies - Wilmington, MA",null,null,null,null,null,null,"72603-01","Daracem-55",42101,"Admixture Type A","GCP Applied Technologies - Wilmington, MA"]
["72603-01","MIRA 110 (Type A)",42101,"Admixture Type A","GCP Applied Technologies - Wilmington, MA",null,null,null,null,null,null,"72603-01","MIRA 110",42101,"Admixture Type A","GCP Applied Technologies - Wilmington, MA"]
["72603-01","ZYLA 640 (Type A)",42101,"Admixture Type A","GCP Applied Technologies - Wilmington, MA",null,null,null,null,null,null,"72603-01","ZYLA 640",42101,"Admixture Type A","GCP Applied Technologies - Wilmington, MA"]
["72603-01","Concera CP1124 (Type A)",42101,"Admixture Type A","GCP Applied Technologies - Wilmington, MA",null,null,null,null,null,null,"72603-01","Concera CP1124",42101,"Admixture Type A","GCP Applied Technologies - Wilmington, MA"]
[{"$f":"L129","v":"72603-01"},{"$f":"IF(ISNUMBER(SEARCH(\"Liquid\",O129)),M129,IF(ISNUMBER(SEARCH(\"Self\",O129)),M129&\" (SCC)\",IF(ISNUMBER(SEARCH(\"Corrosion\",O129)),M129&\" (CI)\",IF(ISNUMBER(SEARCH(\"Type\",O129)),M129&\" (\"&REPLACE(O129,1,10,\"\")&\")\",M129))))","v":"ZYLA 630 (Type A)"},{"$f":"N129","v":42101},{"$f":"O129","v":"Admixture Type A"},{"$f":"IF(ISNUMBER(SEARCH(\"Lyndhurst\",P129)),\"Sika Corporation\",P129)","v":"GCP Applied Technologies - Wilmington, MA"},null,null,null,null,null,null,"72603-01","ZYLA 630",42101,"Admixture Type A","GCP Applied Technologies - Wilmington, MA"]
["72603-01","ADVA XT2 (Type A)",42101,"Admixture Type A","GCP Applied Technologies - Wilmington, MA",null,null,null,null,null,null,"72603-01","ADVA XT2",42101,"Admixture Type A","GCP Applied Technologies - Wilmington, MA"]
["72603-01","Polarset (Type C)",42103,"Admixture Type C","GCP Applied Technologies - Wilmington, MA",null,null,null,null,null,null,"72603-01","Polarset",42103,"Admixture Type C","GCP Applied Technologies - Wilmington, MA"]
["72603-01","Daraset 400 (Type C)",42103,"Admixture Type C","GCP Applied Technologies - Wilmington, MA",null,null,null,null,null,null,"72603-01","Daraset 400",42103,"Admixture Type C","GCP Applied Technologies - Wilmington, MA"]
["72603-01","Daratard 17 (Type D)",42104,"Admixture Type D","GCP Applied Technologies - Wilmington, MA",null,null,null,null,null,null,"72603-01","Daratard 17",42104,"Admixture Type D","GCP Applied Technologies - Wilmington, MA"]
["72603-01","*Daraccel (Type E)",42105,"Admixture Type E","GCP Applied Technologies - Wilmington, MA",null,null,null,null,null,null,"72603-01","*Daraccel",42105,"Admixture Type E","GCP Applied Technologies - Wilmington, MA"]
["72603-01","EXP 950 (Type F)",42106,"Admixture Type F","GCP Applied Technologies - Wilmington, MA",null,null,null,null,null,null,"72603-01","EXP 950",42106,"Admixture Type F","GCP Applied Technologies - Wilmington, MA"]
["72603-01","ADVA 140M (Type F)",42106,"Admixture Type F","GCP Applied Technologies - Wilmington, MA",null,null,null,null,null,null,"72603-01","ADVA 140M",42106,"Admixture Type F","GCP Applied Technologies - Wilmington, MA"]
["72603-01","ADVA Flex (Type F)",42106,"Admixture Type F","GCP Applied Technologies - Wilmington, MA",null,null,null,null,null,null,"72603-01","ADVA Flex",42106,"Admixture Type F","GCP Applied Technologies - Wilmington, MA"]
["72603-01","ADVA Cast 555 (Type F)",42106,"Admixture Type F","GCP Applied Technologies - Wilmington, MA",null,null,null,null,null,null,"72603-01","ADVA Cast 555",42106,"Admixture Type F","GCP Applied Technologies - Wilmington, MA"]
["72603-01","ADVA Cast 575 (Type F)",42106,"Admixture Type F","GCP Applied Technologies - Wilmington, MA",null,null,null,null,null,null,"72603-01","ADVA Cast 575",42106,"Admixture Type F","GCP Applied Technologies - Wilmington, MA"]
["72603-01","ADVA 190 (Type F)",42106,"Admixture Type F","GCP Applied Technologies - Wilmington, MA",null,null,null,null,null,null,"72603-01","ADVA 190",42106,"Admixture Type F","GCP Applied Technologies - Wilmington, MA"]
["72603-01","ADVA ITM 750 (Type F)",42106,"Admixture Type F","GCP Applied Technologies - Wilmington, MA",null,null,null,null,null,null,"72603-01","ADVA ITM 750",42106,"Admixture Type F","GCP Applied Technologies - Wilmington, MA"]
["72603-01","ADVA CAST 585 (Type F)",42106,"Admixture Type F","GCP Applied Technologies - Wilmington, MA",null,null,null,null,null,null,"72603-01","ADVA CAST 585",42106,"Admixture Type F","GCP Applied Technologies - Wilmington, MA"]
["72603-01","ADVA 405 (Type F)",42106,"Admixture Type F","GCP Applied Technologies - Wilmington, MA",null,null,null,null,null,null,"72603-01","ADVA 405",42106,"Admixture Type F","GCP Applied Technologies - Wilmington, MA"]
["72603-01","ADVA Cast 593 (Type F)",42106,"Admixture Type F","GCP Applied Technologies - Wilmington, MA",null,null,null,null,null,null,"72603-01","ADVA Cast 593",42106,"Admixture Type F","GCP Applied Technologies - Wilmington, MA"]
["72603-01","ADVA Cast 600 (Type F)",42106,"Admixture Type F","GCP Applied Technologies - Wilmington, MA",null,null,null,null,null,null,"72603-01","ADVA Cast 600",42106,"Admixture Type F","GCP Applied Technologies - Wilmington, MA"]
["72603-01","Concera SA8080 (Type F)",42106,"Admixture Type F","GCP Applied Technologies - Wilmington, MA",null,null,null,null,null,null,"72603-01","Concera SA8080",42106,"Admixture Type F","GCP Applied Technologies - Wilmington, MA"]
["72603-01","MIRA 95 (Type F)",42106,"Admixture Type F","GCP Applied Technologies - Wilmington, MA",null,null,null,null,null,null,"72603-01","MIRA 95",42106,"Admixture Type F","GCP Applied Technologies - Wilmington, MA"]
["72603-01","WRDA 20 (Type A,D)",42109,"Admixture Type A,D","GCP Applied Technologies - Wilmington, MA",null,null,null,null,null,null,"72603-01","WRDA 20",42109,"Admixture Type A,D","GCP Applied Technologies - Wilmington, MA"]
["72603-01","Daracem 19 (Type A,F)",42110,"Admixture Type A,F","GCP Applied Technologies - Wilmington, MA",null,null,null,null,null,null,"72603-01","Daracem 19",42110,"Admixture Type A,F","GCP Applied Technologies - Wilmington, MA"]
["72603-01","MIRA 62 (Type A,F)",42110,"Admixture Type A,F","GCP Applied Technologies - Wilmington, MA",null,null,null,null,null,null,"72603-01","MIRA 62",42110,"Admixture Type A,F","GCP Applied Technologies - Wilmington, MA"]
["72603-01","ADVA 195 (Type A,F)",42110,"Admixture Type A,F","GCP Applied Technologies - Wilmington, MA",null,null,null,null,null,null,"72603-01","ADVA 195",42110,"Admixture Type A,F","GCP Applied Technologies - Wilmington, MA"]
["72603-01","Elara® SP200 (Type A,F)",42110,"Admixture Type A,F","GCP Applied Technologies - Wilmington, MA",null,null,null,null,null,null,"72603-01","Elara® SP200",42110,"Admixture Type A,F","GCP Applied Technologies - Wilmington, MA"]
["72603-01","CLARENA MC2000 (Type A,F)",42110,"Admixture Type A,F","GCP Applied Technologies - Wilmington, MA",null,null,null,null,null,null,"72603-01","CLARENA MC2000",42110,"Admixture Type A,F","GCP Applied Technologies - Wilmington, MA"]
["72603-01","ADVA 150M (Type A,F)",42110,"Admixture Type A,F","GCP Applied Technologies - Wilmington, MA",null,null,null,null,null,null,"72603-01","ADVA 150M",42110,"Admixture Type A,F","GCP Applied Technologies - Wilmington, MA"]
["72603-01","ADVA 198 (Type A,F)",42110,"Admixture Type A,F","GCP Applied Technologies - Wilmington, MA",null,null,null,null,null,null,"72603-01","ADVA 198",42110,"Admixture Type A,F","GCP Applied Technologies - Wilmington, MA"]
["72603-01","Recover (Type B,D)",42112,"Admixture Type B,D","GCP Applied Technologies - Wilmington, MA",null,null,null,null,null,null,"72603-01","Recover",42112,"Admixture Type B,D","GCP Applied Technologies - Wilmington, MA"]
["72603-01","ZYLA R (Type B,D)",42112,"Admixture Type B,D","GCP Applied Technologies - Wilmington, MA",null,null,null,null,null,null,"72603-01","ZYLA R",42112,"Admixture Type B,D","GCP Applied Technologies - Wilmington, MA"]
["72603-01","ADVA 405 (SCC)",42117,"Admixture Self Compacting Concrete","GCP Applied Technologies - Wilmington, MA",null,null,null,null,null,null,"72603-01","ADVA 405",42117,"Admixture Self Compacting Concrete","GCP Applied Technologies - Wilmington, MA"]
["72603-01","DCI-S (CI)",43301,"Admixture Corrosion Inhibitor","GCP Applied Technologies - Wilmington, MA",null,null,null,null,null,null,"72603-01","DCI-S",43301,"Admixture Corrosion Inhibitor","GCP Applied Technologies - Wilmington, MA"]
["72603-01","DCI (CI)",43301,"Admixture Corrosion Inhibitor","GCP Applied Technologies - Wilmington, MA",null,null,null,null,null,null,"72603-01","DCI",43301,"Admixture Corrosion Inhibitor","GCP Applied Technologies - Wilmington, MA"]
["72603-01","Quantec PL-490",42001,"Admixture, Air Entraining","GCP Applied Technologies - Wilmington, MA",null,null,null,null,null,null,"72603-01","Quantec PL-490",42001,"Admixture, Air Entraining","GCP Applied Technologies - Wilmington, MA"]
["72603-01","ZYLA R (Type B)",42102,"Admixture Type B","GCP Applied Technologies - Wilmington, MA",null,null,null,null,null,null,"72603-01","ZYLA R",42102,"Admixture Type B","GCP Applied Technologies - Wilmington, MA"]
["72603-01","Recover (Type B)",42102,"Admixture Type B","GCP Applied Technologies - Wilmington, MA",null,null,null,null,null,null,"72603-01","Recover",42102,"Admixture Type B","GCP Applied Technologies - Wilmington, MA"]
["72603-01","ADVA 195 (Type A)",42101,"Admixture Type A","GCP Applied Technologies - Wilmington, MA",null,null,null,null,null,null,"72603-01","ADVA 195",42101,"Admixture Type A","GCP Applied Technologies - Wilmington, MA"]
["72603-01","ADVA 195 (Type F)",42106,"Admixture Type F","GCP Applied Technologies - Wilmington, MA",null,null,null,null,null,null,"72603-01","ADVA 195",42106,"Admixture Type F","GCP Applied Technologies - Wilmington, MA"]
["72603-01","ADVA 150M (Type A)",42101,"Admixture Type A","GCP Applied Technologies - Wilmington, MA",null,null,null,null,null,null,"72603-01","ADVA 150M",42101,"Admixture Type A","GCP Applied Technologies - Wilmington, MA"]
["72603-01","ADVA 150M (Type F)",42106,"Admixture Type F","GCP Applied Technologies - Wilmington, MA",null,null,null,null,null,null,"72603-01","ADVA 150M",42106,"Admixture Type F","GCP Applied Technologies - Wilmington, MA"]
["72603-01","ADVA 198 (Type A)",42101,"Admixture Type A","GCP Applied Technologies - Wilmington, MA",null,null,null,null,null,null,"72603-01","ADVA 198",42101,"Admixture Type A","GCP Applied Technologies - Wilmington, MA"]
["72603-01","ADVA 198 (Type F)",42106,"Admixture Type F","GCP Applied Technologies - Wilmington, MA",null,null,null,null,null,null,"72603-01","ADVA 198",42106,"Admixture Type F","GCP Applied Technologies - Wilmington, MA"]
["72603-01","MIRA 62 (Type A)",42101,"Admixture Type A","GCP Applied Technologies - Wilmington, MA",null,null,null,null,null,null,"72603-01","MIRA 62",42101,"Admixture Type A","GCP Applied Technologies - Wilmington, MA"]
["72603-01","MIRA 62 (Type F)",42106,"Admixture Type F","GCP Applied Technologies - Wilmington, MA",null,null,null,null,null,null,"72603-01","MIRA 62",42106,"Admixture Type F","GCP Applied Technologies - Wilmington, MA"]
["72603-01","CLARENA MC2000 (Type A)",42101,"Admixture Type A","GCP Applied Technologies - Wilmington, MA",null,null,null,null,null,null,"72603-01","CLARENA MC2000",42101,"Admixture Type A","GCP Applied Technologies - Wilmington, MA"]
["72603-01","CLARENA MC2000 (Type F)",42106,"Admixture Type F","GCP Applied Technologies - Wilmington, MA",null,null,null,null,null,null,"72603-01","CLARENA MC2000",42106,"Admixture Type F","GCP Applied Technologies - Wilmington, MA"]
["72603-01","Elara? SP200 (Type A)",42101,"Admixture Type A","GCP Applied Technologies - Wilmington, MA",null,null,null,null,null,null,"72603-01","Elara? SP200",42101,"Admixture Type A","GCP Applied Technologies - Wilmington, MA"]
["72603-01","Elara? SP200 (Type F)",42106,"Admixture Type F","GCP Applied Technologies - Wilmington, MA",null,null,null,null,null,null,"72603-01","Elara? SP200",42106,"Admixture Type F","GCP Applied Technologies - Wilmington, MA"]
["72603-01","Daracem 19 (Type A)",42101,"Admixture Type A","GCP Applied Technologies - Wilmington, MA",null,null,null,null,null,null,"72603-01","Daracem 19",42101,"Admixture Type A","GCP Applied Technologies - Wilmington, MA"]
["72603-01","Daracem 19 (Type F)",42106,"Admixture Type F","GCP Applied Technologies - Wilmington, MA",null,null,null,null,null,null,"72603-01","Daracem 19",42106,"Admixture Type F","GCP Applied Technologies - Wilmington, MA"]
["72603-01","ZYLA R (Type D)",42104,"Admixture Type D","GCP Applied Technologies - Wilmington, MA",null,null,null,null,null,null,"72603-01","ZYLA R",42104,"Admixture Type D","GCP Applied Technologies - Wilmington, MA"]
["72603-01","Recover (Type D)",42104,"Admixture Type D","GCP Applied Technologies - Wilmington, MA",null,null,null,null,null,null,"72603-01","Recover",42104,"Admixture Type D","GCP Applied Technologies - Wilmington, MA"]
["72603-01","WRDA 20 (Type A)",42101,"Admixture Type A","GCP Applied Technologies - Wilmington, MA",null,null,null,null,null,null,"72603-01","WRDA 20",42101,"Admixture Type A","GCP Applied Technologies - Wilmington, MA"]
["72603-01","WRDA 20 (Type D)",42104,"Admixture Type D","GCP Applied Technologies - Wilmington, MA",null,null,null,null,null,null,"72603-01","WRDA 20",42104,"Admixture Type D","GCP Applied Technologies - Wilmington, MA"]
["72740-01","HYCRETE X1000 (CI)",43301,"Admixture Corrosion Inhibitor","Hycrete Tech",null,null,null,null,null,null,"72740-01","HYCRETE X1000",43301,"Admixture Corrosion Inhibitor","Hycrete Tech"]
["72742-01","IPANEX",42116,"Admixture Waterproofing","Ipa Systems",null,null,null,null,null,null,"72742-01","IPANEX",42116,"Admixture Waterproofing","Ipa Systems"]
["72808-01","KreteAir 800",42001,"Admixture, Air Entraining","Krete Industries - Brookfield, WI",null,null,null,null,null,null,"72808-01","KreteAir 800",42001,"Admixture, Air Entraining","Krete Industries - Brookfield, WI"]
["72808-01","KreteAir 850",42001,"Admixture, Air Entraining","Krete Industries - Brookfield, WI",null,null,null,null,null,null,"72808-01","KreteAir 850",42001,"Admixture, Air Entraining","Krete Industries - Brookfield, WI"]
["72808-01","KreteDcel 20 (Type B,D)",42112,"Admixture Type B,D","Krete Industries - Brookfield, WI",null,null,null,null,null,null,"72808-01","KreteDcel 20",42112,"Admixture Type B,D","Krete Industries - Brookfield, WI"]
["72808-01","KreteDcel 20 (Type B)",42102,"Admixture Type B","Krete Industries - Brookfield, WI",null,null,null,null,null,null,"72808-01","KreteDcel 20",42102,"Admixture Type B","Krete Industries - Brookfield, WI"]
["72808-01","KreteDcel 20 (Type D)",42104,"Admixture Type D","Krete Industries - Brookfield, WI",null,null,null,null,null,null,"72808-01","KreteDcel 20",42104,"Admixture Type D","Krete Industries - Brookfield, WI"]
["72808-01","KreteSuperPlast 700 (Type A,F)",42110,"Admixture Type A,F","Krete Industries - Brookfield, WI",null,null,null,null,null,null,"72808-01","KreteSuperPlast 700",42110,"Admixture Type A,F","Krete Industries - Brookfield, WI"]
["72808-01","KreteSuperPlast 700 (Type A)",42101,"Admixture Type A","Krete Industries - Brookfield, WI",null,null,null,null,null,null,"72808-01","KreteSuperPlast 700",42101,"Admixture Type A","Krete Industries - Brookfield, WI"]
["72808-01","KreteSuperPlast 700 (Type F)",42106,"Admixture Type F","Krete Industries - Brookfield, WI",null,null,null,null,null,null,"72808-01","KreteSuperPlast 700",42106,"Admixture Type F","Krete Industries - Brookfield, WI"]
["72735-01","MAPEFAST SUPER SET II (Type C,E)",42113,"Admixture Type C,E","MAPEI Corporation - Deerfield Beach, FL",null,null,null,null,null,null,"72735-01","MAPEFAST SUPER SET II",42113,"Admixture Type C,E","MAPEI Corporation - Deerfield Beach, FL"]
[{"$f":"L193","v":"72735-01"},{"$f":"IF(ISNUMBER(SEARCH(\"Liquid\",O193)),M193,IF(ISNUMBER(SEARCH(\"Self\",O193)),M193&\" (SCC)\",IF(ISNUMBER(SEARCH(\"Corrosion\",O193)),M193&\" (CI)\",IF(ISNUMBER(SEARCH(\"Type\",O193)),M193&\" (\"&REPLACE(O193,1,10,\"\")&\")\",M193))))","v":"MAPEPLAST N (Type A,D)"},{"$f":"N193","v":42109},{"$f":"O193","v":"Admixture Type A,D"},{"$f":"IF(ISNUMBER(SEARCH(\"Lyndhurst\",P193)),\"Sika Corporation\",P193)","v":"MAPEI Corporation - Deerfield Beach, FL"},null,null,null,null,null,null,"72735-01","MAPEPLAST N",42109,"Admixture Type A,D","MAPEI Corporation - Deerfield Beach, FL"]
["72735-01","POLYCHEM RENU (Type B,D)",42112,"Admixture Type B,D","MAPEI Corporation - Deerfield Beach, FL",null,null,null,null,null,null,"72735-01","POLYCHEM RENU",42112,"Admixture Type B,D","MAPEI Corporation - Deerfield Beach, FL"]
["72735-01","MAPEFAST SUPER SET II (Type E)",42105,"Admixture Type E","MAPEI Corporation - Deerfield Beach, FL",null,null,null,null,null,null,"72735-01","MAPEFAST SUPER SET II",42105,"Admixture Type E","MAPEI Corporation - Deerfield Beach, FL"]
["72735-01","POLYCHEM RENU (Type B)",42102,"Admixture Type B","MAPEI Corporation - Deerfield Beach, FL",null,null,null,null,null,null,"72735-01","POLYCHEM RENU",42102,"Admixture Type B","MAPEI Corporation - Deerfield Beach, FL"]
["72735-01","DYNAMON SX (Type A)",42101,"Admixture Type A","MAPEI Corporation - Deerfield Beach, FL",null,null,null,null,null,null,"72735-01","DYNAMON SX",42101,"Admixture Type A","MAPEI Corporation - Deerfield Beach, FL"]
["72735-01","DYNAMON SX (Type F)",42106,"Admixture Type F","MAPEI Corporation - Deerfield Beach, FL",null,null,null,null,null,null,"72735-01","DYNAMON SX",42106,"Admixture Type F","MAPEI Corporation - Deerfield Beach, FL"]
["72735-01","MAPEFLUID N 200 (Type A)",42101,"Admixture Type A","MAPEI Corporation - Deerfield Beach, FL",null,null,null,null,null,null,"72735-01","MAPEFLUID N 200",42101,"Admixture Type A","MAPEI Corporation - Deerfield Beach, FL"]
["72735-01","MAPEFLUID N 200 (Type F)",42106,"Admixture Type F","MAPEI Corporation - Deerfield Beach, FL",null,null,null,null,null,null,"72735-01","MAPEFLUID N 200",42106,"Admixture Type F","MAPEI Corporation - Deerfield Beach, FL"]
["72735-01","POLYCHEM SPC (Type A)",42101,"Admixture Type A","MAPEI Corporation - Deerfield Beach, FL",null,null,null,null,null,null,"72735-01","POLYCHEM SPC",42101,"Admixture Type A","MAPEI Corporation - Deerfield Beach, FL"]
["72735-01","POLYCHEM SPC (Type F)",42106,"Admixture Type F","MAPEI Corporation - Deerfield Beach, FL",null,null,null,null,null,null,"72735-01","POLYCHEM SPC",42106,"Admixture Type F","MAPEI Corporation - Deerfield Beach, FL"]
["72735-01","DYNAMON NRG 1092 (Type A)",42101,"Admixture Type A","MAPEI Corporation - Deerfield Beach, FL",null,null,null,null,null,null,"72735-01","DYNAMON NRG 1092",42101,"Admixture Type A","MAPEI Corporation - Deerfield Beach, FL"]
["72735-01","DYNAMON NRG 1092 (Type F)",42106,"Admixture Type F","MAPEI Corporation - Deerfield Beach, FL",null,null,null,null,null,null,"72735-01","DYNAMON NRG 1092",42106,"Admixture Type F","MAPEI Corporation - Deerfield Beach, FL"]
["72735-01","DYNAMON NRG 546 (Type A)",42101,"Admixture Type A","MAPEI Corporation - Deerfield Beach, FL",null,null,null,null,null,null,"72735-01","DYNAMON NRG 546",42101,"Admixture Type A","MAPEI Corporation - Deerfield Beach, FL"]
["72735-01","DYNAMON NRG 546 (Type F)",42106,"Admixture Type F","MAPEI Corporation - Deerfield Beach, FL",null,null,null,null,null,null,"72735-01","DYNAMON NRG 546",42106,"Admixture Type F","MAPEI Corporation - Deerfield Beach, FL"]
["72735-01","MAPEFAST SUPER SET II (Type C)",42103,"Admixture Type C","MAPEI Corporation - Deerfield Beach, FL",null,null,null,null,null,null,"72735-01","MAPEFAST SUPER SET II",42103,"Admixture Type C","MAPEI Corporation - Deerfield Beach, FL"]
["72735-01","POLYCHEM RENU (Type D)",42104,"Admixture Type D","MAPEI Corporation - Deerfield Beach, FL",null,null,null,null,null,null,"72735-01","POLYCHEM RENU",42104,"Admixture Type D","MAPEI Corporation - Deerfield Beach, FL"]
["72735-01","MAPEPLAST N (Type A)",42101,"Admixture Type A","MAPEI Corporation - Deerfield Beach, FL",null,null,null,null,null,null,"72735-01","MAPEPLAST N",42101,"Admixture Type A","MAPEI Corporation - Deerfield Beach, FL"]
["72735-01","MAPEPLAST N (Type D)",42104,"Admixture Type D","MAPEI Corporation - Deerfield Beach, FL",null,null,null,null,null,null,"72735-01","MAPEPLAST N",42104,"Admixture Type D","MAPEI Corporation - Deerfield Beach, FL"]
["72735-01","Mapeair VR",42001,"Admixture, Air Entraining","MAPEI Corporation - Deerfield Beach, FL",null,null,null,null,null,null,"72735-01","Mapeair VR",42001,"Admixture, Air Entraining","MAPEI Corporation - Deerfield Beach, FL"]
["72735-01","Mapeair SA",42001,"Admixture, Air Entraining","MAPEI Corporation - Deerfield Beach, FL",null,null,null,null,null,null,"72735-01","Mapeair SA",42001,"Admixture, Air Entraining","MAPEI Corporation - Deerfield Beach, FL"]
["72735-01","POLYCHEM AE",42001,"Admixture, Air Entraining","MAPEI Corporation - Deerfield Beach, FL",null,null,null,null,null,null,"72735-01","POLYCHEM AE",42001,"Admixture, Air Entraining","MAPEI Corporation - Deerfield Beach, FL"]
["72735-01","Mapeair SA-50",42001,"Admixture, Air Entraining","MAPEI Corporation - Deerfield Beach, FL",null,null,null,null,null,null,"72735-01","Mapeair SA-50",42001,"Admixture, Air Entraining","MAPEI Corporation - Deerfield Beach, FL"]
["72735-01","MAPEFAST SUPER SET PLUS (Type C)",42103,"Admixture Type C","MAPEI Corporation - Deerfield Beach, FL",null,null,null,null,null,null,"72735-01","MAPEFAST SUPER SET PLUS",42103,"Admixture Type C","MAPEI Corporation - Deerfield Beach, FL"]
["72735-01","Mapefast Super Set (Type C)",42103,"Admixture Type C","MAPEI Corporation - Deerfield Beach, FL",null,null,null,null,null,null,"72735-01","Mapefast Super Set",42103,"Admixture Type C","MAPEI Corporation - Deerfield Beach, FL"]
["72735-01","Mapetard R (Type D)",42104,"Admixture Type D","MAPEI Corporation - Deerfield Beach, FL",null,null,null,null,null,null,"72735-01","Mapetard R",42104,"Admixture Type D","MAPEI Corporation - Deerfield Beach, FL"]
["72735-01","DYNAMON SX (Type A,F)",42110,"Admixture Type A,F","MAPEI Corporation - Deerfield Beach, FL",null,null,null,null,null,null,"72735-01","DYNAMON SX",42110,"Admixture Type A,F","MAPEI Corporation - Deerfield Beach, FL"]
["72735-01","MAPEFLUID N 200 (Type A,F)",42110,"Admixture Type A,F","MAPEI Corporation - Deerfield Beach, FL",null,null,null,null,null,null,"72735-01","MAPEFLUID N 200",42110,"Admixture Type A,F","MAPEI Corporation - Deerfield Beach, FL"]
["72735-01","DYNAMON NRG 546 (Type A,F)",42110,"Admixture Type A,F","MAPEI Corporation - Deerfield Beach, FL",null,null,null,null,null,null,"72735-01","DYNAMON NRG 546",42110,"Admixture Type A,F","MAPEI Corporation - Deerfield Beach, FL"]
["72735-01","POLYCHEM SPC (Type A,F)",42110,"Admixture Type A,F","MAPEI Corporation - Deerfield Beach, FL",null,null,null,null,null,null,"72735-01","POLYCHEM SPC",42110,"Admixture Type A,F","MAPEI Corporation - Deerfield Beach, FL"]
["72735-01","DYNAMON NRG 1092 (Type A,F)",42110,"Admixture Type A,F","MAPEI Corporation - Deerfield Beach, FL",null,null,null,null,null,null,"72735-01","DYNAMON NRG 1092",42110,"Admixture Type A,F","MAPEI Corporation - Deerfield Beach, FL"]
["72735-01","DYNAMON SX (SCC)",42117,"Admixture Self Compacting Concrete","MAPEI Corporation - Deerfield Beach, FL",null,null,null,null,null,null,"72735-01","DYNAMON SX",42117,"Admixture Self Compacting Concrete","MAPEI Corporation - Deerfield Beach, FL"]
["72735-01","DYNAMON NRG 1092 (SCC)",42117,"Admixture Self Compacting Concrete","MAPEI Corporation - Deerfield Beach, FL",null,null,null,null,null,null,"72735-01","DYNAMON NRG 1092",42117,"Admixture Self Compacting Concrete","MAPEI Corporation - Deerfield Beach, FL"]
["72735-01","DYNAMON NRG 546 (SCC)",42117,"Admixture Self Compacting Concrete","MAPEI Corporation - Deerfield Beach, FL",null,null,null,null,null,null,"72735-01","DYNAMON NRG 546",42117,"Admixture Self Compacting Concrete","MAPEI Corporation - Deerfield Beach, FL"]
["72735-01","POLYCHEM SPC (SCC)",42117,"Admixture Self Compacting Concrete","MAPEI Corporation - Deerfield Beach, FL",null,null,null,null,null,null,"72735-01","POLYCHEM SPC",42117,"Admixture Self Compacting Concrete","MAPEI Corporation - Deerfield Beach, FL"]
["72735-01","Mapeshield CI 300 (CI)",43301,"Admixture Corrosion Inhibitor","MAPEI Corporation - Deerfield Beach, FL",null,null,null,null,null,null,"72735-01","Mapeshield CI 300",43301,"Admixture Corrosion Inhibitor","MAPEI Corporation - Deerfield Beach, FL"]
["72735-01","Dynamon 850 (Type A)",42101,"Admixture Type A","MAPEI Corporation - Deerfield Beach, FL",null,null,null,null,null,null,"72735-01","Dynamon 850",42101,"Admixture Type A","MAPEI Corporation - Deerfield Beach, FL"]
["72735-01","Mapeplast KB-1200 (Type A)",42101,"Admixture Type A","MAPEI Corporation - Deerfield Beach, FL",null,null,null,null,null,null,"72735-01","Mapeplast KB-1200",42101,"Admixture Type A","MAPEI Corporation - Deerfield Beach, FL"]
["72735-01","Mapeplast 400 NC (Type A)",42101,"Admixture Type A","MAPEI Corporation - Deerfield Beach, FL",null,null,null,null,null,null,"72735-01","Mapeplast 400 NC",42101,"Admixture Type A","MAPEI Corporation - Deerfield Beach, FL"]
["72735-01","DYNAMON SX 37 (Type F)",42106,"Admixture Type F","MAPEI Corporation - Deerfield Beach, FL",null,null,null,null,null,null,"72735-01","DYNAMON SX 37",42106,"Admixture Type F","MAPEI Corporation - Deerfield Beach, FL"]
["72600-01","MASTERPOZZOLITH 322 (Type A)",42101,"Admixture Type A","Master Builders Solutions Admix - Cleveland, OH",null,null,null,null,null,null,"72600-01","MASTERPOZZOLITH 322",42101,"Admixture Type A","Master Builders Solutions Admix - Cleveland, OH"]
["72600-01","MASTERPOLYHEED 900 (Type A)",42101,"Admixture Type A","Master Builders Solutions Admix - Cleveland, OH",null,null,null,null,null,null,"72600-01","MASTERPOLYHEED 900",42101,"Admixture Type A","Master Builders Solutions Admix - Cleveland, OH"]
["72600-01","MASTER X-SEED® 66 (Type A)",42101,"Admixture Type A","Master Builders Solutions Admix - Cleveland, OH",null,null,null,null,null,null,"72600-01","MASTER X-SEED® 66",42101,"Admixture Type A","Master Builders Solutions Admix - Cleveland, OH"]
["72600-01","MASTERPOZZOLITH 200 (Type A,B,D)",42108,"Admixture Type A,B,D","Master Builders Solutions Admix - Cleveland, OH",null,null,null,null,null,null,"72600-01","MASTERPOZZOLITH 200",42108,"Admixture Type A,B,D","Master Builders Solutions Admix - Cleveland, OH"]
["72600-01","MASTERPOZZOLITH 80 (Type A,B,D)",42108,"Admixture Type A,B,D","Master Builders Solutions Admix - Cleveland, OH",null,null,null,null,null,null,"72600-01","MASTERPOZZOLITH 80",42108,"Admixture Type A,B,D","Master Builders Solutions Admix - Cleveland, OH"]
["72600-01","MASTERPOZZOLITH 700 (Type A,B,D)",42108,"Admixture Type A,B,D","Master Builders Solutions Admix - Cleveland, OH",null,null,null,null,null,null,"72600-01","MASTERPOZZOLITH 700",42108,"Admixture Type A,B,D","Master Builders Solutions Admix - Cleveland, OH"]
["72600-01","MASTERSET R 100 (Type B,D)",42112,"Admixture Type B,D","Master Builders Solutions Admix - Cleveland, OH",null,null,null,null,null,null,"72600-01","MASTERSET R 100",42112,"Admixture Type B,D","Master Builders Solutions Admix - Cleveland, OH"]
["72600-01","MASTERSET R 961 (Type B,D)",42112,"Admixture Type B,D","Master Builders Solutions Admix - Cleveland, OH",null,null,null,null,null,null,"72600-01","MASTERSET R 961",42112,"Admixture Type B,D","Master Builders Solutions Admix - Cleveland, OH"]
["72600-01","MASTERSET DELVO (Type B,D)",42112,"Admixture Type B,D","Master Builders Solutions Admix - Cleveland, OH",null,null,null,null,null,null,"72600-01","MASTERSET DELVO",42112,"Admixture Type B,D","Master Builders Solutions Admix - Cleveland, OH"]
["72600-01","MASTERSET R 300 (Type B,D)",42112,"Admixture Type B,D","Master Builders Solutions Admix - Cleveland, OH",null,null,null,null,null,null,"72600-01","MASTERSET R 300",42112,"Admixture Type B,D","Master Builders Solutions Admix - Cleveland, OH"]
["72600-01","MASTERGLENIUM 7500 (SCC)",42117,"Admixture Self Compacting Concrete","Master Builders Solutions Admix - Cleveland, OH",null,null,null,null,null,null,"72600-01","MASTERGLENIUM 7500",42117,"Admixture Self Compacting Concrete","Master Builders Solutions Admix - Cleveland, OH"]
["72600-01","MASTERGLENIUM 3030 (SCC)",42117,"Admixture Self Compacting Concrete","Master Builders Solutions Admix - Cleveland, OH",null,null,null,null,null,null,"72600-01","MASTERGLENIUM 3030",42117,"Admixture Self Compacting Concrete","Master Builders Solutions Admix - Cleveland, OH"]
["72600-01","MASTERGLENIUM 7920 (SCC)",42117,"Admixture Self Compacting Concrete","Master Builders Solutions Admix - Cleveland, OH",null,null,null,null,null,null,"72600-01","MASTERGLENIUM 7920",42117,"Admixture Self Compacting Concrete","Master Builders Solutions Admix - Cleveland, OH"]
["72600-01","MASTERGLENIUM 7925 (SCC)",42117,"Admixture Self Compacting Concrete","Master Builders Solutions Admix - Cleveland, OH",null,null,null,null,null,null,"72600-01","MASTERGLENIUM 7925",42117,"Admixture Self Compacting Concrete","Master Builders Solutions Admix - Cleveland, OH"]
["72600-01","MASTERCELL 25",42001,"Admixture, Air Entraining","Master Builders Solutions Admix - Cleveland, OH",null,null,null,null,null,null,"72600-01","MASTERCELL 25",42001,"Admixture, Air Entraining","Master Builders Solutions Admix - Cleveland, OH"]
["72600-01","MASTERAIR AE 400",42001,"Admixture, Air Entraining","Master Builders Solutions Admix - Cleveland, OH",null,null,null,null,null,null,"72600-01","MASTERAIR AE 400",42001,"Admixture, Air Entraining","Master Builders Solutions Admix - Cleveland, OH"]
["72600-01","MASTERAIR AE 200",42001,"Admixture, Air Entraining","Master Builders Solutions Admix - Cleveland, OH",null,null,null,null,null,null,"72600-01","MASTERAIR AE 200",42001,"Admixture, Air Entraining","Master Builders Solutions Admix - Cleveland, OH"]
["72600-01","MASTERAIR VR 10",42001,"Admixture, Air Entraining","Master Builders Solutions Admix - Cleveland, OH",null,null,null,null,null,null,"72600-01","MASTERAIR VR 10",42001,"Admixture, Air Entraining","Master Builders Solutions Admix - Cleveland, OH"]
["72600-01","MASTERAIR VR 20",42001,"Admixture, Air Entraining","Master Builders Solutions Admix - Cleveland, OH",null,null,null,null,null,null,"72600-01","MASTERAIR VR 20",42001,"Admixture, Air Entraining","Master Builders Solutions Admix - Cleveland, OH"]
["72600-01","MASTER AIR AE 90",42001,"Admixture, Air Entraining","Master Builders Solutions Admix - Cleveland, OH",null,null,null,null,null,null,"72600-01","MASTER AIR AE 90",42001,"Admixture, Air Entraining","Master Builders Solutions Admix - Cleveland, OH"]
["72600-01","MASTERSET AC 534 (Type C)",42103,"Admixture Type C","Master Builders Solutions Admix - Cleveland, OH",null,null,null,null,null,null,"72600-01","MASTERSET AC 534",42103,"Admixture Type C","Master Builders Solutions Admix - Cleveland, OH"]
["72600-01","MASTERRHEOBUILD 1000 (Type F)",42106,"Admixture Type F","Master Builders Solutions Admix - Cleveland, OH",null,null,null,null,null,null,"72600-01","MASTERRHEOBUILD 1000",42106,"Admixture Type F","Master Builders Solutions Admix - Cleveland, OH"]
["72600-01","MASTERGLENIUM 3400 (Type F)",42106,"Admixture Type F","Master Builders Solutions Admix - Cleveland, OH",null,null,null,null,null,null,"72600-01","MASTERGLENIUM 3400",42106,"Admixture Type F","Master Builders Solutions Admix - Cleveland, OH"]
["72600-01","MASTERGLENIUM 7700 (Type F)",42106,"Admixture Type F","Master Builders Solutions Admix - Cleveland, OH",null,null,null,null,null,null,"72600-01","MASTERGLENIUM 7700",42106,"Admixture Type F","Master Builders Solutions Admix - Cleveland, OH"]
["72600-01","MASTERGLENIUM 7710 (Type F)",42106,"Admixture Type F","Master Builders Solutions Admix - Cleveland, OH",null,null,null,null,null,null,"72600-01","MASTERGLENIUM 7710",42106,"Admixture Type F","Master Builders Solutions Admix - Cleveland, OH"]
[{"$f":"L257","v":"72600-01"},{"$f":"IF(ISNUMBER(SEARCH(\"Liquid\",O257)),M257,IF(ISNUMBER(SEARCH(\"Self\",O257)),M257&\" (SCC)\",IF(ISNUMBER(SEARCH(\"Corrosion\",O257)),M257&\" (CI)\",IF(ISNUMBER(SEARCH(\"Type\",O257)),M257&\" (\"&REPLACE(O257,1,10,\"\")&\")\",M257))))","v":"MASTERPOLYHEED 1020 (Type A,F)"},{"$f":"N257","v":42110},{"$f":"O257","v":"Admixture Type A,F"},{"$f":"IF(ISNUMBER(SEARCH(\"Lyndhurst\",P257)),\"Sika Corporation\",P257)","v":"Master Builders Solutions Admix - Cleveland, OH"},null,null,null,null,null,null,"72600-01","MASTERPOLYHEED 1020",42110,"Admixture Type A,F","Master Builders Solutions Admix - Cleveland, OH"]
["72600-01","MASTERGLENIUM 1466 (Type A,F)",42110,"Admixture Type A,F","Master Builders Solutions Admix - Cleveland, OH",null,null,null,null,null,null,"72600-01","MASTERGLENIUM 1466",42110,"Admixture Type A,F","Master Builders Solutions Admix - Cleveland, OH"]
["72600-01","MASTERGLENIUM 7720 (Type A,F)",42110,"Admixture Type A,F","Master Builders Solutions Admix - Cleveland, OH",null,null,null,null,null,null,"72600-01","MASTERGLENIUM 7720",42110,"Admixture Type A,F","Master Builders Solutions Admix - Cleveland, OH"]
["72600-01","MASTERPOLYHEED 1025 (Type A,F)",42110,"Admixture Type A,F","Master Builders Solutions Admix - Cleveland, OH",null,null,null,null,null,null,"72600-01","MASTERPOLYHEED 1025",42110,"Admixture Type A,F","Master Builders Solutions Admix - Cleveland, OH"]
["72600-01","MASTERGLENIUM 7925 (Type A,F)",42110,"Admixture Type A,F","Master Builders Solutions Admix - Cleveland, OH",null,null,null,null,null,null,"72600-01","MASTERGLENIUM 7925",42110,"Admixture Type A,F","Master Builders Solutions Admix - Cleveland, OH"]
["72600-01","MASTERGLENIUM 3030 (Type A,F)",42110,"Admixture Type A,F","Master Builders Solutions Admix - Cleveland, OH",null,null,null,null,null,null,"72600-01","MASTERGLENIUM 3030",42110,"Admixture Type A,F","Master Builders Solutions Admix - Cleveland, OH"]
["72600-01","MASTERGLENIUM 7920 (Type A,F)",42110,"Admixture Type A,F","Master Builders Solutions Admix - Cleveland, OH",null,null,null,null,null,null,"72600-01","MASTERGLENIUM 7920",42110,"Admixture Type A,F","Master Builders Solutions Admix - Cleveland, OH"]
[{"$f":"L264","v":"72600-01"},"MASTERPOLYHEED 997 (Type A,F)",{"$f":"N264","v":42110},{"$f":"O264","v":"Admixture Type A,F"},"Master Builders Solutions Admix - Cleveland, OH",null,null,null,null,null,null,"72600-01","MASTERPOLYHEED 997",42110,"Admixture Type A,F","Master Builders Solutions Admix - Cleveland, OH"]
[{"$f":"L265","v":"72600-01"},{"$f":"IF(ISNUMBER(SEARCH(\"Liquid\",O265)),M265,IF(ISNUMBER(SEARCH(\"Self\",O265)),M265&\" (SCC)\",IF(ISNUMBER(SEARCH(\"Corrosion\",O265)),M265&\" (CI)\",IF(ISNUMBER(SEARCH(\"Type\",O265)),M265&\" (\"&REPLACE(O265,1,10,\"\")&\")\",M265))))","v":"MASTERPOLYHEED 1725 (Type A,F)"},{"$f":"N265","v":42110},{"$f":"O265","v":"Admixture Type A,F"},{"$f":"IF(ISNUMBER(SEARCH(\"Lyndhurst\",P265)),\"Sika Corporation\",P265)","v":"Master Builders Solutions Admix - Cleveland, OH"},null,null,null,null,null,null,"72600-01","MASTERPOLYHEED 1725",42110,"Admixture Type A,F","Master Builders Solutions Admix - Cleveland, OH"]
["72600-01","MASTERPOLYHEED 1720 (Type A,F)",42110,"Admixture Type A,F","Master Builders Solutions Admix - Cleveland, OH",null,null,null,null,null,null,"72600-01","MASTERPOLYHEED 1720",42110,"Admixture Type A,F","Master Builders Solutions Admix - Cleveland, OH"]
["72600-01","MASTERGLENIUM 7500 (Type A,F)",42110,"Admixture Type A,F","Master Builders Solutions Admix - Cleveland, OH",null,null,null,null,null,null,"72600-01","MASTERGLENIUM 7500",42110,"Admixture Type A,F","Master Builders Solutions Admix - Cleveland, OH"]
["72600-01","MASTERPOLYHEED 100 (Type C,E)",42113,"Admixture Type C,E","Master Builders Solutions Admix - Cleveland, OH",null,null,null,null,null,null,"72600-01","MASTERPOLYHEED 100",42113,"Admixture Type C,E","Master Builders Solutions Admix - Cleveland, OH"]
[{"$f":"L269","v":"72600-01"},{"$f":"IF(ISNUMBER(SEARCH(\"Liquid\",O269)),M269,IF(ISNUMBER(SEARCH(\"Self\",O269)),M269&\" (SCC)\",IF(ISNUMBER(SEARCH(\"Corrosion\",O269)),M269&\" (CI)\",IF(ISNUMBER(SEARCH(\"Type\",O269)),M269&\" (\"&REPLACE(O269,1,10,\"\")&\")\",M269))))","v":"MASTERSET FP 20 (Type C,E)"},{"$f":"N269","v":42113},{"$f":"O269","v":"Admixture Type C,E"},{"$f":"IF(ISNUMBER(SEARCH(\"Lyndhurst\",P269)),\"Sika Corporation\",P269)","v":"Master Builders Solutions Admix - Cleveland, OH"},null,null,null,null,null,null,"72600-01","MASTERSET FP 20",42113,"Admixture Type C,E","Master Builders Solutions Admix - Cleveland, OH"]
["72600-01","MASTERSET AC 122 (Type C,E)",42113,"Admixture Type C,E","Master Builders Solutions Admix - Cleveland, OH",null,null,null,null,null,null,"72600-01","MASTERSET AC 122",42113,"Admixture Type C,E","Master Builders Solutions Admix - Cleveland, OH"]
[{"$f":"L271","v":"72600-01"},{"$f":"IF(ISNUMBER(SEARCH(\"Liquid\",O271)),M271,IF(ISNUMBER(SEARCH(\"Self\",O271)),M271&\" (SCC)\",IF(ISNUMBER(SEARCH(\"Corrosion\",O271)),M271&\" (CI)\",IF(ISNUMBER(SEARCH(\"Type\",O271)),M271&\" (\"&REPLACE(O271,1,10,\"\")&\")\",M271))))","v":"RHEOMAC UW 450"},{"$f":"N271","v":42203},{"$f":"O271","v":"Admixture Anti-Washout"},{"$f":"IF(ISNUMBER(SEARCH(\"Lyndhurst\",P271)),\"Sika Corporation\",P271)","v":"Master Builders Solutions Admix - Cleveland, OH"},null,null,null,null,null,null,"72600-01","RHEOMAC UW 450",42203,"Admixture Anti-Washout","Master Builders Solutions Admix - Cleveland, OH"]
["72600-01","MASTERLIFE CI 222 (CI)",43301,"Admixture Corrosion Inhibitor","Master Builders Solutions Admix - Cleveland, OH",null,null,null,null,null,null,"72600-01","MASTERLIFE CI 222",43301,"Admixture Corrosion Inhibitor","Master Builders Solutions Admix - Cleveland, OH"]
[{"$f":"L273","v":"72600-01"},{"$f":"IF(ISNUMBER(SEARCH(\"Liquid\",O273)),M273,IF(ISNUMBER(SEARCH(\"Self\",O273)),M273&\" (SCC)\",IF(ISNUMBER(SEARCH(\"Corrosion\",O273)),M273&\" (CI)\",IF(ISNUMBER(SEARCH(\"Type\",O273)),M273&\" (\"&REPLACE(O273,1,10,\"\")&\")\",M273))))","v":"MASTERLIFE CI 30 (CI)"},{"$f":"N273","v":43301},{"$f":"O273","v":"Admixture Corrosion Inhibitor"},{"$f":"IF(ISNUMBER(SEARCH(\"Lyndhurst\",P273)),\"Sika Corporation\",P273)","v":"Master Builders Solutions Admix - Cleveland, OH"},null,null,null,null,null,null,"72600-01","MASTERLIFE CI 30",43301,"Admixture Corrosion Inhibitor","Master Builders Solutions Admix - Cleveland, OH"]
["72600-01","MASTERGLENIUM 1466 (Type A)",42101,"Admixture Type A","Master Builders Solutions Admix - Cleveland, OH",null,null,null,null,null,null,"72600-01","MASTERGLENIUM 1466",42101,"Admixture Type A","Master Builders Solutions Admix - Cleveland, OH"]
["72600-01","MASTERGLENIUM 1466 (Type F)",42106,"Admixture Type F","Master Builders Solutions Admix - Cleveland, OH",null,null,null,null,null,null,"72600-01","MASTERGLENIUM 1466",42106,"Admixture Type F","Master Builders Solutions Admix - Cleveland, OH"]
["72600-01","MASTERGLENIUM 3030 (Type A)",42101,"Admixture Type A","Master Builders Solutions Admix - Cleveland, OH",null,null,null,null,null,null,"72600-01","MASTERGLENIUM 3030",42101,"Admixture Type A","Master Builders Solutions Admix - Cleveland, OH"]
["72600-01","MASTERGLENIUM 3030 (Type F)",42106,"Admixture Type F","Master Builders Solutions Admix - Cleveland, OH",null,null,null,null,null,null,"72600-01","MASTERGLENIUM 3030",42106,"Admixture Type F","Master Builders Solutions Admix - Cleveland, OH"]
["72600-01","MASTERGLENIUM 7500 (Type A)",42101,"Admixture Type A","Master Builders Solutions Admix - Cleveland, OH",null,null,null,null,null,null,"72600-01","MASTERGLENIUM 7500",42101,"Admixture Type A","Master Builders Solutions Admix - Cleveland, OH"]
["72600-01","MASTERGLENIUM 7500 (Type F)",42106,"Admixture Type F","Master Builders Solutions Admix - Cleveland, OH",null,null,null,null,null,null,"72600-01","MASTERGLENIUM 7500",42106,"Admixture Type F","Master Builders Solutions Admix - Cleveland, OH"]
["72600-01","MASTERGLENIUM 7720 (Type A)",42101,"Admixture Type A","Master Builders Solutions Admix - Cleveland, OH",null,null,null,null,null,null,"72600-01","MASTERGLENIUM 7720",42101,"Admixture Type A","Master Builders Solutions Admix - Cleveland, OH"]
[{"$f":"L281","v":"72600-01"},{"$f":"IF(ISNUMBER(SEARCH(\"Liquid\",O281)),M281,IF(ISNUMBER(SEARCH(\"Self\",O281)),M281&\" (SCC)\",IF(ISNUMBER(SEARCH(\"Corrosion\",O281)),M281&\" (CI)\",IF(ISNUMBER(SEARCH(\"Type\",O281)),M281&\" (\"&REPLACE(O281,1,10,\"\")&\")\",M281))))","v":"MASTERGLENIUM 7720 (Type F)"},{"$f":"N281","v":42106},{"$f":"O281","v":"Admixture Type F"},{"$f":"IF(ISNUMBER(SEARCH(\"Lyndhurst\",P281)),\"Sika Corporation\",P281)","v":"Master Builders Solutions Admix - Cleveland, OH"},null,null,null,null,null,null,"72600-01","MASTERGLENIUM 7720",42106,"Admixture Type F","Master Builders Solutions Admix - Cleveland, OH"]
["72600-01","MASTERGLENIUM 7920 (Type A)",42101,"Admixture Type A","Master Builders Solutions Admix - Cleveland, OH",null,null,null,null,null,null,"72600-01","MASTERGLENIUM 7920",42101,"Admixture Type A","Master Builders Solutions Admix - Cleveland, OH"]
["72600-01","MASTERGLENIUM 7920 (Type F)",42106,"Admixture Type F","Master Builders Solutions Admix - Cleveland, OH",null,null,null,null,null,null,"72600-01","MASTERGLENIUM 7920",42106,"Admixture Type F","Master Builders Solutions Admix - Cleveland, OH"]
["72600-01","MASTERGLENIUM 7925 (Type A)",42101,"Admixture Type A","Master Builders Solutions Admix - Cleveland, OH",null,null,null,null,null,null,"72600-01","MASTERGLENIUM 7925",42101,"Admixture Type A","Master Builders Solutions Admix - Cleveland, OH"]
["72600-01","MASTERGLENIUM 7925 (Type F)",42106,"Admixture Type F","Master Builders Solutions Admix - Cleveland, OH",null,null,null,null,null,null,"72600-01","MASTERGLENIUM 7925",42106,"Admixture Type F","Master Builders Solutions Admix - Cleveland, OH"]
["72600-01","MASTERGLENIUM 7960 (Type A)",42101,"Admixture Type A","Master Builders Solutions Admix - Cleveland, OH",null,null,null,null,null,null,"72600-01","MASTERGLENIUM 7960",42101,"Admixture Type A","Master Builders Solutions Admix - Cleveland, OH"]
["72600-01","MASTERGLENIUM 7960 (Type F)",42106,"Admixture Type F","Master Builders Solutions Admix - Cleveland, OH",null,null,null,null,null,null,"72600-01","MASTERGLENIUM 7960",42106,"Admixture Type F","Master Builders Solutions Admix - Cleveland, OH"]
["72600-01","MASTERPOLYHEED 1020 (Type A)",42101,"Admixture Type A","Master Builders Solutions Admix - Cleveland, OH",null,null,null,null,null,null,"72600-01","MASTERPOLYHEED 1020",42101,"Admixture Type A","Master Builders Solutions Admix - Cleveland, OH"]
["72600-01","MASTERPOLYHEED 1020 (Type F)",42106,"Admixture Type F","Master Builders Solutions Admix - Cleveland, OH",null,null,null,null,null,null,"72600-01","MASTERPOLYHEED 1020",42106,"Admixture Type F","Master Builders Solutions Admix - Cleveland, OH"]
["72600-01","MASTERPOLYHEED 1025 (Type A)",42101,"Admixture Type A","Master Builders Solutions Admix - Cleveland, OH",null,null,null,null,null,null,"72600-01","MASTERPOLYHEED 1025",42101,"Admixture Type A","Master Builders Solutions Admix - Cleveland, OH"]
["72600-01","MASTERPOLYHEED 1025 (Type F)",42106,"Admixture Type F","Master Builders Solutions Admix - Cleveland, OH",null,null,null,null,null,null,"72600-01","MASTERPOLYHEED 1025",42106,"Admixture Type F","Master Builders Solutions Admix - Cleveland, OH"]
["72600-01","MASTERPOLYHEED 1720 (Type A)",42101,"Admixture Type A","Master Builders Solutions Admix - Cleveland, OH",null,null,null,null,null,null,"72600-01","MASTERPOLYHEED 1720",42101,"Admixture Type A","Master Builders Solutions Admix - Cleveland, OH"]
["72600-01","MASTERPOLYHEED 1720 (Type F)",42106,"Admixture Type F","Master Builders Solutions Admix - Cleveland, OH",null,null,null,null,null,null,"72600-01","MASTERPOLYHEED 1720",42106,"Admixture Type F","Master Builders Solutions Admix - Cleveland, OH"]
["72600-01","MASTERPOLYHEED 1725 (Type A)",42101,"Admixture Type A","Master Builders Solutions Admix - Cleveland, OH",null,null,null,null,null,null,"72600-01","MASTERPOLYHEED 1725",42101,"Admixture Type A","Master Builders Solutions Admix - Cleveland, OH"]
["72600-01","MASTERPOLYHEED 1725 (Type F)",42106,"Admixture Type F","Master Builders Solutions Admix - Cleveland, OH",null,null,null,null,null,null,"72600-01","MASTERPOLYHEED 1725",42106,"Admixture Type F","Master Builders Solutions Admix - Cleveland, OH"]
["72600-01","MASTERPOLYHEED 997 (Type A)",42101,"Admixture Type A","Master Builders Solutions Admix - Cleveland, OH",null,null,null,null,null,null,"72600-01","MASTERPOLYHEED 997",42101,"Admixture Type A","Master Builders Solutions Admix - Cleveland, OH"]
["72600-01","MASTERPOLYHEED 997 (Type F)",42106,"Admixture Type F","Master Builders Solutions Admix - Cleveland, OH",null,null,null,null,null,null,"72600-01","MASTERPOLYHEED 997",42106,"Admixture Type F","Master Builders Solutions Admix - Cleveland, OH"]
["72600-01","MASTERPOLYHEED 980 (Type A)",42101,"Admixture Type A","Master Builders Solutions Admix - Cleveland, OH",null,null,null,null,null,null,"72600-01","MASTERPOLYHEED 980",42101,"Admixture Type A","Master Builders Solutions Admix - Cleveland, OH"]
["72600-01","MASTERPOLYHEED 980 (Type F)",42106,"Admixture Type F","Master Builders Solutions Admix - Cleveland, OH",null,null,null,null,null,null,"72600-01","MASTERPOLYHEED 980",42106,"Admixture Type F","Master Builders Solutions Admix - Cleveland, OH"]
["72600-01","MASTERPOLYHEED 100 (Type C)",42103,"Admixture Type C","Master Builders Solutions Admix - Cleveland, OH",null,null,null,null,null,null,"72600-01","MASTERPOLYHEED 100",42103,"Admixture Type C","Master Builders Solutions Admix - Cleveland, OH"]
["72600-01","MASTERSET AC 122 (Type C)",42103,"Admixture Type C","Master Builders Solutions Admix - Cleveland, OH",null,null,null,null,null,null,"72600-01","MASTERSET AC 122",42103,"Admixture Type C","Master Builders Solutions Admix - Cleveland, OH"]
["72600-01","MASTERSET FP 20 (Type C)",42103,"Admixture Type C","Master Builders Solutions Admix - Cleveland, OH",null,null,null,null,null,null,"72600-01","MASTERSET FP 20",42103,"Admixture Type C","Master Builders Solutions Admix - Cleveland, OH"]
["72600-01","MASTERPOZZOLITH 200 (Type A)",42101,"Admixture Type A","Master Builders Solutions Admix - Cleveland, OH",null,null,null,null,null,null,"72600-01","MASTERPOZZOLITH 200",42101,"Admixture Type A","Master Builders Solutions Admix - Cleveland, OH"]
["72600-01","MASTERPOZZOLITH 700 (Type A)",42101,"Admixture Type A","Master Builders Solutions Admix - Cleveland, OH",null,null,null,null,null,null,"72600-01","MASTERPOZZOLITH 700",42101,"Admixture Type A","Master Builders Solutions Admix - Cleveland, OH"]
["72600-01","MASTERPOZZOLITH 80 (Type A)",42101,"Admixture Type A","Master Builders Solutions Admix - Cleveland, OH",null,null,null,null,null,null,"72600-01","MASTERPOZZOLITH 80",42101,"Admixture Type A","Master Builders Solutions Admix - Cleveland, OH"]
["72600-01","MasterGlenium 7511 (Type A)",42101,"Admixture Type A","Master Builders Solutions Admix - Cleveland, OH",null,null,null,null,null,null,"72600-01","MasterGlenium 7511",42101,"Admixture Type A","Master Builders Solutions Admix - Cleveland, OH"]
["72600-01","MasterGlenium 7511 (Type F)",42106,"Admixture Type F","Master Builders Solutions Admix - Cleveland, OH",null,null,null,null,null,null,"72600-01","MasterGlenium 7511",42106,"Admixture Type F","Master Builders Solutions Admix - Cleveland, OH"]
["72600-01","MasterGlenium 7511 (Type A,F)",42110,"Admixture Type A,F","Master Builders Solutions Admix - Cleveland, OH",null,null,null,null,null,null,"72600-01","MasterGlenium 7511",42110,"Admixture Type A,F","Master Builders Solutions Admix - Cleveland, OH"]
["72600-01","MasterGlenium 7960 (Type A,F)",42110,"Admixture Type A,F","Master Builders Solutions Admix - Cleveland, OH",null,null,null,null,null,null,"72600-01","MasterGlenium 7960",42110,"Admixture Type A,F","Master Builders Solutions Admix - Cleveland, OH"]
["72600-01","MASTERPOLYHEED 100 (Type A)",42101,"Admixture Type A","Master Builders Solutions Admix - Cleveland, OH",null,null,null,null,null,null,"72600-01","MASTERPOLYHEED 100",42101,"Admixture Type A","Master Builders Solutions Admix - Cleveland, OH"]
["72600-01","MasterPolyheed® 980 (Type A,F)",42110,"Admixture Type A,F","Master Builders Solutions Admix - Cleveland, OH",null,null,null,null,null,null,"72600-01","MasterPolyheed® 980",42110,"Admixture Type A,F","Master Builders Solutions Admix - Cleveland, OH"]
["72600-01","MasterEase 5000 (Type A)",42101,"Admixture Type A","Master Builders Solutions Admix - Cleveland, OH",null,null,null,null,null,null,"72600-01","MasterEase 5000",42101,"Admixture Type A","Master Builders Solutions Admix - Cleveland, OH"]
["72600-01","MASTERPOLYHEED 100 (Type E)",42105,"Admixture Type E","Master Builders Solutions Admix - Cleveland, OH",null,null,null,null,null,null,"72600-01","MASTERPOLYHEED 100",42105,"Admixture Type E","Master Builders Solutions Admix - Cleveland, OH"]
["72600-01","MASTERSET AC 122 (Type E)",42105,"Admixture Type E","Master Builders Solutions Admix - Cleveland, OH",null,null,null,null,null,null,"72600-01","MASTERSET AC 122",42105,"Admixture Type E","Master Builders Solutions Admix - Cleveland, OH"]
["72600-01","MASTERSET FP 20 (Type E)",42105,"Admixture Type E","Master Builders Solutions Admix - Cleveland, OH",null,null,null,null,null,null,"72600-01","MASTERSET FP 20",42105,"Admixture Type E","Master Builders Solutions Admix - Cleveland, OH"]
["72600-01","MASTERPOZZOLITH 200 (Type B)",42102,"Admixture Type B","Master Builders Solutions Admix - Cleveland, OH",null,null,null,null,null,null,"72600-01","MASTERPOZZOLITH 200",42102,"Admixture Type B","Master Builders Solutions Admix - Cleveland, OH"]
["72600-01","MASTERPOZZOLITH 200 (Type D)",42104,"Admixture Type D","Master Builders Solutions Admix - Cleveland, OH",null,null,null,null,null,null,"72600-01","MASTERPOZZOLITH 200",42104,"Admixture Type D","Master Builders Solutions Admix - Cleveland, OH"]
["72600-01","MASTERPOZZOLITH 700 (Type B)",42102,"Admixture Type B","Master Builders Solutions Admix - Cleveland, OH",null,null,null,null,null,null,"72600-01","MASTERPOZZOLITH 700",42102,"Admixture Type B","Master Builders Solutions Admix - Cleveland, OH"]
["72600-01","MASTERPOZZOLITH 700 (Type D)",42104,"Admixture Type D","Master Builders Solutions Admix - Cleveland, OH",null,null,null,null,null,null,"72600-01","MASTERPOZZOLITH 700",42104,"Admixture Type D","Master Builders Solutions Admix - Cleveland, OH"]
["72600-01","MASTERPOZZOLITH 80 (Type B)",42102,"Admixture Type B","Master Builders Solutions Admix - Cleveland, OH",null,null,null,null,null,null,"72600-01","MASTERPOZZOLITH 80",42102,"Admixture Type B","Master Builders Solutions Admix - Cleveland, OH"]
["72600-01","MASTERPOZZOLITH 80 (Type D)",42104,"Admixture Type D","Master Builders Solutions Admix - Cleveland, OH",null,null,null,null,null,null,"72600-01","MASTERPOZZOLITH 80",42104,"Admixture Type D","Master Builders Solutions Admix - Cleveland, OH"]
["72600-01","MASTERSET DELVO (Type B)",42102,"Admixture Type B","Master Builders Solutions Admix - Cleveland, OH",null,null,null,null,null,null,"72600-01","MASTERSET DELVO",42102,"Admixture Type B","Master Builders Solutions Admix - Cleveland, OH"]
["72600-01","MASTERSET DELVO (Type D)",42104,"Admixture Type D","Master Builders Solutions Admix - Cleveland, OH",null,null,null,null,null,null,"72600-01","MASTERSET DELVO",42104,"Admixture Type D","Master Builders Solutions Admix - Cleveland, OH"]
["72600-01","MASTERSET R 300 (Type B)",42102,"Admixture Type B","Master Builders Solutions Admix - Cleveland, OH",null,null,null,null,null,null,"72600-01","MASTERSET R 300",42102,"Admixture Type B","Master Builders Solutions Admix - Cleveland, OH"]
["72600-01","MASTERSET R 300 (Type D)",42104,"Admixture Type D","Master Builders Solutions Admix - Cleveland, OH",null,null,null,null,null,null,"72600-01","MASTERSET R 300",42104,"Admixture Type D","Master Builders Solutions Admix - Cleveland, OH"]
["72600-01","MASTERSET R 100 (Type B)",42102,"Admixture Type B","Master Builders Solutions Admix - Cleveland, OH",null,null,null,null,null,null,"72600-01","MASTERSET R 100",42102,"Admixture Type B","Master Builders Solutions Admix - Cleveland, OH"]
["72600-01","MASTERSET R 100 (Type D)",42104,"Admixture Type D","Master Builders Solutions Admix - Cleveland, OH",null,null,null,null,null,null,"72600-01","MASTERSET R 100",42104,"Admixture Type D","Master Builders Solutions Admix - Cleveland, OH"]
["72600-01","MASTERSET R 961 (Type B)",42102,"Admixture Type B","Master Builders Solutions Admix - Cleveland, OH",null,null,null,null,null,null,"72600-01","MASTERSET R 961",42102,"Admixture Type B","Master Builders Solutions Admix - Cleveland, OH"]
["72600-01","MASTERSET R 961 (Type D)",42104,"Admixture Type D","Master Builders Solutions Admix - Cleveland, OH",null,null,null,null,null,null,"72600-01","MASTERSET R 961",42104,"Admixture Type D","Master Builders Solutions Admix - Cleveland, OH"]
["72755-01","ANHYDROUS",42201,"Calcium Chloride Admix Grade 3, Min 94%","Occidental Chemical Corporation - Ludington, MI",null,null,null,null,null,null,"72755-01","ANHYDROUS",42201,"Calcium Chloride Admix Grade 3, Min 94%","Occidental Chemical Corporation - Ludington, MI"]
["72755-01","DOWFLAKE XTRA",42202,"Calcium Chloride Admix Grade 1, Min 77%","Occidental Chemical Corporation - Ludington, MI",null,null,null,null,null,null,"72755-01","DOWFLAKE XTRA",42202,"Calcium Chloride Admix Grade 1, Min 77%","Occidental Chemical Corporation - Ludington, MI"]
["72755-01","LIQUIDOW 32%",42204,"Calcium Chloride Type Liquid 28-42%","Occidental Chemical Corporation - Ludington, MI",null,null,null,null,null,null,"72755-01","LIQUIDOW 32%",42204,"Calcium Chloride Type Liquid 28-42%","Occidental Chemical Corporation - Ludington, MI"]
["72764-01","CONAIR  X",42001,"Admixture, Air Entraining","Premiere Concrete Admixtures - Pioneer, OH",null,null,null,null,null,null,"72764-01","CONAIR  X",42001,"Admixture, Air Entraining","Premiere Concrete Admixtures - Pioneer, OH"]
["72764-01","CONAIR 260",42001,"Admixture, Air Entraining","Premiere Concrete Admixtures - Pioneer, OH",null,null,null,null,null,null,"72764-01","CONAIR 260",42001,"Admixture, Air Entraining","Premiere Concrete Admixtures - Pioneer, OH"]
["72764-01","CONAIR",42001,"Admixture, Air Entraining","Premiere Concrete Admixtures - Pioneer, OH",null,null,null,null,null,null,"72764-01","CONAIR",42001,"Admixture, Air Entraining","Premiere Concrete Admixtures - Pioneer, OH"]
["72764-01","CONAIR TX",42001,"Admixture, Air Entraining","Premiere Concrete Admixtures - Pioneer, OH",null,null,null,null,null,null,"72764-01","CONAIR TX",42001,"Admixture, Air Entraining","Premiere Concrete Admixtures - Pioneer, OH"]
["72764-01","CONAIR VR",42001,"Admixture, Air Entraining","Premiere Concrete Admixtures - Pioneer, OH",null,null,null,null,null,null,"72764-01","CONAIR VR",42001,"Admixture, Air Entraining","Premiere Concrete Admixtures - Pioneer, OH"]
["72764-01","OPTIFLO 700 (Type A)",42101,"Admixture Type A","Premiere Concrete Admixtures - Pioneer, OH",null,null,null,null,null,null,"72764-01","OPTIFLO 700",42101,"Admixture Type A","Premiere Concrete Admixtures - Pioneer, OH"]
["72764-01","OPTIFLO PLUS (Type A)",42101,"Admixture Type A","Premiere Concrete Admixtures - Pioneer, OH",null,null,null,null,null,null,"72764-01","OPTIFLO PLUS",42101,"Admixture Type A","Premiere Concrete Admixtures - Pioneer, OH"]
["72764-01","OPTIFLO N2A (Type A)",42101,"Admixture Type A","Premiere Concrete Admixtures - Pioneer, OH",null,null,null,null,null,null,"72764-01","OPTIFLO N2A",42101,"Admixture Type A","Premiere Concrete Admixtures - Pioneer, OH"]
["72764-01","PROLONG (Type B)",42102,"Admixture Type B","Premiere Concrete Admixtures - Pioneer, OH",null,null,null,null,null,null,"72764-01","PROLONG",42102,"Admixture Type B","Premiere Concrete Admixtures - Pioneer, OH"]
["72764-01","NITROCAST 701 (Type C)",42103,"Admixture Type C","Premiere Concrete Admixtures - Pioneer, OH",null,null,null,null,null,null,"72764-01","NITROCAST 701",42103,"Admixture Type C","Premiere Concrete Admixtures - Pioneer, OH"]
["72764-01","NITROCAST K (Type C)",42103,"Admixture Type C","Premiere Concrete Admixtures - Pioneer, OH",null,null,null,null,null,null,"72764-01","NITROCAST K",42103,"Admixture Type C","Premiere Concrete Admixtures - Pioneer, OH"]
["72764-01","NITROCAST NC (Type C)",42103,"Admixture Type C","Premiere Concrete Admixtures - Pioneer, OH",null,null,null,null,null,null,"72764-01","NITROCAST NC",42103,"Admixture Type C","Premiere Concrete Admixtures - Pioneer, OH"]
[{"$f":"L345","v":"72764-01"},{"$f":"IF(ISNUMBER(SEARCH(\"Liquid\",O345)),M345,IF(ISNUMBER(SEARCH(\"Self\",O345)),M345&\" (SCC)\",IF(ISNUMBER(SEARCH(\"Corrosion\",O345)),M345&\" (CI)\",IF(ISNUMBER(SEARCH(\"Type\",O345)),M345&\" (\"&REPLACE(O345,1,10,\"\")&\")\",M345))))","v":"OPTIFLO PLUS (Type E)"},{"$f":"N345","v":42105},{"$f":"O345","v":"Admixture Type E"},{"$f":"IF(ISNUMBER(SEARCH(\"Lyndhurst\",P345)),\"Sika Corporation\",P345)","v":"Premiere Concrete Admixtures - Pioneer, OH"},null,null,null,null,null,null,"72764-01","OPTIFLO PLUS",42105,"Admixture Type E","Premiere Concrete Admixtures - Pioneer, OH"]
["72764-01","ULTRAFLO 5600 (Type F)",42106,"Admixture Type F","Premiere Concrete Admixtures - Pioneer, OH",null,null,null,null,null,null,"72764-01","ULTRAFLO 5600",42106,"Admixture Type F","Premiere Concrete Admixtures - Pioneer, OH"]
["72764-01","ULTRAFLO 2000 (Type F)",42106,"Admixture Type F","Premiere Concrete Admixtures - Pioneer, OH",null,null,null,null,null,null,"72764-01","ULTRAFLO 2000",42106,"Admixture Type F","Premiere Concrete Admixtures - Pioneer, OH"]
["72764-01","ULTRAFLO 4600 (Type F)",42106,"Admixture Type F","Premiere Concrete Admixtures - Pioneer, OH",null,null,null,null,null,null,"72764-01","ULTRAFLO 4600",42106,"Admixture Type F","Premiere Concrete Admixtures - Pioneer, OH"]
["72764-01","ULTRAFLO DP-40 (Type F)",42106,"Admixture Type F","Premiere Concrete Admixtures - Pioneer, OH",null,null,null,null,null,null,"72764-01","ULTRAFLO DP-40",42106,"Admixture Type F","Premiere Concrete Admixtures - Pioneer, OH"]
["72764-01","OPTIFLO N2A (Type G)",42107,"Admixture Type G","Premiere Concrete Admixtures - Pioneer, OH",null,null,null,null,null,null,"72764-01","OPTIFLO N2A",42107,"Admixture Type G","Premiere Concrete Admixtures - Pioneer, OH"]
["72764-01","OPTIFLO 500 (Type A,D)",42109,"Admixture Type A,D","Premiere Concrete Admixtures - Pioneer, OH",null,null,null,null,null,null,"72764-01","OPTIFLO 500",42109,"Admixture Type A,D","Premiere Concrete Admixtures - Pioneer, OH"]
["72764-01","OPTIFLO 50 (Type A,D)",42109,"Admixture Type A,D","Premiere Concrete Admixtures - Pioneer, OH",null,null,null,null,null,null,"72764-01","OPTIFLO 50",42109,"Admixture Type A,D","Premiere Concrete Admixtures - Pioneer, OH"]
["72764-01","OPTIFLO MR (Type A,F)",42110,"Admixture Type A,F","Premiere Concrete Admixtures - Pioneer, OH",null,null,null,null,null,null,"72764-01","OPTIFLO MR",42110,"Admixture Type A,F","Premiere Concrete Admixtures - Pioneer, OH"]
["72764-01","ECOFLO GREEN (Type A,F)",42110,"Admixture Type A,F","Premiere Concrete Admixtures - Pioneer, OH",null,null,null,null,null,null,"72764-01","ECOFLO GREEN",42110,"Admixture Type A,F","Premiere Concrete Admixtures - Pioneer, OH"]
["72764-01","PROLONG L (Type B,D)",42112,"Admixture Type B,D","Premiere Concrete Admixtures - Pioneer, OH",null,null,null,null,null,null,"72764-01","PROLONG L",42112,"Admixture Type B,D","Premiere Concrete Admixtures - Pioneer, OH"]
["72764-01","OPTIFLO 100R (Type B,D)",42112,"Admixture Type B,D","Premiere Concrete Admixtures - Pioneer, OH",null,null,null,null,null,null,"72764-01","OPTIFLO 100R",42112,"Admixture Type B,D","Premiere Concrete Admixtures - Pioneer, OH"]
["72764-01","ULTRAFLO 2000 (SCC)",42117,"Admixture Self Compacting Concrete","Premiere Concrete Admixtures - Pioneer, OH",null,null,null,null,null,null,"72764-01","ULTRAFLO 2000",42117,"Admixture Self Compacting Concrete","Premiere Concrete Admixtures - Pioneer, OH"]
["72764-01","ULTRAFLO DP (SCC)",42117,"Admixture Self Compacting Concrete","Premiere Concrete Admixtures - Pioneer, OH",null,null,null,null,null,null,"72764-01","ULTRAFLO DP",42117,"Admixture Self Compacting Concrete","Premiere Concrete Admixtures - Pioneer, OH"]
["72764-01","IMPEDE CNI (CI)",43301,"Admixture Corrosion Inhibitor","Premiere Concrete Admixtures - Pioneer, OH",null,null,null,null,null,null,"72764-01","IMPEDE CNI",43301,"Admixture Corrosion Inhibitor","Premiere Concrete Admixtures - Pioneer, OH"]
["72764-01","OPTIFLO 500 (Type A)",42101,"Admixture Type A","Premiere Concrete Admixtures - Pioneer, OH",null,null,null,null,null,null,"72764-01","OPTIFLO 500",42101,"Admixture Type A","Premiere Concrete Admixtures - Pioneer, OH"]
["72764-01","OPTIFLO 500 (Type D)",42104,"Admixture Type D","Premiere Concrete Admixtures - Pioneer, OH",null,null,null,null,null,null,"72764-01","OPTIFLO 500",42104,"Admixture Type D","Premiere Concrete Admixtures - Pioneer, OH"]
["72764-01","ECOFLO GREEN (Type A)",42101,"Admixture Type A","Premiere Concrete Admixtures - Pioneer, OH",null,null,null,null,null,null,"72764-01","ECOFLO GREEN",42101,"Admixture Type A","Premiere Concrete Admixtures - Pioneer, OH"]
["72764-01","ECOFLO GREEN (Type F)",42106,"Admixture Type F","Premiere Concrete Admixtures - Pioneer, OH",null,null,null,null,null,null,"72764-01","ECOFLO GREEN",42106,"Admixture Type F","Premiere Concrete Admixtures - Pioneer, OH"]
["72764-01","OPTIFLO MR (Type A)",42101,"Admixture Type A","Premiere Concrete Admixtures - Pioneer, OH",null,null,null,null,null,null,"72764-01","OPTIFLO MR",42101,"Admixture Type A","Premiere Concrete Admixtures - Pioneer, OH"]
["72764-01","OPTIFLO MR (Type F)",42106,"Admixture Type F","Premiere Concrete Admixtures - Pioneer, OH",null,null,null,null,null,null,"72764-01","OPTIFLO MR",42106,"Admixture Type F","Premiere Concrete Admixtures - Pioneer, OH"]
["72764-01","OPTIFLO 100R (Type B)",42102,"Admixture Type B","Premiere Concrete Admixtures - Pioneer, OH",null,null,null,null,null,null,"72764-01","OPTIFLO 100R",42102,"Admixture Type B","Premiere Concrete Admixtures - Pioneer, OH"]
["72764-01","OPTIFLO 100R (Type D)",42104,"Admixture Type D","Premiere Concrete Admixtures - Pioneer, OH",null,null,null,null,null,null,"72764-01","OPTIFLO 100R",42104,"Admixture Type D","Premiere Concrete Admixtures - Pioneer, OH"]
["72764-01","PROLONG L (Type B)",42102,"Admixture Type B","Premiere Concrete Admixtures - Pioneer, OH",null,null,null,null,null,null,"72764-01","PROLONG L",42102,"Admixture Type B","Premiere Concrete Admixtures - Pioneer, OH"]
["72764-01","PROLONG L (Type D)",42104,"Admixture Type D","Premiere Concrete Admixtures - Pioneer, OH",null,null,null,null,null,null,"72764-01","PROLONG L",42104,"Admixture Type D","Premiere Concrete Admixtures - Pioneer, OH"]
["72764-01","OPTIFLO 50 (Type A)",42101,"Admixture Type A","Premiere Concrete Admixtures - Pioneer, OH",null,null,null,null,null,null,"72764-01","OPTIFLO 50",42101,"Admixture Type A","Premiere Concrete Admixtures - Pioneer, OH"]
["72764-01","OPTIFLO 50 (Type D)",42104,"Admixture Type D","Premiere Concrete Admixtures - Pioneer, OH",null,null,null,null,null,null,"72764-01","OPTIFLO 50",42104,"Admixture Type D","Premiere Concrete Admixtures - Pioneer, OH"]
["72608-01","LC-500 (Type A)",42101,"Admixture Type A","Russ Tech - Jeffersontown, KY",null,null,null,null,null,null,"72608-01","LC-500",42101,"Admixture Type A","Russ Tech - Jeffersontown, KY"]
["72608-01","LC-500 (Type D)",42104,"Admixture Type D","Russ Tech - Jeffersontown, KY",null,null,null,null,null,null,"72608-01","LC-500",42104,"Admixture Type D","Russ Tech - Jeffersontown, KY"]
["72608-01","LC-400P (Type A)",42101,"Admixture Type A","Russ Tech - Jeffersontown, KY",null,null,null,null,null,null,"72608-01","LC-400P",42101,"Admixture Type A","Russ Tech - Jeffersontown, KY"]
["72608-01","LC-400P (Type D)",42104,"Admixture Type D","Russ Tech - Jeffersontown, KY",null,null,null,null,null,null,"72608-01","LC-400P",42104,"Admixture Type D","Russ Tech - Jeffersontown, KY"]
["72608-01","LCNC-166 (Type C)",42103,"Admixture Type C","Russ Tech - Jeffersontown, KY",null,null,null,null,null,null,"72608-01","LCNC-166",42103,"Admixture Type C","Russ Tech - Jeffersontown, KY"]
["72608-01","SUPERFLO 2000 RM (Type A)",42101,"Admixture Type A","Russ Tech - Jeffersontown, KY",null,null,null,null,null,null,"72608-01","SUPERFLO 2000 RM",42101,"Admixture Type A","Russ Tech - Jeffersontown, KY"]
["72608-01","SUPERFLO 2000 RM (Type F)",42106,"Admixture Type F","Russ Tech - Jeffersontown, KY",null,null,null,null,null,null,"72608-01","SUPERFLO 2000 RM",42106,"Admixture Type F","Russ Tech - Jeffersontown, KY"]
["72608-01","SUPERFLO 2040 RM (Type A)",42101,"Admixture Type A","Russ Tech - Jeffersontown, KY",null,null,null,null,null,null,"72608-01","SUPERFLO 2040 RM",42101,"Admixture Type A","Russ Tech - Jeffersontown, KY"]
["72608-01","SUPERFLO 2040 RM (Type F)",42106,"Admixture Type F","Russ Tech - Jeffersontown, KY",null,null,null,null,null,null,"72608-01","SUPERFLO 2040 RM",42106,"Admixture Type F","Russ Tech - Jeffersontown, KY"]
["72608-01","SUPERFLO 2000SCC (Type A)",42101,"Admixture Type A","Russ Tech - Jeffersontown, KY",null,null,null,null,null,null,"72608-01","SUPERFLO 2000SCC",42101,"Admixture Type A","Russ Tech - Jeffersontown, KY"]
["72608-01","SUPERFLO 2000SCC (Type F)",42106,"Admixture Type F","Russ Tech - Jeffersontown, KY",null,null,null,null,null,null,"72608-01","SUPERFLO 2000SCC",42106,"Admixture Type F","Russ Tech - Jeffersontown, KY"]
["72608-01","LCNC-166 (Type E)",42105,"Admixture Type E","Russ Tech - Jeffersontown, KY",null,null,null,null,null,null,"72608-01","LCNC-166",42105,"Admixture Type E","Russ Tech - Jeffersontown, KY"]
["72608-01","RVR-15",42001,"Admixture, Air Entraining","Russ Tech - Jeffersontown, KY",null,null,null,null,null,null,"72608-01","RVR-15",42001,"Admixture, Air Entraining","Russ Tech - Jeffersontown, KY"]
["72608-01","RSA-10",42001,"Admixture, Air Entraining","Russ Tech - Jeffersontown, KY",null,null,null,null,null,null,"72608-01","RSA-10",42001,"Admixture, Air Entraining","Russ Tech - Jeffersontown, KY"]
["72608-01","RAE-260",42001,"Admixture, Air Entraining","Russ Tech - Jeffersontown, KY",null,null,null,null,null,null,"72608-01","RAE-260",42001,"Admixture, Air Entraining","Russ Tech - Jeffersontown, KY"]
["72608-01","EXTENDFLO X90 (Type A)",42101,"Admixture Type A","Russ Tech - Jeffersontown, KY",null,null,null,null,null,null,"72608-01","EXTENDFLO X90",42101,"Admixture Type A","Russ Tech - Jeffersontown, KY"]
["72608-01","LC-400 (Type A)",42101,"Admixture Type A","Russ Tech - Jeffersontown, KY",null,null,null,null,null,null,"72608-01","LC-400",42101,"Admixture Type A","Russ Tech - Jeffersontown, KY"]
["72608-01","FINISHEASE NC (Type A)",42101,"Admixture Type A","Russ Tech - Jeffersontown, KY",null,null,null,null,null,null,"72608-01","FINISHEASE NC",42101,"Admixture Type A","Russ Tech - Jeffersontown, KY"]
["72608-01","RUSSTECH RCI (Type C)",42103,"Admixture Type C","Russ Tech - Jeffersontown, KY",null,null,null,null,null,null,"72608-01","RUSSTECH RCI",42103,"Admixture Type C","Russ Tech - Jeffersontown, KY"]
["72608-01","LC-400R (Type D)",42104,"Admixture Type D","Russ Tech - Jeffersontown, KY",null,null,null,null,null,null,"72608-01","LC-400R",42104,"Admixture Type D","Russ Tech - Jeffersontown, KY"]
["72608-01","RUSSTECH RENU (Type D)",42104,"Admixture Type D","Russ Tech - Jeffersontown, KY",null,null,null,null,null,null,"72608-01","RUSSTECH RENU",42104,"Admixture Type D","Russ Tech - Jeffersontown, KY"]
["72608-01","SUPERFLO 440 (Type F)",42106,"Admixture Type F","Russ Tech - Jeffersontown, KY",null,null,null,null,null,null,"72608-01","SUPERFLO 440",42106,"Admixture Type F","Russ Tech - Jeffersontown, KY"]
["72608-01","SUPERFLO 443 (Type F)",42106,"Admixture Type F","Russ Tech - Jeffersontown, KY",null,null,null,null,null,null,"72608-01","SUPERFLO 443",42106,"Admixture Type F","Russ Tech - Jeffersontown, KY"]
["72608-01","FINISHEASE-NC (Type G)",42107,"Admixture Type G","Russ Tech - Jeffersontown, KY",null,null,null,null,null,null,"72608-01","FINISHEASE-NC",42107,"Admixture Type G","Russ Tech - Jeffersontown, KY"]
["72608-01","LC-500 (Type A,D)",42109,"Admixture Type A,D","Russ Tech - Jeffersontown, KY",null,null,null,null,null,null,"72608-01","LC-500",42109,"Admixture Type A,D","Russ Tech - Jeffersontown, KY"]
["72608-01","LC-400P (Type A,D)",42109,"Admixture Type A,D","Russ Tech - Jeffersontown, KY",null,null,null,null,null,null,"72608-01","LC-400P",42109,"Admixture Type A,D","Russ Tech - Jeffersontown, KY"]
["72608-01","SUPERFLO 2000SCC (Type A,F)",42110,"Admixture Type A,F","Russ Tech - Jeffersontown, KY",null,null,null,null,null,null,"72608-01","SUPERFLO 2000SCC",42110,"Admixture Type A,F","Russ Tech - Jeffersontown, KY"]
["72608-01","SUPERFLO 2000 RM (Type A,F)",42110,"Admixture Type A,F","Russ Tech - Jeffersontown, KY",null,null,null,null,null,null,"72608-01","SUPERFLO 2000 RM",42110,"Admixture Type A,F","Russ Tech - Jeffersontown, KY"]
["72608-01","SUPERFLO 2040 RM (Type A,F)",42110,"Admixture Type A,F","Russ Tech - Jeffersontown, KY",null,null,null,null,null,null,"72608-01","SUPERFLO 2040 RM",42110,"Admixture Type A,F","Russ Tech - Jeffersontown, KY"]
["72608-01","LCNC-166 (Type C,E)",42113,"Admixture Type C,E","Russ Tech - Jeffersontown, KY",null,null,null,null,null,null,"72608-01","LCNC-166",42113,"Admixture Type C,E","Russ Tech - Jeffersontown, KY"]
["72608-01","SUPERFLO 2000 SCC (SCC)",42117,"Admixture Self Compacting Concrete","Russ Tech - Jeffersontown, KY",null,null,null,null,null,null,"72608-01","SUPERFLO 2000 SCC",42117,"Admixture Self Compacting Concrete","Russ Tech - Jeffersontown, KY"]
["72608-01","RUSSTECH RCI (CI)",43301,"Admixture Corrosion Inhibitor","Russ Tech - Jeffersontown, KY",null,null,null,null,null,null,"72608-01","RUSSTECH RCI",43301,"Admixture Corrosion Inhibitor","Russ Tech - Jeffersontown, KY"]
["72609-01","INTROPLAST-N",43501,"Additive, Non Shrink","Sika Corporation",null,null,null,null,null,null,"72609-01","INTROPLAST-N",43501,"Additive, Non Shrink","Sika - Lyndhurst, NJ"]
["72773-01","SIKACONTROL AIR-160",42001,"Admixture, Air Entraining","Sika Corporation",null,null,null,null,null,null,"72773-01","SIKACONTROL AIR-160",42001,"Admixture, Air Entraining","Sika Corporation"]
["72773-01","SIKA AEA-14",42001,"Admixture, Air Entraining","Sika Corporation",null,null,null,null,null,null,"72773-01","SIKA AEA-14",42001,"Admixture, Air Entraining","Sika Corporation"]
["72773-01","SIKA AIR-260",42001,"Admixture, Air Entraining","Sika Corporation",null,null,null,null,null,null,"72773-01","SIKA AIR-260",42001,"Admixture, Air Entraining","Sika Corporation"]
["72773-01","SIKA AIR-360",42001,"Admixture, Air Entraining","Sika Corporation",null,null,null,null,null,null,"72773-01","SIKA AIR-360",42001,"Admixture, Air Entraining","Sika Corporation"]
[{"$f":"L409","v":"72773-01"},{"$f":"IF(ISNUMBER(SEARCH(\"Liquid\",O409)),M409,IF(ISNUMBER(SEARCH(\"Self\",O409)),M409&\" (SCC)\",IF(ISNUMBER(SEARCH(\"Corrosion\",O409)),M409&\" (CI)\",IF(ISNUMBER(SEARCH(\"Type\",O409)),M409&\" (\"&REPLACE(O409,1,10,\"\")&\")\",M409))))","v":"SIKA VISCOFLOW-2020 (Type A)"},{"$f":"N409","v":42101},{"$f":"O409","v":"Admixture Type A"},{"$f":"IF(ISNUMBER(SEARCH(\"Lyndhurst\",P409)),\"Sika Corporation\",P409)","v":"Sika Corporation"},null,null,null,null,null,null,"72773-01","SIKA VISCOFLOW-2020",42101,"Admixture Type A","Sika Corporation"]
["72773-01","SIKAPLAST-300GP (Type A)",42101,"Admixture Type A","Sika Corporation",null,null,null,null,null,null,"72773-01","SIKAPLAST-300GP",42101,"Admixture Type A","Sika Corporation"]
["72773-01","SIKAPLAST-200 (Type A)",42101,"Admixture Type A","Sika Corporation",null,null,null,null,null,null,"72773-01","SIKAPLAST-200",42101,"Admixture Type A","Sika Corporation"]
["72773-01","SIKATARD 440 (Type B)",42102,"Admixture Type B","Sika Corporation",null,null,null,null,null,null,"72773-01","SIKATARD 440",42102,"Admixture Type B","Sika Corporation"]
["72773-01","SIKA RAPID 1 (Type C)",42103,"Admixture Type C","Sika Corporation",null,null,null,null,null,null,"72773-01","SIKA RAPID 1",42103,"Admixture Type C","Sika Corporation"]
["72773-01","SIKA PLASTIMENT (Type D)",42104,"Admixture Type D","Sika Corporation",null,null,null,null,null,null,"72773-01","SIKA PLASTIMENT",42104,"Admixture Type D","Sika Corporation"]
["72773-01","SIKA VISCOCRETE-2110 (Type F)",42106,"Admixture Type F","Sika Corporation",null,null,null,null,null,null,"72773-01","SIKA VISCOCRETE-2110",42106,"Admixture Type F","Sika Corporation"]
["72773-01","SIKAMIX HC-300 (Type F)",42106,"Admixture Type F","Sika Corporation",null,null,null,null,null,null,"72773-01","SIKAMIX HC-300",42106,"Admixture Type F","Sika Corporation"]
["72773-01","SIKAPLAST-200 (Type G)",42107,"Admixture Type G","Sika Corporation",null,null,null,null,null,null,"72773-01","SIKAPLAST-200",42107,"Admixture Type G","Sika Corporation"]
["72773-01","SIKA PLASTOCRETE-10 N (Type A,B,D)",42108,"Admixture Type A,B,D","Sika Corporation",null,null,null,null,null,null,"72773-01","SIKA PLASTOCRETE-10 N",42108,"Admixture Type A,B,D","Sika Corporation"]
["72773-01","SIKA PLASTOCRETE 161 (Type A,B,D)",42108,"Admixture Type A,B,D","Sika Corporation",null,null,null,null,null,null,"72773-01","SIKA PLASTOCRETE 161",42108,"Admixture Type A,B,D","Sika Corporation"]
["72773-01","SIKA PLASTOCRETE-250 (Type A,D)",42109,"Admixture Type A,D","Sika Corporation",null,null,null,null,null,null,"72773-01","SIKA PLASTOCRETE-250",42109,"Admixture Type A,D","Sika Corporation"]
["72773-01","SIKAMENT 686 (Type A,F)",42110,"Admixture Type A,F","Sika Corporation",null,null,null,null,null,null,"72773-01","SIKAMENT 686",42110,"Admixture Type A,F","Sika Corporation"]
["72773-01","SIKA VISCOCRETE 4100 (Type A,F)",42110,"Admixture Type A,F","Sika Corporation",null,null,null,null,null,null,"72773-01","SIKA VISCOCRETE 4100",42110,"Admixture Type A,F","Sika Corporation"]
["72773-01","SIKA VISCOCRETE 2100 (Type A,F)",42110,"Admixture Type A,F","Sika Corporation",null,null,null,null,null,null,"72773-01","SIKA VISCOCRETE 2100",42110,"Admixture Type A,F","Sika Corporation"]
["72773-01","SIKAMENT SPMN (Type A,F)",42110,"Admixture Type A,F","Sika Corporation",null,null,null,null,null,null,"72773-01","SIKAMENT SPMN",42110,"Admixture Type A,F","Sika Corporation"]
["72773-01","SIKA VISCOCRETE 1000 (Type A,F)",42110,"Admixture Type A,F","Sika Corporation",null,null,null,null,null,null,"72773-01","SIKA VISCOCRETE 1000",42110,"Admixture Type A,F","Sika Corporation"]
["72773-01","SIKAMENT-475 (Type A,F)",42110,"Admixture Type A,F","Sika Corporation",null,null,null,null,null,null,"72773-01","SIKAMENT-475",42110,"Admixture Type A,F","Sika Corporation"]
["72773-01","SIKA VISCOCRETE-6100 (Type A,F)",42110,"Admixture Type A,F","Sika Corporation",null,null,null,null,null,null,"72773-01","SIKA VISCOCRETE-6100",42110,"Admixture Type A,F","Sika Corporation"]
["72773-01","SIKAMENT AFM (Type A,F)",42110,"Admixture Type A,F","Sika Corporation",null,null,null,null,null,null,"72773-01","SIKAMENT AFM",42110,"Admixture Type A,F","Sika Corporation"]
["72773-01","SIKA PLASTIMENT XR (Type B,D)",42112,"Admixture Type B,D","Sika Corporation",null,null,null,null,null,null,"72773-01","SIKA PLASTIMENT XR",42112,"Admixture Type B,D","Sika Corporation"]
["72773-01","SIKASET NC (Type C,E)",42113,"Admixture Type C,E","Sika Corporation",null,null,null,null,null,null,"72773-01","SIKASET NC",42113,"Admixture Type C,E","Sika Corporation"]
["72773-01","SIKA VISCOCRETE-6100 (SCC)",42117,"Admixture Self Compacting Concrete","Sika Corporation",null,null,null,null,null,null,"72773-01","SIKA VISCOCRETE-6100",42117,"Admixture Self Compacting Concrete","Sika Corporation"]
["72773-01","Sika ViscoCrete 2100 (SCC)",42117,"Admixture Self Compacting Concrete","Sika Corporation",null,null,null,null,null,null,"72773-01","Sika ViscoCrete 2100",42117,"Admixture Self Compacting Concrete","Sika Corporation"]
["72773-01","KELCO CRETE",42203,"Admixture Anti-Washout","Sika Corporation",null,null,null,null,null,null,"72773-01","KELCO CRETE",42203,"Admixture Anti-Washout","Sika Corporation"]
["72773-01","SIKAMENT 100SC",42203,"Admixture Anti-Washout","Sika Corporation",null,null,null,null,null,null,"72773-01","SIKAMENT 100SC",42203,"Admixture Anti-Washout","Sika Corporation"]
["72773-01","FERROGARD-901 S (CI)",43301,"Admixture Corrosion Inhibitor","Sika Corporation",null,null,null,null,null,null,"72773-01","FERROGARD-901 S",43301,"Admixture Corrosion Inhibitor","Sika Corporation"]
["72773-01","SIKA CNI (CI)",43301,"Admixture Corrosion Inhibitor","Sika Corporation",null,null,null,null,null,null,"72773-01","SIKA CNI",43301,"Admixture Corrosion Inhibitor","Sika Corporation"]
["72773-01","SIKATARD 440 (Type B,D)",42112,"Admixture Type B,D","Sika Corporation",null,null,null,null,null,null,"72773-01","SIKATARD 440",42112,"Admixture Type B,D","Sika Corporation"]
["72773-01","SIKASET NC (Type E)",42105,"Admixture Type E","Sika Corporation",null,null,null,null,null,null,"72773-01","SIKASET NC",42105,"Admixture Type E","Sika Corporation"]
["72773-01","SIKA VISCOCRETE-1100 (Type A,F)",42110,"Admixture Type A,F","Sika Corporation",null,null,null,null,null,null,"72773-01","SIKA VISCOCRETE-1100",42110,"Admixture Type A,F","Sika Corporation"]
["72773-01","SIKA VISCOFLOW-2020 (Type F)",42106,"Admixture Type F","Sika Corporation",null,null,null,null,null,null,"72773-01","SIKA VISCOFLOW-2020",42106,"Admixture Type F","Sika Corporation"]
["72773-01","SIKA PLASTIMENT XR (Type B)",42102,"Admixture Type B","Sika Corporation",null,null,null,null,null,null,"72773-01","SIKA PLASTIMENT XR",42102,"Admixture Type B","Sika Corporation"]
["72773-01","SIKA PLASTIMENT XR (Type D)",42104,"Admixture Type D","Sika Corporation",null,null,null,null,null,null,"72773-01","SIKA PLASTIMENT XR",42104,"Admixture Type D","Sika Corporation"]
["72773-01","SIKATARD 440 (Type D)",42104,"Admixture Type D","Sika Corporation",null,null,null,null,null,null,"72773-01","SIKATARD 440",42104,"Admixture Type D","Sika Corporation"]
["72773-01","SIKA PLASTOCRETE 161 (Type A)",42101,"Admixture Type A","Sika Corporation",null,null,null,null,null,null,"72773-01","SIKA PLASTOCRETE 161",42101,"Admixture Type A","Sika Corporation"]
["72773-01","SIKA PLASTOCRETE 161 (Type B)",42102,"Admixture Type B","Sika Corporation",null,null,null,null,null,null,"72773-01","SIKA PLASTOCRETE 161",42102,"Admixture Type B","Sika Corporation"]
["72773-01","SIKA PLASTOCRETE 161 (Type D)",42104,"Admixture Type D","Sika Corporation",null,null,null,null,null,null,"72773-01","SIKA PLASTOCRETE 161",42104,"Admixture Type D","Sika Corporation"]
["72773-01","SIKA PLASTOCRETE-10 N (Type A)",42101,"Admixture Type A","Sika Corporation",null,null,null,null,null,null,"72773-01","SIKA PLASTOCRETE-10 N",42101,"Admixture Type A","Sika Corporation"]
["72773-01","SIKA PLASTOCRETE-10 N (Type B)",42102,"Admixture Type B","Sika Corporation",null,null,null,null,null,null,"72773-01","SIKA PLASTOCRETE-10 N",42102,"Admixture Type B","Sika Corporation"]
["72773-01","SIKA PLASTOCRETE-10 N (Type D)",42104,"Admixture Type D","Sika Corporation",null,null,null,null,null,null,"72773-01","SIKA PLASTOCRETE-10 N",42104,"Admixture Type D","Sika Corporation"]
["72773-01","SIKA PLASTOCRETE-250 (Type A)",42101,"Admixture Type A","Sika Corporation",null,null,null,null,null,null,"72773-01","SIKA PLASTOCRETE-250",42101,"Admixture Type A","Sika Corporation"]
["72773-01","SIKA PLASTOCRETE-250 (Type D)",42104,"Admixture Type D","Sika Corporation",null,null,null,null,null,null,"72773-01","SIKA PLASTOCRETE-250",42104,"Admixture Type D","Sika Corporation"]
["72773-01","SIKAMENT-475 (Type A)",42101,"Admixture Type A","Sika Corporation",null,null,null,null,null,null,"72773-01","SIKAMENT-475",42101,"Admixture Type A","Sika Corporation"]
["72773-01","SIKAMENT-475 (Type F)",42106,"Admixture Type F","Sika Corporation",null,null,null,null,null,null,"72773-01","SIKAMENT-475",42106,"Admixture Type F","Sika Corporation"]
["72773-01","SIKA VISCOCRETE-6100 (Type A)",42101,"Admixture Type A","Sika Corporation",null,null,null,null,null,null,"72773-01","SIKA VISCOCRETE-6100",42101,"Admixture Type A","Sika Corporation"]
["72773-01","SIKA VISCOCRETE-6100 (Type F)",42106,"Admixture Type F","Sika Corporation",null,null,null,null,null,null,"72773-01","SIKA VISCOCRETE-6100",42106,"Admixture Type F","Sika Corporation"]
["72773-01","SIKA VISCOCRETE 4100 (Type A)",42101,"Admixture Type A","Sika Corporation",null,null,null,null,null,null,"72773-01","SIKA VISCOCRETE 4100",42101,"Admixture Type A","Sika Corporation"]
["72773-01","SIKA VISCOCRETE 4100 (Type F)",42106,"Admixture Type F","Sika Corporation",null,null,null,null,null,null,"72773-01","SIKA VISCOCRETE 4100",42106,"Admixture Type F","Sika Corporation"]
["72773-01","SIKAMENT AFM (Type A)",42101,"Admixture Type A","Sika Corporation",null,null,null,null,null,null,"72773-01","SIKAMENT AFM",42101,"Admixture Type A","Sika Corporation"]
["72773-01","SIKAMENT AFM (Type F)",42106,"Admixture Type F","Sika Corporation",null,null,null,null,null,null,"72773-01","SIKAMENT AFM",42106,"Admixture Type F","Sika Corporation"]
["72773-01","SIKAMENT SPMN (Type A)",42101,"Admixture Type A","Sika Corporation",null,null,null,null,null,null,"72773-01","SIKAMENT SPMN",42101,"Admixture Type A","Sika Corporation"]
["72773-01","SIKAMENT SPMN (Type F)",42106,"Admixture Type F","Sika Corporation",null,null,null,null,null,null,"72773-01","SIKAMENT SPMN",42106,"Admixture Type F","Sika Corporation"]
["72773-01","SIKA VISCOCRETE 2100 (Type A)",42101,"Admixture Type A","Sika Corporation",null,null,null,null,null,null,"72773-01","SIKA VISCOCRETE 2100",42101,"Admixture Type A","Sika Corporation"]
["72773-01","SIKA VISCOCRETE 2100 (Type F)",42106,"Admixture Type F","Sika Corporation",null,null,null,null,null,null,"72773-01","SIKA VISCOCRETE 2100",42106,"Admixture Type F","Sika Corporation"]
["72773-01","SIKA VISCOCRETE-1100 (Type A)",42101,"Admixture Type A","Sika Corporation",null,null,null,null,null,null,"72773-01","SIKA VISCOCRETE-1100",42101,"Admixture Type A","Sika Corporation"]
["72773-01","SIKA VISCOCRETE-1100 (Type F)",42106,"Admixture Type F","Sika Corporation",null,null,null,null,null,null,"72773-01","SIKA VISCOCRETE-1100",42106,"Admixture Type F","Sika Corporation"]
["72773-01","SIKAMENT 686 (Type A)",42101,"Admixture Type A","Sika Corporation",null,null,null,null,null,null,"72773-01","SIKAMENT 686",42101,"Admixture Type A","Sika Corporation"]
["72773-01","SIKAMENT 686 (Type F)",42106,"Admixture Type F","Sika Corporation",null,null,null,null,null,null,"72773-01","SIKAMENT 686",42106,"Admixture Type F","Sika Corporation"]
["72773-01","SIKA VISCOCRETE 1000 (Type A)",42101,"Admixture Type A","Sika Corporation",null,null,null,null,null,null,"72773-01","SIKA VISCOCRETE 1000",42101,"Admixture Type A","Sika Corporation"]
["72773-01","SIKA VISCOCRETE 1000 (Type F)",42106,"Admixture Type F","Sika Corporation",null,null,null,null,null,null,"72773-01","SIKA VISCOCRETE 1000",42106,"Admixture Type F","Sika Corporation"]
["72773-01","SIKASET NC (Type C)",42103,"Admixture Type C","Sika Corporation",null,null,null,null,null,null,"72773-01","SIKASET NC",42103,"Admixture Type C","Sika Corporation"]
[{"$f":"L471","v":"72785-01"},{"$f":"IF(ISNUMBER(SEARCH(\"Liquid\",O471)),M471,IF(ISNUMBER(SEARCH(\"Self\",O471)),M471&\" (SCC)\",IF(ISNUMBER(SEARCH(\"Corrosion\",O471)),M471&\" (CI)\",IF(ISNUMBER(SEARCH(\"Type\",O471)),M471&\" (\"&REPLACE(O471,1,10,\"\")&\")\",M471))))","v":"TRINSEO MODIFIER A/NA"},{"$f":"N471","v":42301},{"$f":"O471","v":"Admixture Latex"},{"$f":"IF(ISNUMBER(SEARCH(\"Lyndhurst\",P471)),\"Sika Corporation\",P471)","v":"Trinseo - Midland, MI"},null,null,null,null,null,null,"72785-01","TRINSEO MODIFIER A/NA",42301,"Admixture Latex","Trinseo - Midland, MI"]

{"sheet":"MACROFIBER PRODUCER","index":19,"n_rows":3,"n_cols":2,"rows_kept":3,"cut":false,"hidden":true,"merged":[]}
["Euclid Chemical - Cleveland, OH","72602-01"]
["Forta Corporation - Grove City, PA","72731-01"]
["Sika Corp. - Chattanooga, TN","72809-01"]

{"sheet":"MACROFIBER PRODUCT LIST","index":20,"n_rows":3,"n_cols":5,"rows_kept":3,"cut":false,"hidden":true,"merged":[]}
["72602-01","TUF-STRAND SF",38003,"Macrofibers For Concrete","Euclid Chemical - Cleveland, OH"]
["72731-01","FORTA-FERRO",38003,"Macrofibers For Concrete","Forta Corporation - Grove City, PA"]
["72809-01","SIKA FIBERMESH 650",38003,"Macrofibers For Concrete","Sika Corp. - Chattanooga, TN"]

{"sheet":"ADMIX PS LIST","index":21,"n_rows":16,"n_cols":2,"rows_kept":16,"cut":false,"hidden":true,"merged":[]}
["Chryso - Royse City, TX","72713-01"]
["Cortec Laboratories - St. Paul, MN","72716-01"]
["DarCole Products - Henderson, KY","72794-01"]
["Euclid Chemical - Cleveland, OH","72602-01"]
["Fritz-Pak Corporation - Mesquite, TX","72733-01"]
["GCP Applied Technologies - Wilmington, MA","72603-01"]
["Hycrete Tech","72740-01"]
["Ipa Systems","72742-01"]
["Krete Industries - Brookfield, WI","72808-01"]
["MAPEI Corporation - Deerfield Beach, FL","72735-01"]
["Master Builders Solutions Admix - Cleveland, OH","72600-01"]
["Occidental Chemical Corporation - Ludington, MI","72755-01"]
["Premiere Concrete Admixtures - Pioneer, OH","72764-01"]
["Russ Tech - Jeffersontown, KY","72608-01"]
["Sika Corporation","72773-01"]
["Trinseo - Midland, MI","72785-01"]